OCamllabs icon Home|Differences with the last checks|Previous runs


Building on x86-bm-6.ocamllabs.io

(from ocaml/opam:debian-unstable)
2021-10-21 02:07.22 ---> using "0acd5aeaa8f7bc314514d9795d14a7f12ec72a6a5b11c5904350189734c6859b" from cache

/: (user (uid 1000) (gid 1000))

/: (env OPAMPRECISETRACKING 1)

/: (env OPAMUTF8 never)

/: (env OPAMEXTERNALSOLVER builtin-0install)

/: (env OPAMCRITERIA +removed)

/: (run (shell "sudo ln -f /usr/bin/opam-2.1 /usr/bin/opam"))
2021-10-21 02:07.22 ---> using "4d29eb3e0b7cd69a97ed90837671d5ca38aa41e2fb94346298af500378eca6fa" from cache

/: (run (network host)
        (shell "rm -rf ~/opam-repository && git clone -q 'git://github.com/ocaml/opam-repository.git' ~/opam-repository && git -C ~/opam-repository checkout -q 53ec9a45898dcacb426391da813c036212d8d3e6"))
2021-10-21 02:07.22 ---> using "9e3c71f07cb8650e76491f4ea4380e82b420e7db844fb7309f51d1856544743c" from cache

/: (run (shell "rm -rf ~/.opam && opam init -ya --bare --config ~/.opamrc-sandbox ~/opam-repository"))
Configuring from /home/opam/.opamrc-sandbox, then /home/opam/.opamrc, and finally from built-in defaults.
Checking for available remotes: rsync and local, git.
  - you won't be able to use mercurial repositories unless you install the hg command on your system.
  - you won't be able to use darcs repositories unless you install the darcs command on your system.


<><> Fetching repository information ><><><><><><><><><><><><><><><><><><><><><>
[default] Initialised

User configuration:
  ~/.profile is already up-to-date.
[NOTE] Make sure that ~/.profile is well sourced in your ~/.bashrc.

2021-10-21 02:07.22 ---> using "27d1597f48f02b6b36c95df57225917e30e08bb54134379907bf74408f22b37a" from cache

/: (run (network host)
        (shell "git clone -q 'git://github.com/kit-ty-kate/multicore-opam.git' ~/'multicore' && git -C ~/'multicore' checkout -q f7d7c872ca1a40604219336dd1396c7873215005"))
2021-10-21 02:07.22 ---> using "6bddf57bc0a6e6d09869c0fa03a31ac63b5e62bd07859f843055286df02c2c0c" from cache

/: (run (shell "opam repository add --dont-select 'multicore' ~/'multicore'"))
[multicore] Initialised
2021-10-21 02:07.22 ---> using "848dc19b3061c50bbb8d2091adb8c29c6877c8906b6aeef2e1074d985eca8453" from cache

/: (run (cache (opam-archives (target /home/opam/.opam/download-cache)))
        (network host)
        (shell "opam switch create --repositories=multicore,default 4.12.0+domains"))

<><> Installing new switch packages <><><><><><><><><><><><><><><><><><><><><><>
Switch invariant: ["ocaml-variants" {= "4.12.0+domains"}]

<><> Processing actions <><><><><><><><><><><><><><><><><><><><><><><><><><><><>
-> installed base-bigarray.base
-> installed base-threads.base
-> installed base-unix.base
-> installed ocaml-option-nnp.1
-> retrieved ocaml-variants.4.12.0+domains  (git+https://github.com/ocaml-multicore/ocaml-multicore.git#4.12+domains)
-> installed ocaml-variants.4.12.0+domains
-> installed ocaml-config.2
-> installed ocaml.4.12.0
-> installed base-domains.base
Done.
# Run eval $(opam env --switch=4.12.0+domains) to update the current shell environment
2021-10-21 02:07.22 ---> using "8e60f9cc70092068cebe32e56566f7073d51ce412801d83b00ccafa9ad8bf65c" from cache

/: (run (network host)
        (shell "opam update --depexts"))
+ /usr/bin/sudo "apt-get" "update"
- Get:1 http://deb.debian.org/debian unstable InRelease [165 kB]
- Get:2 http://deb.debian.org/debian unstable/main amd64 Packages.diff/Index [63.6 kB]
- Ign:2 http://deb.debian.org/debian unstable/main amd64 Packages.diff/Index
- Get:3 http://deb.debian.org/debian unstable/main amd64 Packages [8783 kB]
- Fetched 9012 kB in 3s (2706 kB/s)
- Reading package lists...
- 
2021-10-21 02:07.22 ---> using "fdf68c1db8477369983d21b148ebdbbfbc3cba3dc256e3404592946f99978a13" from cache

/: (run (cache (opam-archives (target /home/opam/.opam/download-cache)))
        (network host)
        (shell  "\
               \nopam remove -y \"batsat.0.6\"\
               \nopam install -vy \"batsat.0.6\"\
               \nres=$?\
               \nif [ $res = 31 ]; then\
               \n    if opam show -f x-ci-accept-failures: \"batsat.0.6\" | grep -q '\"debian-unstable\"'; then\
               \n        echo \"This package failed and has been disabled for CI using the 'x-ci-accept-failures' field.\"\
               \n        exit 69\
               \n    fi\
               \nfi\
               \n\
               \nif [ $res = 0 ]; then\
               \n    opam remove -y \"batsat.0.6\"\
               \n    opam install -vty \"batsat.0.6\"\
               \n    res=$?\
               \n    if [ $res = 20 ]; then\
               \n        res=0\
               \n    fi\
               \nfi\
               \n\
               \n\
               \nexit $res\
               \n"))
[NOTE] batsat.0.6 is not installed.

Nothing to do.
The following actions will be performed:
  - install dune           2.9.1 [required by batsat]
  - install conf-rust-2018 1     [required by batsat]
  - install batsat         0.6
===== 3 to install =====

The following system packages will first need to be installed:
    cargo

<><> Handling external dependencies <><><><><><><><><><><><><><><><><><><><><><>
Let opam run your package manager to install the required system packages?
(answer 'n' for other options) [Y/n] y
+ /usr/bin/sudo "apt-get" "install" "-qq" "-yy" "cargo"
- debconf: delaying package configuration, since apt-utils is not installed
- (Reading database ... 
(Reading database ... 5%
(Reading database ... 10%
(Reading database ... 15%
(Reading database ... 20%
(Reading database ... 25%
(Reading database ... 30%
(Reading database ... 35%
(Reading database ... 40%
(Reading database ... 45%
(Reading database ... 50%
(Reading database ... 55%
(Reading database ... 60%
(Reading database ... 65%
(Reading database ... 70%
(Reading database ... 75%
(Reading database ... 80%
(Reading database ... 85%
(Reading database ... 90%
(Reading database ... 95%
(Reading database ... 100%
(Reading database ... 18039 files and directories currently installed.)
- Preparing to unpack .../libc6-dev_2.32-4_amd64.deb ...
- Unpacking libc6-dev:amd64 (2.32-4) over (2.31-15) ...
- Replacing files in old package libc6:amd64 (2.31-15) ...
- Preparing to unpack .../libc-dev-bin_2.32-4_amd64.deb ...
- Unpacking libc-dev-bin (2.32-4) over (2.31-15) ...
- Preparing to unpack .../libc6_2.32-4_amd64.deb ...
- Checking for services that may need to be restarted...
- 
- Checking init scripts...
- Unpacking libc6:amd64 (2.32-4) over (2.31-15) ...
- Setting up libc6:amd64 (2.32-4) ...
- Checking for services that may need to be restarted...
- Checking init scripts...
- Nothing to restart.
- (Reading database ... 
(Reading database ... 5%
(Reading database ... 10%
(Reading database ... 15%
(Reading database ... 20%
(Reading database ... 25%
(Reading database ... 30%
(Reading database ... 35%
(Reading database ... 40%
(Reading database ... 45%
(Reading database ... 50%
(Reading database ... 55%
(Reading database ... 60%
(Reading database ... 65%
(Reading database ... 70%
(Reading database ... 75%
(Reading database ... 80%
(Reading database ... 85%
(Reading database ... 90%
(Reading database ... 95%
(Reading database ... 100%
(Reading database ... 18035 files and directories currently installed.)
- Preparing to unpack .../libc-bin_2.32-4_amd64.deb ...
- Unpacking libc-bin (2.32-4) over (2.31-15) ...
- Setting up libc-bin (2.32-4) ...
- Selecting previously unselected package libpython3.9-minimal:amd64.
- (Reading database ... 
(Reading database ... 5%
(Reading database ... 10%
(Reading database ... 15%
(Reading database ... 20%
(Reading database ... 25%
(Reading database ... 30%
(Reading database ... 35%
(Reading database ... 40%
(Reading database ... 45%
(Reading database ... 50%
(Reading database ... 55%
(Reading database ... 60%
(Reading database ... 65%
(Reading database ... 70%
(Reading database ... 75%
(Reading database ... 80%
(Reading database ... 85%
(Reading database ... 90%
(Reading database ... 95%
(Reading database ... 100%
(Reading database ... 18035 files and directories currently installed.)
- Preparing to unpack .../libpython3.9-minimal_3.9.7-4_amd64.deb ...
- Unpacking libpython3.9-minimal:amd64 (3.9.7-4) ...
- Selecting previously unselected package python3.9-minimal.
- Preparing to unpack .../python3.9-minimal_3.9.7-4_amd64.deb ...
- Unpacking python3.9-minimal (3.9.7-4) ...
- Setting up libpython3.9-minimal:amd64 (3.9.7-4) ...
- Setting up python3.9-minimal (3.9.7-4) ...
- Selecting previously unselected package python3-minimal.
- (Reading database ... 
(Reading database ... 5%
(Reading database ... 10%
(Reading database ... 15%
(Reading database ... 20%
(Reading database ... 25%
(Reading database ... 30%
(Reading database ... 35%
(Reading database ... 40%
(Reading database ... 45%
(Reading database ... 50%
(Reading database ... 55%
(Reading database ... 60%
(Reading database ... 65%
(Reading database ... 70%
(Reading database ... 75%
(Reading database ... 80%
(Reading database ... 85%
(Reading database ... 90%
(Reading database ... 95%
(Reading database ... 100%
(Reading database ... 18320 files and directories currently installed.)
- Preparing to unpack .../00-python3-minimal_3.9.2-3_amd64.deb ...
- Unpacking python3-minimal (3.9.2-3) ...
- Selecting previously unselected package media-types.
- Preparing to unpack .../01-media-types_4.0.0_all.deb ...
- Unpacking media-types (4.0.0) ...
- Selecting previously unselected package libffi8:amd64.
- Preparing to unpack .../02-libffi8_3.4.2-3_amd64.deb ...
- Unpacking libffi8:amd64 (3.4.2-3) ...
- Preparing to unpack .../03-libasan6_11.2.0-9_amd64.deb ...
- Unpacking libasan6:amd64 (11.2.0-9) over (11.2.0-2) ...
- Preparing to unpack .../04-libubsan1_11.2.0-9_amd64.deb ...
- Unpacking libubsan1:amd64 (11.2.0-9) over (11.2.0-2) ...
- Preparing to unpack .../05-libtsan0_11.2.0-9_amd64.deb ...
- Unpacking libtsan0:amd64 (11.2.0-9) over (11.2.0-2) ...
- Preparing to unpack .../06-libquadmath0_11.2.0-9_amd64.deb ...
- Unpacking libquadmath0:amd64 (11.2.0-9) over (11.2.0-2) ...
- Preparing to unpack .../07-liblsan0_11.2.0-9_amd64.deb ...
- Unpacking liblsan0:amd64 (11.2.0-9) over (11.2.0-2) ...
- Preparing to unpack .../08-libitm1_11.2.0-9_amd64.deb ...
- Unpacking libitm1:amd64 (11.2.0-9) over (11.2.0-2) ...
- Preparing to unpack .../09-libgomp1_11.2.0-9_amd64.deb ...
- Unpacking libgomp1:amd64 (11.2.0-9) over (11.2.0-2) ...
- Preparing to unpack .../10-libcc1-0_11.2.0-9_amd64.deb ...
- Unpacking libcc1-0:amd64 (11.2.0-9) over (11.2.0-2) ...
- Preparing to unpack .../11-libatomic1_11.2.0-9_amd64.deb ...
- Unpacking libatomic1:amd64 (11.2.0-9) over (11.2.0-2) ...
- Preparing to unpack .../12-gcc-11-base_11.2.0-9_amd64.deb ...
- Unpacking gcc-11-base:amd64 (11.2.0-9) over (11.2.0-2) ...
- Setting up gcc-11-base:amd64 (11.2.0-9) ...
- (Reading database ... 
(Reading database ... 5%
(Reading database ... 10%
(Reading database ... 15%
(Reading database ... 20%
(Reading database ... 25%
(Reading database ... 30%
(Reading database ... 35%
(Reading database ... 40%
(Reading database ... 45%
(Reading database ... 50%
(Reading database ... 55%
(Reading database ... 60%
(Reading database ... 65%
(Reading database ... 70%
(Reading database ... 75%
(Reading database ... 80%
(Reading database ... 85%
(Reading database ... 90%
(Reading database ... 95%
(Reading database ... 100%
(Reading database ... 18352 files and directories currently installed.)
- Preparing to unpack .../libstdc++6_11.2.0-9_amd64.deb ...
- Unpacking libstdc++6:amd64 (11.2.0-9) over (10.2.1-6) ...
- Setting up libstdc++6:amd64 (11.2.0-9) ...
- Selecting previously unselected package libmpdec3:amd64.
- (Reading database ... 
(Reading database ... 5%
(Reading database ... 10%
(Reading database ... 15%
(Reading database ... 20%
(Reading database ... 25%
(Reading database ... 30%
(Reading database ... 35%
(Reading database ... 40%
(Reading database ... 45%
(Reading database ... 50%
(Reading database ... 55%
(Reading database ... 60%
(Reading database ... 65%
(Reading database ... 70%
(Reading database ... 75%
(Reading database ... 80%
(Reading database ... 85%
(Reading database ... 90%
(Reading database ... 95%
(Reading database ... 100%
(Reading database ... 18352 files and directories currently installed.)
- Preparing to unpack .../libmpdec3_2.5.1-2_amd64.deb ...
- Unpacking libmpdec3:amd64 (2.5.1-2) ...
- Preparing to unpack .../libncursesw6_6.2+20210905-1_amd64.deb ...
- Unpacking libncursesw6:amd64 (6.2+20210905-1) over (6.2+20201114-2) ...
- Preparing to unpack .../libtinfo6_6.2+20210905-1_amd64.deb ...
- Unpacking libtinfo6:amd64 (6.2+20210905-1) over (6.2+20201114-2) ...
- Setting up libtinfo6:amd64 (6.2+20210905-1) ...
- Selecting previously unselected package libpython3.9-stdlib:amd64.
- (Reading database ... 
(Reading database ... 5%
(Reading database ... 10%
(Reading database ... 15%
(Reading database ... 20%
(Reading database ... 25%
(Reading database ... 30%
(Reading database ... 35%
(Reading database ... 40%
(Reading database ... 45%
(Reading database ... 50%
(Reading database ... 55%
(Reading database ... 60%
(Reading database ... 65%
(Reading database ... 70%
(Reading database ... 75%
(Reading database ... 80%
(Reading database ... 85%
(Reading database ... 90%
(Reading database ... 95%
(Reading database ... 100%
(Reading database ... 18360 files and directories currently installed.)
- Preparing to unpack .../libpython3.9-stdlib_3.9.7-4_amd64.deb ...
- Unpacking libpython3.9-stdlib:amd64 (3.9.7-4) ...
- Selecting previously unselected package python3.9.
- Preparing to unpack .../python3.9_3.9.7-4_amd64.deb ...
- Unpacking python3.9 (3.9.7-4) ...
- Selecting previously unselected package libpython3-stdlib:amd64.
- Preparing to unpack .../libpython3-stdlib_3.9.2-3_amd64.deb ...
- Unpacking libpython3-stdlib:amd64 (3.9.2-3) ...
- Setting up python3-minimal (3.9.2-3) ...
- Selecting previously unselected package python3.
- (Reading database ... 
(Reading database ... 5%
(Reading database ... 10%
(Reading database ... 15%
(Reading database ... 20%
(Reading database ... 25%
(Reading database ... 30%
(Reading database ... 35%
(Reading database ... 40%
(Reading database ... 45%
(Reading database ... 50%
(Reading database ... 55%
(Reading database ... 60%
(Reading database ... 65%
(Reading database ... 70%
(Reading database ... 75%
(Reading database ... 80%
(Reading database ... 85%
(Reading database ... 90%
(Reading database ... 95%
(Reading database ... 100%
(Reading database ... 18723 files and directories currently installed.)
- Preparing to unpack .../00-python3_3.9.2-3_amd64.deb ...
- Unpacking python3 (3.9.2-3) ...
- Selecting previously unselected package libpipeline1:amd64.
- Preparing to unpack .../01-libpipeline1_1.5.3-1_amd64.deb ...
- Unpacking libpipeline1:amd64 (1.5.3-1) ...
- Selecting previously unselected package binfmt-support.
- Preparing to unpack .../02-binfmt-support_2.2.1-1_amd64.deb ...
- Unpacking binfmt-support (2.2.1-1) ...
- Selecting previously unselected package libhttp-parser2.9:amd64.
- Preparing to unpack .../03-libhttp-parser2.9_2.9.4-4_amd64.deb ...
- Unpacking libhttp-parser2.9:amd64 (2.9.4-4) ...
- Selecting previously unselected package libmbedcrypto3:amd64.
- Preparing to unpack .../04-libmbedcrypto3_2.16.9-0.1_amd64.deb ...
- Unpacking libmbedcrypto3:amd64 (2.16.9-0.1) ...
- Selecting previously unselected package libmbedx509-0:amd64.
- Preparing to unpack .../05-libmbedx509-0_2.16.9-0.1_amd64.deb ...
- Unpacking libmbedx509-0:amd64 (2.16.9-0.1) ...
- Selecting previously unselected package libmbedtls12:amd64.
- Preparing to unpack .../06-libmbedtls12_2.16.9-0.1_amd64.deb ...
- Unpacking libmbedtls12:amd64 (2.16.9-0.1) ...
- Selecting previously unselected package libgit2-1.1:amd64.
- Preparing to unpack .../07-libgit2-1.1_1.1.0+dfsg.1-4.1_amd64.deb ...
- Unpacking libgit2-1.1:amd64 (1.1.0+dfsg.1-4.1) ...
- Selecting previously unselected package libicu67:amd64.
- Preparing to unpack .../08-libicu67_67.1-7_amd64.deb ...
- Unpacking libicu67:amd64 (67.1-7) ...
- Selecting previously unselected package libxml2:amd64.
- Preparing to unpack .../09-libxml2_2.9.12+dfsg-5_amd64.deb ...
- Unpacking libxml2:amd64 (2.9.12+dfsg-5) ...
- Selecting previously unselected package libz3-4:amd64.
- Preparing to unpack .../10-libz3-4_4.8.12-1+b1_amd64.deb ...
- Unpacking libz3-4:amd64 (4.8.12-1+b1) ...
- Selecting previously unselected package libllvm12:amd64.
- Preparing to unpack .../11-libllvm12_1%3a12.0.1-12_amd64.deb ...
- Unpacking libllvm12:amd64 (1:12.0.1-12) ...
- Selecting previously unselected package libstd-rust-1.55:amd64.
- Preparing to unpack .../12-libstd-rust-1.55_1.55.0+dfsg1-2_amd64.deb ...
- Unpacking libstd-rust-1.55:amd64 (1.55.0+dfsg1-2) ...
- Selecting previously unselected package libstd-rust-dev:amd64.
- Preparing to unpack .../13-libstd-rust-dev_1.55.0+dfsg1-2_amd64.deb ...
- Unpacking libstd-rust-dev:amd64 (1.55.0+dfsg1-2) ...
- Selecting previously unselected package rustc.
- Preparing to unpack .../14-rustc_1.55.0+dfsg1-2_amd64.deb ...
- Unpacking rustc (1.55.0+dfsg1-2) ...
- Selecting previously unselected package cargo.
- Preparing to unpack .../15-cargo_0.47.0-3+b1_amd64.deb ...
- Unpacking cargo (0.47.0-3+b1) ...
- Selecting previously unselected package icu-devtools.
- Preparing to unpack .../16-icu-devtools_67.1-7_amd64.deb ...
- Unpacking icu-devtools (67.1-7) ...
- Selecting previously unselected package libclang-cpp12.
- Preparing to unpack .../17-libclang-cpp12_1%3a12.0.1-12_amd64.deb ...
- Unpacking libclang-cpp12 (1:12.0.1-12) ...
- Selecting previously unselected package libffi-dev:amd64.
- Preparing to unpack .../18-libffi-dev_3.4.2-3_amd64.deb ...
- Unpacking libffi-dev:amd64 (3.4.2-3) ...
- Selecting previously unselected package libicu-dev:amd64.
- Preparing to unpack .../19-libicu-dev_67.1-7_amd64.deb ...
- Unpacking libicu-dev:amd64 (67.1-7) ...
- Selecting previously unselected package libncurses6:amd64.
- Preparing to unpack .../20-libncurses6_6.2+20210905-1_amd64.deb ...
- Unpacking libncurses6:amd64 (6.2+20210905-1) ...
- Selecting previously unselected package libncurses-dev:amd64.
- Preparing to unpack .../21-libncurses-dev_6.2+20210905-1_amd64.deb ...
- Unpacking libncurses-dev:amd64 (6.2+20210905-1) ...
- Selecting previously unselected package libpfm4:amd64.
- Preparing to unpack .../22-libpfm4_4.11.1+git32-gd0b85fb-1_amd64.deb ...
- Unpacking libpfm4:amd64 (4.11.1+git32-gd0b85fb-1) ...
- Selecting previously unselected package libtinfo-dev:amd64.
- Preparing to unpack .../23-libtinfo-dev_6.2+20210905-1_amd64.deb ...
- Unpacking libtinfo-dev:amd64 (6.2+20210905-1) ...
- Selecting previously unselected package libxml2-dev:amd64.
- Preparing to unpack .../24-libxml2-dev_2.9.12+dfsg-5_amd64.deb ...
- Unpacking libxml2-dev:amd64 (2.9.12+dfsg-5) ...
- Selecting previously unselected package libyaml-0-2:amd64.
- Preparing to unpack .../25-libyaml-0-2_0.2.2-1_amd64.deb ...
- Unpacking libyaml-0-2:amd64 (0.2.2-1) ...
- Selecting previously unselected package libz3-dev:amd64.
- Preparing to unpack .../26-libz3-dev_4.8.12-1+b1_amd64.deb ...
- Unpacking libz3-dev:amd64 (4.8.12-1+b1) ...
- Selecting previously unselected package llvm-12-runtime.
- Preparing to unpack .../27-llvm-12-runtime_1%3a12.0.1-12_amd64.deb ...
- Unpacking llvm-12-runtime (1:12.0.1-12) ...
- Selecting previously unselected package llvm-12-linker-tools.
- Preparing to unpack .../28-llvm-12-linker-tools_1%3a12.0.1-12_amd64.deb ...
- Unpacking llvm-12-linker-tools (1:12.0.1-12) ...
- Selecting previously unselected package llvm-12.
- Preparing to unpack .../29-llvm-12_1%3a12.0.1-12_amd64.deb ...
- Unpacking llvm-12 (1:12.0.1-12) ...
- Selecting previously unselected package python3-pkg-resources.
- Preparing to unpack .../30-python3-pkg-resources_58.2.0-1_all.deb ...
- Unpacking python3-pkg-resources (58.2.0-1) ...
- Selecting previously unselected package python3-pygments.
- Preparing to unpack .../31-python3-pygments_2.7.1+dfsg-2.1_all.deb ...
- Unpacking python3-pygments (2.7.1+dfsg-2.1) ...
- Selecting previously unselected package python3-yaml.
- Preparing to unpack .../32-python3-yaml_5.4.1-1_amd64.deb ...
- Unpacking python3-yaml (5.4.1-1) ...
- Selecting previously unselected package llvm-12-tools.
- Preparing to unpack .../33-llvm-12-tools_1%3a12.0.1-12_amd64.deb ...
- Unpacking llvm-12-tools (1:12.0.1-12) ...
- Selecting previously unselected package llvm-12-dev.
- Preparing to unpack .../34-llvm-12-dev_1%3a12.0.1-12_amd64.deb ...
- Unpacking llvm-12-dev (1:12.0.1-12) ...
- Setting up media-types (4.0.0) ...
- Setting up libpipeline1:amd64 (1.5.3-1) ...
- Setting up libicu67:amd64 (67.1-7) ...
- Setting up libyaml-0-2:amd64 (0.2.2-1) ...
- Setting up libgomp1:amd64 (11.2.0-9) ...
- Setting up libasan6:amd64 (11.2.0-9) ...
- Setting up libz3-4:amd64 (4.8.12-1+b1) ...
- Setting up libpfm4:amd64 (4.11.1+git32-gd0b85fb-1) ...
- Setting up libncurses6:amd64 (6.2+20210905-1) ...
- Setting up libquadmath0:amd64 (11.2.0-9) ...
- Setting up libatomic1:amd64 (11.2.0-9) ...
- Setting up binfmt-support (2.2.1-1) ...
- invoke-rc.d: could not determine current runlevel
- invoke-rc.d: policy-rc.d denied execution of start.
- Setting up icu-devtools (67.1-7) ...
- Setting up libncursesw6:amd64 (6.2+20210905-1) ...
- Setting up libubsan1:amd64 (11.2.0-9) ...
- Setting up libffi8:amd64 (3.4.2-3) ...
- Setting up libmpdec3:amd64 (2.5.1-2) ...
- Setting up libmbedcrypto3:amd64 (2.16.9-0.1) ...
- Setting up libc-dev-bin (2.32-4) ...
- Setting up libxml2:amd64 (2.9.12+dfsg-5) ...
- Setting up libcc1-0:amd64 (11.2.0-9) ...
- Setting up liblsan0:amd64 (11.2.0-9) ...
- Setting up libitm1:amd64 (11.2.0-9) ...
- Setting up libhttp-parser2.9:amd64 (2.9.4-4) ...
- Setting up libpython3.9-stdlib:amd64 (3.9.7-4) ...
- Setting up libpython3-stdlib:amd64 (3.9.2-3) ...
- Setting up libtsan0:amd64 (11.2.0-9) ...
- Setting up libz3-dev:amd64 (4.8.12-1+b1) ...
- Setting up libmbedx509-0:amd64 (2.16.9-0.1) ...
- Setting up libmbedtls12:amd64 (2.16.9-0.1) ...
- Setting up libffi-dev:amd64 (3.4.2-3) ...
- Setting up libllvm12:amd64 (1:12.0.1-12) ...
- Setting up libstd-rust-1.55:amd64 (1.55.0+dfsg1-2) ...
- Setting up libc6-dev:amd64 (2.32-4) ...
- Setting up libicu-dev:amd64 (67.1-7) ...
- Setting up python3.9 (3.9.7-4) ...
- Setting up libncurses-dev:amd64 (6.2+20210905-1) ...
- Setting up libgit2-1.1:amd64 (1.1.0+dfsg.1-4.1) ...
- Setting up python3 (3.9.2-3) ...
- running python rtupdate hooks for python3.9...
- running python post-rtupdate hooks for python3.9...
- Setting up llvm-12-linker-tools (1:12.0.1-12) ...
- Setting up libstd-rust-dev:amd64 (1.55.0+dfsg1-2) ...
- Setting up libxml2-dev:amd64 (2.9.12+dfsg-5) ...
- Setting up llvm-12-runtime (1:12.0.1-12) ...
- /usr/bin/which: this version of 'which' is deprecated and should not be used.
- Setting up libclang-cpp12 (1:12.0.1-12) ...
- Setting up rustc (1.55.0+dfsg1-2) ...
- Setting up python3-pkg-resources (58.2.0-1) ...
- Setting up libtinfo-dev:amd64 (6.2+20210905-1) ...
- Setting up llvm-12 (1:12.0.1-12) ...
- Setting up python3-yaml (5.4.1-1) ...
- Setting up cargo (0.47.0-3+b1) ...
- Setting up python3-pygments (2.7.1+dfsg-2.1) ...
- Setting up llvm-12-tools (1:12.0.1-12) ...
- Setting up llvm-12-dev (1:12.0.1-12) ...
- Processing triggers for libc-bin (2.32-4) ...

<><> Processing actions <><><><><><><><><><><><><><><><><><><><><><><><><><><><>
Processing  1/9:
Processing  2/9:
Processing  3/9:
Processing  4/9: [conf-rust-2018: cargo]
-> retrieved batsat.0.6  (cached)
-> retrieved dune.2.9.1  (cached)
Processing  5/9: [conf-rust-2018: cargo] [dune: ocaml bootstrap.ml]
+ /home/opam/.opam/opam-init/hooks/sandbox.sh "build" "cargo" "--version" (CWD=/home/opam/.opam/4.12.0+domains/.opam-switch/build/conf-rust-2018.1)
- cargo 1.46.0
- cargo 1.46.0
Processing  5/9: [conf-rust-2018: rustc 2018] [dune: ocaml bootstrap.ml]
+ /home/opam/.opam/opam-init/hooks/sandbox.sh "build" "rustc" "--edition" "2018" "test.rs" (CWD=/home/opam/.opam/4.12.0+domains/.opam-switch/build/conf-rust-2018.1)
-> compiled  conf-rust-2018.1
Processing  5/9: [dune: ocaml bootstrap.ml]
-> installed conf-rust-2018.1
Processing  6/9: [dune: ocaml bootstrap.ml]
+ /home/opam/.opam/opam-init/hooks/sandbox.sh "build" "ocaml" "bootstrap.ml" "-j" "31" (CWD=/home/opam/.opam/4.12.0+domains/.opam-switch/build/dune.2.9.1)
- ocamlc -output-complete-exe -w -24 -g -o .duneboot.exe -I boot unix.cma boot/libs.ml boot/duneboot.ml
- ./.duneboot.exe -j 31
- 

Processing  6/9: [dune: ./dune.exe build]
+ /home/opam/.opam/opam-init/hooks/sandbox.sh "build" "./dune.exe" "build" "-p" "dune" "--profile" "dune-bootstrap" "-j" "31" (CWD=/home/opam/.opam/4.12.0+domains/.opam-switch/build/dune.2.9.1)
-> compiled  dune.2.9.1
-> installed dune.2.9.1
Processing  8/9: [batsat: dune build]
+ /home/opam/.opam/opam-init/hooks/sandbox.sh "build" "dune" "build" "-p" "batsat" "-j" "31" (CWD=/home/opam/.opam/4.12.0+domains/.opam-switch/build/batsat.0.6)
-         make src/libbatsat_stubs.a
-    Compiling proc-macro2 v1.0.12
-    Compiling unicode-xid v0.2.0
-    Compiling syn v1.0.19
-    Compiling ocaml-sys v0.12.2
-    Compiling cty v0.2.1
-    Compiling bit-vec v0.5.1
-    Compiling batsat v0.5.0
-    Compiling quote v1.0.4
-    Compiling synstructure v0.12.3
-    Compiling ocaml-derive v0.12.1
-    Compiling ocaml v0.12.3
-    Compiling batsat-stubs v0.1.0 (/home/opam/.opam/4.12.0+domains/.opam-switch/build/batsat.0.6/_build/default)
-     Finished release [optimized + debuginfo] target(s) in 3m 21s
-> compiled  batsat.0.6
-> installed batsat.0.6
Done.
# Run eval $(opam env) to update the current shell environment
The following actions will be performed:
  - remove batsat 0.6

<><> Processing actions <><><><><><><><><><><><><><><><><><><><><><><><><><><><>
-> removed   batsat.0.6
Done.
# Run eval $(opam env) to update the current shell environment
The following actions will be performed:
  - install batsat 0.6

<><> Processing actions <><><><><><><><><><><><><><><><><><><><><><><><><><><><>
Processing  1/3:
-> retrieved batsat.0.6  (cached)
Processing  2/3: [batsat: dune build]
+ /home/opam/.opam/opam-init/hooks/sandbox.sh "build" "dune" "build" "-p" "batsat" "-j" "31" (CWD=/home/opam/.opam/4.12.0+domains/.opam-switch/build/batsat.0.6)
-         make src/libbatsat_stubs.a
-    Compiling proc-macro2 v1.0.12
-    Compiling unicode-xid v0.2.0
-    Compiling syn v1.0.19
-    Compiling ocaml-sys v0.12.2
-    Compiling cty v0.2.1
-    Compiling bit-vec v0.5.1
-    Compiling batsat v0.5.0
-    Compiling quote v1.0.4
-    Compiling synstructure v0.12.3
-    Compiling ocaml-derive v0.12.1
-    Compiling ocaml v0.12.3
-    Compiling batsat-stubs v0.1.0 (/home/opam/.opam/4.12.0+domains/.opam-switch/build/batsat.0.6/_build/default)
-     Finished release [optimized + debuginfo] target(s) in 3m 28s
Processing  2/3: [batsat: dune runtest]
+ /home/opam/.opam/opam-init/hooks/sandbox.sh "build" "dune" "runtest" "-p" "batsat" "-j" "31" (CWD=/home/opam/.opam/4.12.0+domains/.opam-switch/build/batsat.0.6)
-     ocamlopt tests/test1.exe (exit 2)
- (cd _build/default && /home/opam/.opam/4.12.0+domains/bin/ocamlopt.opt -w -40 -w @8 -safe-string -g -o tests/test1.exe /home/opam/.opam/4.12.0+domains/lib/ocaml/unix.cmxa -I /home/opam/.opam/4.12.0+domains/lib/ocaml /home/opam/.opam/4.12.0+domains/lib/ocaml/threads/threads.cmxa -I /home/opam/.opam/4.12.0+domains/lib/ocaml src/batsat.cmxa -I src tests/.test1.eobjs/native/test1.cmx)
- /usr/bin/ld: Caml_state: TLS reference in /home/opam/.opam/4.12.0+domains/lib/ocaml/libthreadsnat.a(st_stubs.n.o) mismatches non-TLS reference in src/libbatsat_stubs.a(batsat_stubs.batsat_stubs.44b67db7-cgu.4.rcgu.o)
- /usr/bin/ld: /home/opam/.opam/4.12.0+domains/lib/ocaml/libthreadsnat.a: error adding symbols: bad value
- collect2: error: ld returned 1 exit status
- File "caml_startup", line 1:
- Error: Error during linking (exit code 1)
[ERROR] The compilation of batsat.0.6 failed at "dune runtest -p batsat -j 31".

#=== ERROR while compiling batsat.0.6 =========================================#
# context              2.1.0 | linux/x86_64 | ocaml-variants.4.12.0+domains | file:///home/opam/opam-repository
# path                 ~/.opam/4.12.0+domains/.opam-switch/build/batsat.0.6
# command              ~/.opam/opam-init/hooks/sandbox.sh build dune runtest -p batsat -j 31
# exit-code            1
# env-file             ~/.opam/log/batsat-3237-a54f85.env
# output-file          ~/.opam/log/batsat-3237-a54f85.out
### output ###
#     ocamlopt tests/test1.exe (exit 2)
# (cd _build/default && /home/opam/.opam/4.12.0+domains/bin/ocamlopt.opt -w -40 -w @8 -safe-string -g -o tests/test1.exe /home/opam/.opam/4.12.0+domains/lib/ocaml/unix.cmxa -I /home/opam/.opam/4.12.0+domains/lib/ocaml /home/opam/.opam/4.12.0+domains/lib/ocaml/threads/threads.cmxa -I /home/opam/.opam/4.12.0+domains/lib/ocaml src/batsat.cmxa -I src tests/.test1.eobjs/native/test1.cmx)
# /usr/bin/ld: Caml_state: TLS reference in /home/opam/.opam/4.12.0+domains/lib/ocaml/libthreadsnat.a(st_stubs.n.o) mismatches non-TLS reference in src/libbatsat_stubs.a(batsat_stubs.batsat_stubs.44b67db7-cgu.4.rcgu.o)
# /usr/bin/ld: /home/opam/.opam/4.12.0+domains/lib/ocaml/libthreadsnat.a: error adding symbols: bad value
# collect2: error: ld returned 1 exit status
# File "caml_startup", line 1:
# Error: Error during linking (exit code 1)



<><> Error report <><><><><><><><><><><><><><><><><><><><><><><><><><><><><><><>
+- The following actions failed
| - build batsat 0.6
+- 
- No changes have been performed
# Run eval $(opam env) to update the current shell environment
'opam install -vty batsat.0.6' failed.
"/bin/bash" "-c"
"
opam remove -y "batsat.0.6"
opam install -vy "batsat.0.6"
res=$?
if [ $res = 31 ]; then
    if opam show -f x-ci-accept-failures: "batsat.0.6" | grep -q '"debian-unstable"'; then
        echo "This package failed and has been disabled for CI using the 'x-ci-accept-failures' field."
        exit 69
    fi
fi

if [ $res = 0 ]; then
    opam remove -y "batsat.0.6"
    opam install -vty "batsat.0.6"
    res=$?
    if [ $res = 20 ]; then
        res=0
    fi
fi


exit $res
" failed with exit status 31
Failed: Build failed