OCamllabs icon Home|Differences with the last checks|Previous runs


Building on cree.ocamllabs.io

(from ocaml/opam:debian-unstable@sha256:ca0a0544477c6a9a763f100587b518646c93ce73d78874d823b27e8f935bb951)
Unable to find image 'ocaml/opam:debian-unstable@sha256:ca0a0544477c6a9a763f100587b518646c93ce73d78874d823b27e8f935bb951' locally
docker.io/ocaml/opam@sha256:ca0a0544477c6a9a763f100587b518646c93ce73d78874d823b27e8f935bb951: Pulling from ocaml/opam
4ab10c654db5: Pulling fs layer
4ab10c654db5: Verifying Checksum
4ab10c654db5: Download complete
4ab10c654db5: Pull complete
Digest: sha256:ca0a0544477c6a9a763f100587b518646c93ce73d78874d823b27e8f935bb951
Status: Downloaded newer image for ocaml/opam@sha256:ca0a0544477c6a9a763f100587b518646c93ce73d78874d823b27e8f935bb951
2023-01-16 12:38.32 ---> using "94874f478e26ede84037b9b3ffc4aac7c83b2542bbac8788a2cc7da937a47054" from cache

/: (user (uid 1000) (gid 1000))

/: (env OPAMPRECISETRACKING 1)

/: (env OPAMUTF8 never)

/: (env OPAMEXTERNALSOLVER builtin-0install)

/: (env OPAMCRITERIA +removed)

/: (run (shell "sudo ln -f /usr/bin/opam-dev /usr/bin/opam"))
2023-01-16 12:38.32 ---> using "e2ed8ca10c7e97a3eeacb1721604176c2efe0af3ca6e435d47ef0dd2f6bd15ce" from cache

/: (run (network host)
        (shell "rm -rf ~/opam-repository && git clone -q 'https://github.com/ocaml/opam-repository' ~/opam-repository && git -C ~/opam-repository checkout -q e0171a799fbb4458db77a10f76a6279727aac521"))
2023-01-16 12:38.32 ---> using "3864620b78a5bfd4a34825831d954f85d91d614ee4f51a2a653199fcbdb63f63" from cache

/: (run (shell "rm -rf ~/.opam && opam init -ya --bare --config ~/.opamrc-sandbox ~/opam-repository"))
Configuring from /home/opam/.opamrc-sandbox, then /home/opam/.opamrc, and finally from built-in defaults.
Checking for available remotes: rsync and local, git.
  - you won't be able to use mercurial repositories unless you install the hg command on your system.
  - you won't be able to use darcs repositories unless you install the darcs command on your system.


<><> Fetching repository information ><><><><><><><><><><><><><><><><><><><><><>
[default] Initialised

User configuration:
  ~/.profile is already up-to-date.
[NOTE] Make sure that ~/.profile is well sourced in your ~/.bashrc.

2023-01-16 12:38.32 ---> using "4e975791caadc63ea7aadc58806396bb379155c55894dc8ed37de19ce13ba00b" from cache

/: (run (cache (opam-archives (target /home/opam/.opam/download-cache)))
        (network host)
        (shell "opam switch create --repositories=default '5.1' '5.1.0+trunk'"))

<><> Installing new switch packages <><><><><><><><><><><><><><><><><><><><><><>
Switch invariant: ["ocaml-variants" {= "5.1.0+trunk"}]

<><> Processing actions <><><><><><><><><><><><><><><><><><><><><><><><><><><><>
-> installed base-bigarray.base
-> installed base-threads.base
-> installed base-unix.base
-> retrieved ocaml-variants.5.1.0+trunk  (https://github.com/ocaml/ocaml/archive/trunk.tar.gz)
-> installed ocaml-variants.5.1.0+trunk
-> installed ocaml-config.3
-> installed ocaml.5.1.0
-> installed base-domains.base
-> installed base-nnp.base
Done.
# Run eval $(opam env --switch=5.1) to update the current shell environment
2023-01-16 12:38.32 ---> using "1a9eb5e7f5c7386ab6bc96ce04ac8e6c5d9d8c68403bd67e5ea7158485ffab84" from cache

/: (run (network host)
        (shell "opam update --depexts"))
+ /usr/bin/sudo "apt-get" "update"
- Get:1 http://deb.debian.org/debian unstable InRelease [161 kB]
- Get:2 http://deb.debian.org/debian unstable/main amd64 Packages.diff/Index [63.6 kB]
- Get:3 http://deb.debian.org/debian unstable/main amd64 Packages T-2023-01-14-0804.37-F-2023-01-13-2043.11.pdiff [63.8 kB]
- Get:3 http://deb.debian.org/debian unstable/main amd64 Packages T-2023-01-14-0804.37-F-2023-01-13-2043.11.pdiff [63.8 kB]
- Fetched 289 kB in 2s (160 kB/s)
- Reading package lists...
- 
2023-01-16 12:38.32 ---> using "6db3368afb7eb8f3aed80233260d7b0c18ee4c4c2d75df31e9d439f60de86758" from cache

/: (run (cache (opam-archives (target /home/opam/.opam/download-cache)))
        (network host)
        (shell  "\
               \nopam remove -y \"altgr-ergo.2.4.2\"\
               \nopam install -vy \"altgr-ergo.2.4.2\"\
               \nres=$?\
               \nif [ $res = 31 ]; then\
               \n    if opam show -f x-ci-accept-failures: \"altgr-ergo.2.4.2\" | grep -q '\"debian-unstable\"'; then\
               \n        echo \"This package failed and has been disabled for CI using the 'x-ci-accept-failures' field.\"\
               \n        exit 69\
               \n    fi\
               \nfi\
               \n\
               \n\
               \nexit $res\
               \n"))
Nothing to do.
[NOTE] altgr-ergo.2.4.2 is not installed.

The following actions will be performed:
=== install 30 packages
  - install alt-ergo-lib         2.4.2    [required by altgr-ergo]
  - install alt-ergo-parsers     2.4.2    [required by altgr-ergo]
  - install altgr-ergo           2.4.2
  - install cairo2               0.6.4    [required by lablgtk3]
  - install camlp-streams        5.0.1    [required by lablgtk3, lablgtk3-sourceview3]
  - install camlzip              1.11     [required by alt-ergo-parsers]
  - install cmdliner             1.1.1    [required by altgr-ergo]
  - install conf-autoconf        0.1      [required by ocplib-simplex]
  - install conf-cairo           1        [required by cairo2]
  - install conf-gmp             4        [required by zarith]
  - install conf-gtk3            18       [required by lablgtk3]
  - install conf-gtksourceview3  0+2      [required by altgr-ergo]
  - install conf-pkg-config      2        [required by conf-gtksourceview3]
  - install conf-which           1        [required by conf-autoconf]
  - install conf-zlib            1        [required by camlzip]
  - install csexp                1.5.1    [required by dune-configurator]
  - install dune                 3.6.1    [required by altgr-ergo]
  - install dune-configurator    3.6.1    [required by alt-ergo-lib]
  - install lablgtk3             3.1.3    [required by altgr-ergo]
  - install lablgtk3-sourceview3 3.1.3    [required by altgr-ergo]
  - install menhir               20220210 [required by alt-ergo-parsers]
  - install menhirLib            20220210 [required by menhir]
  - install menhirSdk            20220210 [required by menhir]
  - install num                  1.4      [required by alt-ergo-lib]
  - install ocamlfind            1.9.5    [required by zarith, num, ocplib-simplex, camlzip]
  - install ocplib-simplex       0.4      [required by alt-ergo-lib]
  - install psmt2-frontend       0.4.0    [required by alt-ergo-parsers]
  - install seq                  base     [required by alt-ergo-lib]
  - install stdlib-shims         0.3.0    [required by alt-ergo-lib, alt-ergo-parsers]
  - install zarith               1.12     [required by alt-ergo-lib]

The following system packages will first need to be installed:
    autoconf libcairo2-dev libexpat1-dev libgmp-dev libgtk-3-dev libgtksourceview-3.0-dev pkg-config zlib1g-dev

<><> Handling external dependencies <><><><><><><><><><><><><><><><><><><><><><>

opam believes some required external dependencies are missing. opam can:
> 1. Run apt-get to install them (may need root/sudo access)
  2. Display the recommended apt-get command and wait while you run it manually (e.g. in another terminal)
  3. Attempt installation anyway, and permanently register that this external dependency is present, but not detectable
  4. Abort the installation

[1/2/3/4] 1

+ /usr/bin/sudo "apt-get" "install" "-qq" "-yy" "autoconf" "libcairo2-dev" "libexpat1-dev" "libgmp-dev" "libgtk-3-dev" "libgtksourceview-3.0-dev" "pkg-config" "zlib1g-dev"
- debconf: delaying package configuration, since apt-utils is not installed
- Selecting previously unselected package libargon2-1:amd64.
- (Reading database ... 
(Reading database ... 5%
(Reading database ... 10%
(Reading database ... 15%
(Reading database ... 20%
(Reading database ... 25%
(Reading database ... 30%
(Reading database ... 35%
(Reading database ... 40%
(Reading database ... 45%
(Reading database ... 50%
(Reading database ... 55%
(Reading database ... 60%
(Reading database ... 65%
(Reading database ... 70%
(Reading database ... 75%
(Reading database ... 80%
(Reading database ... 85%
(Reading database ... 90%
(Reading database ... 95%
(Reading database ... 100%
(Reading database ... 18671 files and directories currently installed.)
- Preparing to unpack .../00-libargon2-1_0~20171227-0.3_amd64.deb ...
- Unpacking libargon2-1:amd64 (0~20171227-0.3) ...
- Selecting previously unselected package dmsetup.
- Preparing to unpack .../01-dmsetup_2%3a1.02.185-2_amd64.deb ...
- Unpacking dmsetup (2:1.02.185-2) ...
- Selecting previously unselected package libdevmapper1.02.1:amd64.
- Preparing to unpack .../02-libdevmapper1.02.1_2%3a1.02.185-2_amd64.deb ...
- Unpacking libdevmapper1.02.1:amd64 (2:1.02.185-2) ...
- Selecting previously unselected package libjson-c5:amd64.
- Preparing to unpack .../03-libjson-c5_0.16-2_amd64.deb ...
- Unpacking libjson-c5:amd64 (0.16-2) ...
- Selecting previously unselected package libcryptsetup12:amd64.
- Preparing to unpack .../04-libcryptsetup12_2%3a2.6.0-2_amd64.deb ...
- Unpacking libcryptsetup12:amd64 (2:2.6.0-2) ...
- Selecting previously unselected package libfdisk1:amd64.
- Preparing to unpack .../05-libfdisk1_2.38.1-4_amd64.deb ...
- Unpacking libfdisk1:amd64 (2.38.1-4) ...
- Selecting previously unselected package libkmod2:amd64.
- Preparing to unpack .../06-libkmod2_30+20221128-1_amd64.deb ...
- Unpacking libkmod2:amd64 (30+20221128-1) ...
- Selecting previously unselected package libapparmor1:amd64.
- Preparing to unpack .../07-libapparmor1_3.0.8-1_amd64.deb ...
- Unpacking libapparmor1:amd64 (3.0.8-1) ...
- Selecting previously unselected package libip4tc2:amd64.
- Preparing to unpack .../08-libip4tc2_1.8.8-1_amd64.deb ...
- Unpacking libip4tc2:amd64 (1.8.8-1) ...
- Selecting previously unselected package libsystemd-shared:amd64.
- Preparing to unpack .../09-libsystemd-shared_252.4-1_amd64.deb ...
- Unpacking libsystemd-shared:amd64 (252.4-1) ...
- Selecting previously unselected package systemd.
- Preparing to unpack .../10-systemd_252.4-1_amd64.deb ...
- Unpacking systemd (252.4-1) ...
- Setting up libargon2-1:amd64 (0~20171227-0.3) ...
- Setting up libjson-c5:amd64 (0.16-2) ...
- Setting up libfdisk1:amd64 (2.38.1-4) ...
- Setting up libkmod2:amd64 (30+20221128-1) ...
- Setting up libapparmor1:amd64 (3.0.8-1) ...
- Setting up libip4tc2:amd64 (1.8.8-1) ...
- Setting up libsystemd-shared:amd64 (252.4-1) ...
- Setting up libdevmapper1.02.1:amd64 (2:1.02.185-2) ...
- Setting up libcryptsetup12:amd64 (2:2.6.0-2) ...
- Setting up systemd (252.4-1) ...
- Created symlink /etc/systemd/system/getty.target.wants/getty@tty1.service → /lib/systemd/system/getty@.service.
- Created symlink /etc/systemd/system/multi-user.target.wants/remote-fs.target → /lib/systemd/system/remote-fs.target.
- Created symlink /etc/systemd/system/sysinit.target.wants/systemd-pstore.service → /lib/systemd/system/systemd-pstore.service.
- Initializing machine ID from random generator.
- Creating group 'systemd-journal' with GID 999.
- Creating group 'systemd-network' with GID 998.
- Creating user 'systemd-network' (systemd Network Management) with UID 998 and GID 998.
- Setting up dmsetup (2:1.02.185-2) ...
- Selecting previously unselected package systemd-sysv.
- (Reading database ... 
(Reading database ... 5%
(Reading database ... 10%
(Reading database ... 15%
(Reading database ... 20%
(Reading database ... 25%
(Reading database ... 30%
(Reading database ... 35%
(Reading database ... 40%
(Reading database ... 45%
(Reading database ... 50%
(Reading database ... 55%
(Reading database ... 60%
(Reading database ... 65%
(Reading database ... 70%
(Reading database ... 75%
(Reading database ... 80%
(Reading database ... 85%
(Reading database ... 90%
(Reading database ... 95%
(Reading database ... 100%
(Reading database ... 19576 files and directories currently installed.)
- Preparing to unpack .../0-systemd-sysv_252.4-1_amd64.deb ...
- Unpacking systemd-sysv (252.4-1) ...
- Selecting previously unselected package libdbus-1-3:amd64.
- Preparing to unpack .../1-libdbus-1-3_1.14.4-1_amd64.deb ...
- Unpacking libdbus-1-3:amd64 (1.14.4-1) ...
- Selecting previously unselected package dbus-bin.
- Preparing to unpack .../2-dbus-bin_1.14.4-1_amd64.deb ...
- Unpacking dbus-bin (1.14.4-1) ...
- Selecting previously unselected package dbus-session-bus-common.
- Preparing to unpack .../3-dbus-session-bus-common_1.14.4-1_all.deb ...
- Unpacking dbus-session-bus-common (1.14.4-1) ...
- Selecting previously unselected package dbus-daemon.
- Preparing to unpack .../4-dbus-daemon_1.14.4-1_amd64.deb ...
- Unpacking dbus-daemon (1.14.4-1) ...
- Selecting previously unselected package dbus-system-bus-common.
- Preparing to unpack .../5-dbus-system-bus-common_1.14.4-1_all.deb ...
- Unpacking dbus-system-bus-common (1.14.4-1) ...
- Selecting previously unselected package dbus.
- Preparing to unpack .../6-dbus_1.14.4-1_amd64.deb ...
- Unpacking dbus (1.14.4-1) ...
- Selecting previously unselected package libpython3.11-minimal:amd64.
- Preparing to unpack .../7-libpython3.11-minimal_3.11.1-2_amd64.deb ...
- Unpacking libpython3.11-minimal:amd64 (3.11.1-2) ...
- Selecting previously unselected package python3.11-minimal.
- Preparing to unpack .../8-python3.11-minimal_3.11.1-2_amd64.deb ...
- Unpacking python3.11-minimal (3.11.1-2) ...
- Setting up libpython3.11-minimal:amd64 (3.11.1-2) ...
- Setting up python3.11-minimal (3.11.1-2) ...
- Selecting previously unselected package python3-minimal.
- (Reading database ... 
(Reading database ... 5%
(Reading database ... 10%
(Reading database ... 15%
(Reading database ... 20%
(Reading database ... 25%
(Reading database ... 30%
(Reading database ... 35%
(Reading database ... 40%
(Reading database ... 45%
(Reading database ... 50%
(Reading database ... 55%
(Reading database ... 60%
(Reading database ... 65%
(Reading database ... 70%
(Reading database ... 75%
(Reading database ... 80%
(Reading database ... 85%
(Reading database ... 90%
(Reading database ... 95%
(Reading database ... 100%
(Reading database ... 19974 files and directories currently installed.)
- Preparing to unpack .../0-python3-minimal_3.11.1-1_amd64.deb ...
- Unpacking python3-minimal (3.11.1-1) ...
- Selecting previously unselected package media-types.
- Preparing to unpack .../1-media-types_8.0.0_all.deb ...
- Unpacking media-types (8.0.0) ...
- Selecting previously unselected package libmpdec3:amd64.
- Preparing to unpack .../2-libmpdec3_2.5.1-2_amd64.deb ...
- Unpacking libmpdec3:amd64 (2.5.1-2) ...
- Selecting previously unselected package libpython3.11-stdlib:amd64.
- Preparing to unpack .../3-libpython3.11-stdlib_3.11.1-2_amd64.deb ...
- Unpacking libpython3.11-stdlib:amd64 (3.11.1-2) ...
- Selecting previously unselected package python3.11.
- Preparing to unpack .../4-python3.11_3.11.1-2_amd64.deb ...
- Unpacking python3.11 (3.11.1-2) ...
- Selecting previously unselected package libpython3-stdlib:amd64.
- Preparing to unpack .../5-libpython3-stdlib_3.11.1-1_amd64.deb ...
- Unpacking libpython3-stdlib:amd64 (3.11.1-1) ...
- Setting up python3-minimal (3.11.1-1) ...
- Selecting previously unselected package python3.
- (Reading database ... 
(Reading database ... 5%
(Reading database ... 10%
(Reading database ... 15%
(Reading database ... 20%
(Reading database ... 25%
(Reading database ... 30%
(Reading database ... 35%
(Reading database ... 40%
(Reading database ... 45%
(Reading database ... 50%
(Reading database ... 55%
(Reading database ... 60%
(Reading database ... 65%
(Reading database ... 70%
(Reading database ... 75%
(Reading database ... 80%
(Reading database ... 85%
(Reading database ... 90%
(Reading database ... 95%
(Reading database ... 100%
(Reading database ... 20387 files and directories currently installed.)
- Preparing to unpack .../000-python3_3.11.1-1_amd64.deb ...
- Unpacking python3 (3.11.1-1) ...
- Selecting previously unselected package sgml-base.
- Preparing to unpack .../001-sgml-base_1.31_all.deb ...
- Unpacking sgml-base (1.31) ...
- Selecting previously unselected package libnss-systemd:amd64.
- Preparing to unpack .../002-libnss-systemd_252.4-1_amd64.deb ...
- Unpacking libnss-systemd:amd64 (252.4-1) ...
- Selecting previously unselected package libpam-systemd:amd64.
- Preparing to unpack .../003-libpam-systemd_252.4-1_amd64.deb ...
- Unpacking libpam-systemd:amd64 (252.4-1) ...
- Selecting previously unselected package systemd-timesyncd.
- Preparing to unpack .../004-systemd-timesyncd_252.4-1_amd64.deb ...
- Unpacking systemd-timesyncd (252.4-1) ...
- Selecting previously unselected package hicolor-icon-theme.
- Preparing to unpack .../005-hicolor-icon-theme_0.17-2_all.deb ...
- Unpacking hicolor-icon-theme (0.17-2) ...
- Selecting previously unselected package libgdk-pixbuf2.0-common.
- Preparing to unpack .../006-libgdk-pixbuf2.0-common_2.42.10+dfsg-1_all.deb ...
- Unpacking libgdk-pixbuf2.0-common (2.42.10+dfsg-1) ...
- Selecting previously unselected package libglib2.0-0:amd64.
- Preparing to unpack .../007-libglib2.0-0_2.74.4-1_amd64.deb ...
- Unpacking libglib2.0-0:amd64 (2.74.4-1) ...
- Selecting previously unselected package libicu72:amd64.
- Preparing to unpack .../008-libicu72_72.1-3_amd64.deb ...
- Unpacking libicu72:amd64 (72.1-3) ...
- Selecting previously unselected package libxml2:amd64.
- Preparing to unpack .../009-libxml2_2.9.14+dfsg-1.1+b2_amd64.deb ...
- Unpacking libxml2:amd64 (2.9.14+dfsg-1.1+b2) ...
- Selecting previously unselected package shared-mime-info.
- Preparing to unpack .../010-shared-mime-info_2.2-1_amd64.deb ...
- Unpacking shared-mime-info (2.2-1) ...
- Selecting previously unselected package libgdk-pixbuf-2.0-0:amd64.
- Preparing to unpack .../011-libgdk-pixbuf-2.0-0_2.42.10+dfsg-1+b1_amd64.deb ...
- Unpacking libgdk-pixbuf-2.0-0:amd64 (2.42.10+dfsg-1+b1) ...
- Selecting previously unselected package gtk-update-icon-cache.
- Preparing to unpack .../012-gtk-update-icon-cache_3.24.36-1_amd64.deb ...
- Unpacking gtk-update-icon-cache (3.24.36-1) ...
- Selecting previously unselected package adwaita-icon-theme.
- Preparing to unpack .../013-adwaita-icon-theme_43-1_all.deb ...
- Unpacking adwaita-icon-theme (43-1) ...
- Selecting previously unselected package at-spi2-common.
- Preparing to unpack .../014-at-spi2-common_2.46.0-4_all.deb ...
- Unpacking at-spi2-common (2.46.0-4) ...
- Selecting previously unselected package libxi6:amd64.
- Preparing to unpack .../015-libxi6_2%3a1.8-1+b1_amd64.deb ...
- Unpacking libxi6:amd64 (2:1.8-1+b1) ...
- Selecting previously unselected package libatspi2.0-0:amd64.
- Preparing to unpack .../016-libatspi2.0-0_2.46.0-4_amd64.deb ...
- Unpacking libatspi2.0-0:amd64 (2.46.0-4) ...
- Selecting previously unselected package x11-common.
- Preparing to unpack .../017-x11-common_1%3a7.7+23_all.deb ...
- Unpacking x11-common (1:7.7+23) ...
- Selecting previously unselected package libxtst6:amd64.
- Preparing to unpack .../018-libxtst6_2%3a1.2.3-1.1_amd64.deb ...
- Unpacking libxtst6:amd64 (2:1.2.3-1.1) ...
- Selecting previously unselected package dbus-user-session.
- Preparing to unpack .../019-dbus-user-session_1.14.4-1_amd64.deb ...
- Unpacking dbus-user-session (1.14.4-1) ...
- Selecting previously unselected package libdconf1:amd64.
- Preparing to unpack .../020-libdconf1_0.40.0-4_amd64.deb ...
- Unpacking libdconf1:amd64 (0.40.0-4) ...
- Selecting previously unselected package dconf-service.
- Preparing to unpack .../021-dconf-service_0.40.0-4_amd64.deb ...
- Unpacking dconf-service (0.40.0-4) ...
- Selecting previously unselected package dconf-gsettings-backend:amd64.
- Preparing to unpack .../022-dconf-gsettings-backend_0.40.0-4_amd64.deb ...
- Unpacking dconf-gsettings-backend:amd64 (0.40.0-4) ...
- Selecting previously unselected package gsettings-desktop-schemas.
- Preparing to unpack .../023-gsettings-desktop-schemas_43.0-1_all.deb ...
- Unpacking gsettings-desktop-schemas (43.0-1) ...
- Selecting previously unselected package at-spi2-core.
- Preparing to unpack .../024-at-spi2-core_2.46.0-4_amd64.deb ...
- Unpacking at-spi2-core (2.46.0-4) ...
- Selecting previously unselected package m4.
- Preparing to unpack .../025-m4_1.4.19-2_amd64.deb ...
- Unpacking m4 (1.4.19-2) ...
- Selecting previously unselected package autoconf.
- Preparing to unpack .../026-autoconf_2.71-2_all.deb ...
- Unpacking autoconf (2.71-2) ...
- Selecting previously unselected package autotools-dev.
- Preparing to unpack .../027-autotools-dev_20220109.1_all.deb ...
- Unpacking autotools-dev (20220109.1) ...
- Selecting previously unselected package automake.
- Preparing to unpack .../028-automake_1%3a1.16.5-1.3_all.deb ...
- Unpacking automake (1:1.16.5-1.3) ...
- Preparing to unpack .../029-fontconfig-config_2.14.1-3_amd64.deb ...
- Unpacking fontconfig-config (2.14.1-3) over (2.13.1-4.5) ...
- Preparing to unpack .../030-libfontconfig1_2.14.1-3_amd64.deb ...
- Unpacking libfontconfig1:amd64 (2.14.1-3) over (2.13.1-4.5) ...
- Selecting previously unselected package fontconfig.
- Preparing to unpack .../031-fontconfig_2.14.1-3_amd64.deb ...
- Unpacking fontconfig (2.14.1-3) ...
- Selecting previously unselected package libgirepository-1.0-1:amd64.
- Preparing to unpack .../032-libgirepository-1.0-1_1.74.0-2+b1_amd64.deb ...
- Unpacking libgirepository-1.0-1:amd64 (1.74.0-2+b1) ...
- Selecting previously unselected package gir1.2-glib-2.0:amd64.
- Preparing to unpack .../033-gir1.2-glib-2.0_1.74.0-2+b1_amd64.deb ...
- Unpacking gir1.2-glib-2.0:amd64 (1.74.0-2+b1) ...
- Selecting previously unselected package libatk1.0-0:amd64.
- Preparing to unpack .../034-libatk1.0-0_2.46.0-4_amd64.deb ...
- Unpacking libatk1.0-0:amd64 (2.46.0-4) ...
- Selecting previously unselected package gir1.2-atk-1.0:amd64.
- Preparing to unpack .../035-gir1.2-atk-1.0_2.46.0-4_amd64.deb ...
- Unpacking gir1.2-atk-1.0:amd64 (2.46.0-4) ...
- Selecting previously unselected package gir1.2-freedesktop:amd64.
- Preparing to unpack .../036-gir1.2-freedesktop_1.74.0-2+b1_amd64.deb ...
- Unpacking gir1.2-freedesktop:amd64 (1.74.0-2+b1) ...
- Selecting previously unselected package gir1.2-atspi-2.0:amd64.
- Preparing to unpack .../037-gir1.2-atspi-2.0_2.46.0-4_amd64.deb ...
- Unpacking gir1.2-atspi-2.0:amd64 (2.46.0-4) ...
- Selecting previously unselected package gir1.2-gdkpixbuf-2.0:amd64.
- Preparing to unpack .../038-gir1.2-gdkpixbuf-2.0_2.42.10+dfsg-1+b1_amd64.deb ...
- Unpacking gir1.2-gdkpixbuf-2.0:amd64 (2.42.10+dfsg-1+b1) ...
- Selecting previously unselected package gir1.2-harfbuzz-0.0:amd64.
- Preparing to unpack .../039-gir1.2-harfbuzz-0.0_6.0.0-1_amd64.deb ...
- Unpacking gir1.2-harfbuzz-0.0:amd64 (6.0.0-1) ...
- Selecting previously unselected package libfribidi0:amd64.
- Preparing to unpack .../040-libfribidi0_1.0.8-2.1_amd64.deb ...
- Unpacking libfribidi0:amd64 (1.0.8-2.1) ...
- Selecting previously unselected package libgraphite2-3:amd64.
- Preparing to unpack .../041-libgraphite2-3_1.3.14-1_amd64.deb ...
- Unpacking libgraphite2-3:amd64 (1.3.14-1) ...
- Selecting previously unselected package libharfbuzz0b:amd64.
- Preparing to unpack .../042-libharfbuzz0b_6.0.0-1_amd64.deb ...
- Unpacking libharfbuzz0b:amd64 (6.0.0-1) ...
- Selecting previously unselected package libthai-data.
- Preparing to unpack .../043-libthai-data_0.1.29-1_all.deb ...
- Unpacking libthai-data (0.1.29-1) ...
- Selecting previously unselected package libdatrie1:amd64.
- Preparing to unpack .../044-libdatrie1_0.2.13-2+b1_amd64.deb ...
- Unpacking libdatrie1:amd64 (0.2.13-2+b1) ...
- Selecting previously unselected package libthai0:amd64.
- Preparing to unpack .../045-libthai0_0.1.29-1_amd64.deb ...
- Unpacking libthai0:amd64 (0.1.29-1) ...
- Selecting previously unselected package libpango-1.0-0:amd64.
- Preparing to unpack .../046-libpango-1.0-0_1.50.12+ds-1_amd64.deb ...
- Unpacking libpango-1.0-0:amd64 (1.50.12+ds-1) ...
- Selecting previously unselected package libpixman-1-0:amd64.
- Preparing to unpack .../047-libpixman-1-0_0.42.2-1_amd64.deb ...
- Unpacking libpixman-1-0:amd64 (0.42.2-1) ...
- Selecting previously unselected package libxcb-render0:amd64.
- Preparing to unpack .../048-libxcb-render0_1.15-1_amd64.deb ...
- Unpacking libxcb-render0:amd64 (1.15-1) ...
- Selecting previously unselected package libxcb-shm0:amd64.
- Preparing to unpack .../049-libxcb-shm0_1.15-1_amd64.deb ...
- Unpacking libxcb-shm0:amd64 (1.15-1) ...
- Selecting previously unselected package libxrender1:amd64.
- Preparing to unpack .../050-libxrender1_1%3a0.9.10-1.1_amd64.deb ...
- Unpacking libxrender1:amd64 (1:0.9.10-1.1) ...
- Selecting previously unselected package libcairo2:amd64.
- Preparing to unpack .../051-libcairo2_1.16.0-7_amd64.deb ...
- Unpacking libcairo2:amd64 (1.16.0-7) ...
- Selecting previously unselected package libpangoft2-1.0-0:amd64.
- Preparing to unpack .../052-libpangoft2-1.0-0_1.50.12+ds-1_amd64.deb ...
- Unpacking libpangoft2-1.0-0:amd64 (1.50.12+ds-1) ...
- Selecting previously unselected package libpangocairo-1.0-0:amd64.
- Preparing to unpack .../053-libpangocairo-1.0-0_1.50.12+ds-1_amd64.deb ...
- Unpacking libpangocairo-1.0-0:amd64 (1.50.12+ds-1) ...
- Selecting previously unselected package libxft2:amd64.
- Preparing to unpack .../054-libxft2_2.3.6-1_amd64.deb ...
- Unpacking libxft2:amd64 (2.3.6-1) ...
- Selecting previously unselected package libpangoxft-1.0-0:amd64.
- Preparing to unpack .../055-libpangoxft-1.0-0_1.50.12+ds-1_amd64.deb ...
- Unpacking libpangoxft-1.0-0:amd64 (1.50.12+ds-1) ...
- Selecting previously unselected package gir1.2-pango-1.0:amd64.
- Preparing to unpack .../056-gir1.2-pango-1.0_1.50.12+ds-1_amd64.deb ...
- Unpacking gir1.2-pango-1.0:amd64 (1.50.12+ds-1) ...
- Selecting previously unselected package libatk-bridge2.0-0:amd64.
- Preparing to unpack .../057-libatk-bridge2.0-0_2.46.0-4_amd64.deb ...
- Unpacking libatk-bridge2.0-0:amd64 (2.46.0-4) ...
- Selecting previously unselected package libcairo-gobject2:amd64.
- Preparing to unpack .../058-libcairo-gobject2_1.16.0-7_amd64.deb ...
- Unpacking libcairo-gobject2:amd64 (1.16.0-7) ...
- Selecting previously unselected package liblcms2-2:amd64.
- Preparing to unpack .../059-liblcms2-2_2.14-1+b1_amd64.deb ...
- Unpacking liblcms2-2:amd64 (2.14-1+b1) ...
- Selecting previously unselected package libcolord2:amd64.
- Preparing to unpack .../060-libcolord2_1.4.6-2.1_amd64.deb ...
- Unpacking libcolord2:amd64 (1.4.6-2.1) ...
- Selecting previously unselected package libavahi-common-data:amd64.
- Preparing to unpack .../061-libavahi-common-data_0.8-7_amd64.deb ...
- Unpacking libavahi-common-data:amd64 (0.8-7) ...
- Selecting previously unselected package libavahi-common3:amd64.
- Preparing to unpack .../062-libavahi-common3_0.8-7_amd64.deb ...
- Unpacking libavahi-common3:amd64 (0.8-7) ...
- Selecting previously unselected package libavahi-client3:amd64.
- Preparing to unpack .../063-libavahi-client3_0.8-7_amd64.deb ...
- Unpacking libavahi-client3:amd64 (0.8-7) ...
- Selecting previously unselected package libcups2:amd64.
- Preparing to unpack .../064-libcups2_2.4.2-1+b2_amd64.deb ...
- Unpacking libcups2:amd64 (2.4.2-1+b2) ...
- Selecting previously unselected package libepoxy0:amd64.
- Preparing to unpack .../065-libepoxy0_1.5.10-1_amd64.deb ...
- Unpacking libepoxy0:amd64 (1.5.10-1) ...
- Selecting previously unselected package libwayland-client0:amd64.
- Preparing to unpack .../066-libwayland-client0_1.21.0-1_amd64.deb ...
- Unpacking libwayland-client0:amd64 (1.21.0-1) ...
- Selecting previously unselected package libwayland-cursor0:amd64.
- Preparing to unpack .../067-libwayland-cursor0_1.21.0-1_amd64.deb ...
- Unpacking libwayland-cursor0:amd64 (1.21.0-1) ...
- Selecting previously unselected package libwayland-egl1:amd64.
- Preparing to unpack .../068-libwayland-egl1_1.21.0-1_amd64.deb ...
- Unpacking libwayland-egl1:amd64 (1.21.0-1) ...
- Selecting previously unselected package libxcomposite1:amd64.
- Preparing to unpack .../069-libxcomposite1_1%3a0.4.5-1_amd64.deb ...
- Unpacking libxcomposite1:amd64 (1:0.4.5-1) ...
- Selecting previously unselected package libxfixes3:amd64.
- Preparing to unpack .../070-libxfixes3_1%3a6.0.0-2_amd64.deb ...
- Unpacking libxfixes3:amd64 (1:6.0.0-2) ...
- Selecting previously unselected package libxcursor1:amd64.
- Preparing to unpack .../071-libxcursor1_1%3a1.2.1-1_amd64.deb ...
- Unpacking libxcursor1:amd64 (1:1.2.1-1) ...
- Selecting previously unselected package libxdamage1:amd64.
- Preparing to unpack .../072-libxdamage1_1%3a1.1.6-1_amd64.deb ...
- Unpacking libxdamage1:amd64 (1:1.1.6-1) ...
- Selecting previously unselected package libxinerama1:amd64.
- Preparing to unpack .../073-libxinerama1_2%3a1.1.4-3_amd64.deb ...
- Unpacking libxinerama1:amd64 (2:1.1.4-3) ...
- Selecting previously unselected package xkb-data.
- Preparing to unpack .../074-xkb-data_2.35.1-1_all.deb ...
- Unpacking xkb-data (2.35.1-1) ...
- Selecting previously unselected package libxkbcommon0:amd64.
- Preparing to unpack .../075-libxkbcommon0_1.5.0-1_amd64.deb ...
- Unpacking libxkbcommon0:amd64 (1.5.0-1) ...
- Selecting previously unselected package libxrandr2:amd64.
- Preparing to unpack .../076-libxrandr2_2%3a1.5.2-2+b1_amd64.deb ...
- Unpacking libxrandr2:amd64 (2:1.5.2-2+b1) ...
- Selecting previously unselected package libgtk-3-common.
- Preparing to unpack .../077-libgtk-3-common_3.24.36-1_all.deb ...
- Unpacking libgtk-3-common (3.24.36-1) ...
- Selecting previously unselected package libgtk-3-0:amd64.
- Preparing to unpack .../078-libgtk-3-0_3.24.36-1_amd64.deb ...
- Unpacking libgtk-3-0:amd64 (3.24.36-1) ...
- Selecting previously unselected package gir1.2-gtk-3.0:amd64.
- Preparing to unpack .../079-gir1.2-gtk-3.0_3.24.36-1_amd64.deb ...
- Unpacking gir1.2-gtk-3.0:amd64 (3.24.36-1) ...
- Selecting previously unselected package libgtksourceview-3.0-common.
- Preparing to unpack .../080-libgtksourceview-3.0-common_3.24.11-2_all.deb ...
- Unpacking libgtksourceview-3.0-common (3.24.11-2) ...
- Selecting previously unselected package libgtksourceview-3.0-1:amd64.
- Preparing to unpack .../081-libgtksourceview-3.0-1_3.24.11-2+b1_amd64.deb ...
- Unpacking libgtksourceview-3.0-1:amd64 (3.24.11-2+b1) ...
- Selecting previously unselected package gir1.2-gtksource-3.0:amd64.
- Preparing to unpack .../082-gir1.2-gtksource-3.0_3.24.11-2+b1_amd64.deb ...
- Unpacking gir1.2-gtksource-3.0:amd64 (3.24.11-2+b1) ...
- Selecting previously unselected package icu-devtools.
- Preparing to unpack .../083-icu-devtools_72.1-3_amd64.deb ...
- Unpacking icu-devtools (72.1-3) ...
- Selecting previously unselected package libpkgconf3:amd64.
- Preparing to unpack .../084-libpkgconf3_1.8.0-12_amd64.deb ...
- Unpacking libpkgconf3:amd64 (1.8.0-12) ...
- Selecting previously unselected package pkgconf-bin.
- Preparing to unpack .../085-pkgconf-bin_1.8.0-12_amd64.deb ...
- Unpacking pkgconf-bin (1.8.0-12) ...
- Selecting previously unselected package pkgconf:amd64.
- Preparing to unpack .../086-pkgconf_1.8.0-12_amd64.deb ...
- Unpacking pkgconf:amd64 (1.8.0-12) ...
- Selecting previously unselected package pkg-config:amd64.
- Preparing to unpack .../087-pkg-config_1.8.0-12_amd64.deb ...
- Unpacking pkg-config:amd64 (1.8.0-12) ...
- Selecting previously unselected package libffi-dev:amd64.
- Preparing to unpack .../088-libffi-dev_3.4.4-1_amd64.deb ...
- Unpacking libffi-dev:amd64 (3.4.4-1) ...
- Selecting previously unselected package libglib2.0-data.
- Preparing to unpack .../089-libglib2.0-data_2.74.4-1_all.deb ...
- Unpacking libglib2.0-data (2.74.4-1) ...
- Selecting previously unselected package libelf1:amd64.
- Preparing to unpack .../090-libelf1_0.188-2_amd64.deb ...
- Unpacking libelf1:amd64 (0.188-2) ...
- Selecting previously unselected package libglib2.0-bin.
- Preparing to unpack .../091-libglib2.0-bin_2.74.4-1_amd64.deb ...
- Unpacking libglib2.0-bin (2.74.4-1) ...
- Selecting previously unselected package python3-lib2to3.
- Preparing to unpack .../092-python3-lib2to3_3.10.8-1_all.deb ...
- Unpacking python3-lib2to3 (3.10.8-1) ...
- Selecting previously unselected package python3-distutils.
- Preparing to unpack .../093-python3-distutils_3.10.8-1_all.deb ...
- Unpacking python3-distutils (3.10.8-1) ...
- Selecting previously unselected package libglib2.0-dev-bin.
- Preparing to unpack .../094-libglib2.0-dev-bin_2.74.4-1_amd64.deb ...
- Unpacking libglib2.0-dev-bin (2.74.4-1) ...
- Selecting previously unselected package uuid-dev:amd64.
- Preparing to unpack .../095-uuid-dev_2.38.1-4_amd64.deb ...
- Unpacking uuid-dev:amd64 (2.38.1-4) ...
- Selecting previously unselected package libblkid-dev:amd64.
- Preparing to unpack .../096-libblkid-dev_2.38.1-4_amd64.deb ...
- Unpacking libblkid-dev:amd64 (2.38.1-4) ...
- Selecting previously unselected package libsepol-dev:amd64.
- Preparing to unpack .../097-libsepol-dev_3.4-2_amd64.deb ...
- Unpacking libsepol-dev:amd64 (3.4-2) ...
- Selecting previously unselected package libpcre2-16-0:amd64.
- Preparing to unpack .../098-libpcre2-16-0_10.42-1_amd64.deb ...
- Unpacking libpcre2-16-0:amd64 (10.42-1) ...
- Selecting previously unselected package libpcre2-32-0:amd64.
- Preparing to unpack .../099-libpcre2-32-0_10.42-1_amd64.deb ...
- Unpacking libpcre2-32-0:amd64 (10.42-1) ...
- Selecting previously unselected package libpcre2-posix3:amd64.
- Preparing to unpack .../100-libpcre2-posix3_10.42-1_amd64.deb ...
- Unpacking libpcre2-posix3:amd64 (10.42-1) ...
- Selecting previously unselected package libpcre2-dev:amd64.
- Preparing to unpack .../101-libpcre2-dev_10.42-1_amd64.deb ...
- Unpacking libpcre2-dev:amd64 (10.42-1) ...
- Selecting previously unselected package libselinux1-dev:amd64.
- Preparing to unpack .../102-libselinux1-dev_3.4-1+b4_amd64.deb ...
- Unpacking libselinux1-dev:amd64 (3.4-1+b4) ...
- Selecting previously unselected package libmount-dev:amd64.
- Preparing to unpack .../103-libmount-dev_2.38.1-4_amd64.deb ...
- Unpacking libmount-dev:amd64 (2.38.1-4) ...
- Selecting previously unselected package zlib1g-dev:amd64.
- Preparing to unpack .../104-zlib1g-dev_1%3a1.2.13.dfsg-1_amd64.deb ...
- Unpacking zlib1g-dev:amd64 (1:1.2.13.dfsg-1) ...
- Selecting previously unselected package libglib2.0-dev:amd64.
- Preparing to unpack .../105-libglib2.0-dev_2.74.4-1_amd64.deb ...
- Unpacking libglib2.0-dev:amd64 (2.74.4-1) ...
- Selecting previously unselected package libatk1.0-dev:amd64.
- Preparing to unpack .../106-libatk1.0-dev_2.46.0-4_amd64.deb ...
- Unpacking libatk1.0-dev:amd64 (2.46.0-4) ...
- Selecting previously unselected package xml-core.
- Preparing to unpack .../107-xml-core_0.18+nmu1_all.deb ...
- Unpacking xml-core (0.18+nmu1) ...
- Selecting previously unselected package libdbus-1-dev:amd64.
- Preparing to unpack .../108-libdbus-1-dev_1.14.4-1_amd64.deb ...
- Unpacking libdbus-1-dev:amd64 (1.14.4-1) ...
- Selecting previously unselected package libxext-dev:amd64.
- Preparing to unpack .../109-libxext-dev_2%3a1.3.4-1+b1_amd64.deb ...
- Unpacking libxext-dev:amd64 (2:1.3.4-1+b1) ...
- Selecting previously unselected package libxfixes-dev:amd64.
- Preparing to unpack .../110-libxfixes-dev_1%3a6.0.0-2_amd64.deb ...
- Unpacking libxfixes-dev:amd64 (1:6.0.0-2) ...
- Selecting previously unselected package libxi-dev:amd64.
- Preparing to unpack .../111-libxi-dev_2%3a1.8-1+b1_amd64.deb ...
- Unpacking libxi-dev:amd64 (2:1.8-1+b1) ...
- Selecting previously unselected package libxtst-dev:amd64.
- Preparing to unpack .../112-libxtst-dev_2%3a1.2.3-1.1_amd64.deb ...
- Unpacking libxtst-dev:amd64 (2:1.2.3-1.1) ...
- Selecting previously unselected package libatspi2.0-dev:amd64.
- Preparing to unpack .../113-libatspi2.0-dev_2.46.0-4_amd64.deb ...
- Unpacking libatspi2.0-dev:amd64 (2.46.0-4) ...
- Selecting previously unselected package libatk-bridge2.0-dev:amd64.
- Preparing to unpack .../114-libatk-bridge2.0-dev_2.46.0-4_amd64.deb ...
- Unpacking libatk-bridge2.0-dev:amd64 (2.46.0-4) ...
- Selecting previously unselected package libbrotli-dev:amd64.
- Preparing to unpack .../115-libbrotli-dev_1.0.9-2+b5_amd64.deb ...
- Unpacking libbrotli-dev:amd64 (1.0.9-2+b5) ...
- Selecting previously unselected package liblzo2-2:amd64.
- Preparing to unpack .../116-liblzo2-2_2.10-2_amd64.deb ...
- Unpacking liblzo2-2:amd64 (2.10-2) ...
- Selecting previously unselected package libcairo-script-interpreter2:amd64.
- Preparing to unpack .../117-libcairo-script-interpreter2_1.16.0-7_amd64.deb ...
- Unpacking libcairo-script-interpreter2:amd64 (1.16.0-7) ...
- Selecting previously unselected package libexpat1-dev:amd64.
- Preparing to unpack .../118-libexpat1-dev_2.5.0-1_amd64.deb ...
- Unpacking libexpat1-dev:amd64 (2.5.0-1) ...
- Selecting previously unselected package libpng-dev:amd64.
- Preparing to unpack .../119-libpng-dev_1.6.39-2_amd64.deb ...
- Unpacking libpng-dev:amd64 (1.6.39-2) ...
- Selecting previously unselected package libfreetype-dev:amd64.
- Preparing to unpack .../120-libfreetype-dev_2.12.1+dfsg-4_amd64.deb ...
- Unpacking libfreetype-dev:amd64 (2.12.1+dfsg-4) ...
- Selecting previously unselected package libfontconfig-dev:amd64.
- Preparing to unpack .../121-libfontconfig-dev_2.14.1-3_amd64.deb ...
- Unpacking libfontconfig-dev:amd64 (2.14.1-3) ...
- Selecting previously unselected package libpixman-1-dev:amd64.
- Preparing to unpack .../122-libpixman-1-dev_0.42.2-1_amd64.deb ...
- Unpacking libpixman-1-dev:amd64 (0.42.2-1) ...
- Selecting previously unselected package libice6:amd64.
- Preparing to unpack .../123-libice6_2%3a1.0.10-1_amd64.deb ...
- Unpacking libice6:amd64 (2:1.0.10-1) ...
- Selecting previously unselected package libsm6:amd64.
- Preparing to unpack .../124-libsm6_2%3a1.2.3-1_amd64.deb ...
- Unpacking libsm6:amd64 (2:1.2.3-1) ...
- Selecting previously unselected package libice-dev:amd64.
- Preparing to unpack .../125-libice-dev_2%3a1.0.10-1_amd64.deb ...
- Unpacking libice-dev:amd64 (2:1.0.10-1) ...
- Selecting previously unselected package libsm-dev:amd64.
- Preparing to unpack .../126-libsm-dev_2%3a1.2.3-1_amd64.deb ...
- Unpacking libsm-dev:amd64 (2:1.2.3-1) ...
- Selecting previously unselected package libxcb-render0-dev:amd64.
- Preparing to unpack .../127-libxcb-render0-dev_1.15-1_amd64.deb ...
- Unpacking libxcb-render0-dev:amd64 (1.15-1) ...
- Selecting previously unselected package libxcb-shm0-dev:amd64.
- Preparing to unpack .../128-libxcb-shm0-dev_1.15-1_amd64.deb ...
- Unpacking libxcb-shm0-dev:amd64 (1.15-1) ...
- Selecting previously unselected package libxrender-dev:amd64.
- Preparing to unpack .../129-libxrender-dev_1%3a0.9.10-1.1_amd64.deb ...
- Unpacking libxrender-dev:amd64 (1:0.9.10-1.1) ...
- Selecting previously unselected package libcairo2-dev:amd64.
- Preparing to unpack .../130-libcairo2-dev_1.16.0-7_amd64.deb ...
- Unpacking libcairo2-dev:amd64 (1.16.0-7) ...
- Selecting previously unselected package libdatrie-dev:amd64.
- Preparing to unpack .../131-libdatrie-dev_0.2.13-2+b1_amd64.deb ...
- Unpacking libdatrie-dev:amd64 (0.2.13-2+b1) ...
- Selecting previously unselected package libdeflate-dev:amd64.
- Preparing to unpack .../132-libdeflate-dev_1.14-1_amd64.deb ...
- Unpacking libdeflate-dev:amd64 (1.14-1) ...
- Selecting previously unselected package libdrm-common.
- Preparing to unpack .../133-libdrm-common_2.4.114-1_all.deb ...
- Unpacking libdrm-common (2.4.114-1) ...
- Selecting previously unselected package libdrm2:amd64.
- Preparing to unpack .../134-libdrm2_2.4.114-1_amd64.deb ...
- Unpacking libdrm2:amd64 (2.4.114-1) ...
- Selecting previously unselected package libdrm-amdgpu1:amd64.
- Preparing to unpack .../135-libdrm-amdgpu1_2.4.114-1_amd64.deb ...
- Unpacking libdrm-amdgpu1:amd64 (2.4.114-1) ...
- Selecting previously unselected package libpciaccess0:amd64.
- Preparing to unpack .../136-libpciaccess0_0.17-2_amd64.deb ...
- Unpacking libpciaccess0:amd64 (0.17-2) ...
- Selecting previously unselected package libdrm-intel1:amd64.
- Preparing to unpack .../137-libdrm-intel1_2.4.114-1_amd64.deb ...
- Unpacking libdrm-intel1:amd64 (2.4.114-1) ...
- Selecting previously unselected package libdrm-nouveau2:amd64.
- Preparing to unpack .../138-libdrm-nouveau2_2.4.114-1_amd64.deb ...
- Unpacking libdrm-nouveau2:amd64 (2.4.114-1) ...
- Selecting previously unselected package libdrm-radeon1:amd64.
- Preparing to unpack .../139-libdrm-radeon1_2.4.114-1_amd64.deb ...
- Unpacking libdrm-radeon1:amd64 (2.4.114-1) ...
- Selecting previously unselected package libglvnd0:amd64.
- Preparing to unpack .../140-libglvnd0_1.6.0-1_amd64.deb ...
- Unpacking libglvnd0:amd64 (1.6.0-1) ...
- Selecting previously unselected package libwayland-server0:amd64.
- Preparing to unpack .../141-libwayland-server0_1.21.0-1_amd64.deb ...
- Unpacking libwayland-server0:amd64 (1.21.0-1) ...
- Selecting previously unselected package libgbm1:amd64.
- Preparing to unpack .../142-libgbm1_22.3.3-1_amd64.deb ...
- Unpacking libgbm1:amd64 (22.3.3-1) ...
- Selecting previously unselected package libglapi-mesa:amd64.
- Preparing to unpack .../143-libglapi-mesa_22.3.3-1_amd64.deb ...
- Unpacking libglapi-mesa:amd64 (22.3.3-1) ...
- Selecting previously unselected package libx11-xcb1:amd64.
- Preparing to unpack .../144-libx11-xcb1_2%3a1.8.3-3_amd64.deb ...
- Unpacking libx11-xcb1:amd64 (2:1.8.3-3) ...
- Selecting previously unselected package libxcb-dri2-0:amd64.
- Preparing to unpack .../145-libxcb-dri2-0_1.15-1_amd64.deb ...
- Unpacking libxcb-dri2-0:amd64 (1.15-1) ...
- Selecting previously unselected package libxcb-dri3-0:amd64.
- Preparing to unpack .../146-libxcb-dri3-0_1.15-1_amd64.deb ...
- Unpacking libxcb-dri3-0:amd64 (1.15-1) ...
- Selecting previously unselected package libxcb-present0:amd64.
- Preparing to unpack .../147-libxcb-present0_1.15-1_amd64.deb ...
- Unpacking libxcb-present0:amd64 (1.15-1) ...
- Selecting previously unselected package libxcb-randr0:amd64.
- Preparing to unpack .../148-libxcb-randr0_1.15-1_amd64.deb ...
- Unpacking libxcb-randr0:amd64 (1.15-1) ...
- Selecting previously unselected package libxcb-sync1:amd64.
- Preparing to unpack .../149-libxcb-sync1_1.15-1_amd64.deb ...
- Unpacking libxcb-sync1:amd64 (1.15-1) ...
- Selecting previously unselected package libxcb-xfixes0:amd64.
- Preparing to unpack .../150-libxcb-xfixes0_1.15-1_amd64.deb ...
- Unpacking libxcb-xfixes0:amd64 (1.15-1) ...
- Selecting previously unselected package libxshmfence1:amd64.
- Preparing to unpack .../151-libxshmfence1_1.3-1_amd64.deb ...
- Unpacking libxshmfence1:amd64 (1.3-1) ...
- Selecting previously unselected package libegl-mesa0:amd64.
- Preparing to unpack .../152-libegl-mesa0_22.3.3-1_amd64.deb ...
- Unpacking libegl-mesa0:amd64 (22.3.3-1) ...
- Selecting previously unselected package libegl1:amd64.
- Preparing to unpack .../153-libegl1_1.6.0-1_amd64.deb ...
- Unpacking libegl1:amd64 (1.6.0-1) ...
- Selecting previously unselected package libxcb-glx0:amd64.
- Preparing to unpack .../154-libxcb-glx0_1.15-1_amd64.deb ...
- Unpacking libxcb-glx0:amd64 (1.15-1) ...
- Selecting previously unselected package libxxf86vm1:amd64.
- Preparing to unpack .../155-libxxf86vm1_1%3a1.1.4-1+b2_amd64.deb ...
- Unpacking libxxf86vm1:amd64 (1:1.1.4-1+b2) ...
- Selecting previously unselected package libz3-4:amd64.
- Preparing to unpack .../156-libz3-4_4.8.12-3_amd64.deb ...
- Unpacking libz3-4:amd64 (4.8.12-3) ...
- Selecting previously unselected package libllvm15:amd64.
- Preparing to unpack .../157-libllvm15_1%3a15.0.6-4+b1_amd64.deb ...
- Unpacking libllvm15:amd64 (1:15.0.6-4+b1) ...
- Selecting previously unselected package libsensors-config.
- Preparing to unpack .../158-libsensors-config_1%3a3.6.0-7.1_all.deb ...
- Unpacking libsensors-config (1:3.6.0-7.1) ...
- Selecting previously unselected package libsensors5:amd64.
- Preparing to unpack .../159-libsensors5_1%3a3.6.0-7.1_amd64.deb ...
- Unpacking libsensors5:amd64 (1:3.6.0-7.1) ...
- Selecting previously unselected package libgl1-mesa-dri:amd64.
- Preparing to unpack .../160-libgl1-mesa-dri_22.3.3-1_amd64.deb ...
- Unpacking libgl1-mesa-dri:amd64 (22.3.3-1) ...
- Selecting previously unselected package libglx-mesa0:amd64.
- Preparing to unpack .../161-libglx-mesa0_22.3.3-1_amd64.deb ...
- Unpacking libglx-mesa0:amd64 (22.3.3-1) ...
- Selecting previously unselected package libglx0:amd64.
- Preparing to unpack .../162-libglx0_1.6.0-1_amd64.deb ...
- Unpacking libglx0:amd64 (1.6.0-1) ...
- Selecting previously unselected package libgl1:amd64.
- Preparing to unpack .../163-libgl1_1.6.0-1_amd64.deb ...
- Unpacking libgl1:amd64 (1.6.0-1) ...
- Selecting previously unselected package libglx-dev:amd64.
- Preparing to unpack .../164-libglx-dev_1.6.0-1_amd64.deb ...
- Unpacking libglx-dev:amd64 (1.6.0-1) ...
- Selecting previously unselected package libgl-dev:amd64.
- Preparing to unpack .../165-libgl-dev_1.6.0-1_amd64.deb ...
- Unpacking libgl-dev:amd64 (1.6.0-1) ...
- Selecting previously unselected package libegl-dev:amd64.
- Preparing to unpack .../166-libegl-dev_1.6.0-1_amd64.deb ...
- Unpacking libegl-dev:amd64 (1.6.0-1) ...
- Selecting previously unselected package libglvnd-core-dev:amd64.
- Preparing to unpack .../167-libglvnd-core-dev_1.6.0-1_amd64.deb ...
- Unpacking libglvnd-core-dev:amd64 (1.6.0-1) ...
- Selecting previously unselected package libgles1:amd64.
- Preparing to unpack .../168-libgles1_1.6.0-1_amd64.deb ...
- Unpacking libgles1:amd64 (1.6.0-1) ...
- Selecting previously unselected package libgles2:amd64.
- Preparing to unpack .../169-libgles2_1.6.0-1_amd64.deb ...
- Unpacking libgles2:amd64 (1.6.0-1) ...
- Selecting previously unselected package libgles-dev:amd64.
- Preparing to unpack .../170-libgles-dev_1.6.0-1_amd64.deb ...
- Unpacking libgles-dev:amd64 (1.6.0-1) ...
- Selecting previously unselected package libopengl0:amd64.
- Preparing to unpack .../171-libopengl0_1.6.0-1_amd64.deb ...
- Unpacking libopengl0:amd64 (1.6.0-1) ...
- Selecting previously unselected package libopengl-dev:amd64.
- Preparing to unpack .../172-libopengl-dev_1.6.0-1_amd64.deb ...
- Unpacking libopengl-dev:amd64 (1.6.0-1) ...
- Selecting previously unselected package libglvnd-dev:amd64.
- Preparing to unpack .../173-libglvnd-dev_1.6.0-1_amd64.deb ...
- Unpacking libglvnd-dev:amd64 (1.6.0-1) ...
- Selecting previously unselected package libegl1-mesa-dev:amd64.
- Preparing to unpack .../174-libegl1-mesa-dev_22.3.3-1_amd64.deb ...
- Unpacking libegl1-mesa-dev:amd64 (22.3.3-1) ...
- Selecting previously unselected package libepoxy-dev:amd64.
- Preparing to unpack .../175-libepoxy-dev_1.5.10-1_amd64.deb ...
- Unpacking libepoxy-dev:amd64 (1.5.10-1) ...
- Selecting previously unselected package libfribidi-dev:amd64.
- Preparing to unpack .../176-libfribidi-dev_1.0.8-2.1_amd64.deb ...
- Unpacking libfribidi-dev:amd64 (1.0.8-2.1) ...
- Selecting previously unselected package libgdk-pixbuf2.0-bin.
- Preparing to unpack .../177-libgdk-pixbuf2.0-bin_2.42.10+dfsg-1+b1_amd64.deb ...
- Unpacking libgdk-pixbuf2.0-bin (2.42.10+dfsg-1+b1) ...
- Selecting previously unselected package libjpeg62-turbo-dev:amd64.
- Preparing to unpack .../178-libjpeg62-turbo-dev_1%3a2.1.2-1+b1_amd64.deb ...
- Unpacking libjpeg62-turbo-dev:amd64 (1:2.1.2-1+b1) ...
- Selecting previously unselected package libjpeg-dev:amd64.
- Preparing to unpack .../179-libjpeg-dev_1%3a2.1.2-1+b1_amd64.deb ...
- Unpacking libjpeg-dev:amd64 (1:2.1.2-1+b1) ...
- Selecting previously unselected package libjbig-dev:amd64.
- Preparing to unpack .../180-libjbig-dev_2.1-6.1_amd64.deb ...
- Unpacking libjbig-dev:amd64 (2.1-6.1) ...
- Selecting previously unselected package liblzma-dev:amd64.
- Preparing to unpack .../181-liblzma-dev_5.4.1-0.0_amd64.deb ...
- Unpacking liblzma-dev:amd64 (5.4.1-0.0) ...
- Selecting previously unselected package libzstd-dev:amd64.
- Preparing to unpack .../182-libzstd-dev_1.5.2+dfsg2-3_amd64.deb ...
- Unpacking libzstd-dev:amd64 (1.5.2+dfsg2-3) ...
- Selecting previously unselected package libwebpmux3:amd64.
- Preparing to unpack .../183-libwebpmux3_1.2.2-2+b3_amd64.deb ...
- Unpacking libwebpmux3:amd64 (1.2.2-2+b3) ...
- Selecting previously unselected package libwebpdemux2:amd64.
- Preparing to unpack .../184-libwebpdemux2_1.2.2-2+b3_amd64.deb ...
- Unpacking libwebpdemux2:amd64 (1.2.2-2+b3) ...
- Selecting previously unselected package libwebp-dev:amd64.
- Preparing to unpack .../185-libwebp-dev_1.2.2-2+b3_amd64.deb ...
- Unpacking libwebp-dev:amd64 (1.2.2-2+b3) ...
- Selecting previously unselected package libtiffxx6:amd64.
- Preparing to unpack .../186-libtiffxx6_4.5.0-3_amd64.deb ...
- Unpacking libtiffxx6:amd64 (4.5.0-3) ...
- Selecting previously unselected package liblerc-dev:amd64.
- Preparing to unpack .../187-liblerc-dev_4.0.0+ds-2_amd64.deb ...
- Unpacking liblerc-dev:amd64 (4.0.0+ds-2) ...
- Selecting previously unselected package libtiff-dev:amd64.
- Preparing to unpack .../188-libtiff-dev_4.5.0-3_amd64.deb ...
- Unpacking libtiff-dev:amd64 (4.5.0-3) ...
- Selecting previously unselected package libgdk-pixbuf-2.0-dev:amd64.
- Preparing to unpack .../189-libgdk-pixbuf-2.0-dev_2.42.10+dfsg-1+b1_amd64.deb ...
- Unpacking libgdk-pixbuf-2.0-dev:amd64 (2.42.10+dfsg-1+b1) ...
- Selecting previously unselected package libgmpxx4ldbl:amd64.
- Preparing to unpack .../190-libgmpxx4ldbl_2%3a6.2.1+dfsg1-1.1_amd64.deb ...
- Unpacking libgmpxx4ldbl:amd64 (2:6.2.1+dfsg1-1.1) ...
- Selecting previously unselected package libgmp-dev:amd64.
- Preparing to unpack .../191-libgmp-dev_2%3a6.2.1+dfsg1-1.1_amd64.deb ...
- Unpacking libgmp-dev:amd64 (2:6.2.1+dfsg1-1.1) ...
- Selecting previously unselected package libgraphite2-dev:amd64.
- Preparing to unpack .../192-libgraphite2-dev_1.3.14-1_amd64.deb ...
- Unpacking libgraphite2-dev:amd64 (1.3.14-1) ...
- Selecting previously unselected package libgtk-3-bin.
- Preparing to unpack .../193-libgtk-3-bin_3.24.36-1_amd64.deb ...
- Unpacking libgtk-3-bin (3.24.36-1) ...
- Selecting previously unselected package libharfbuzz-icu0:amd64.
- Preparing to unpack .../194-libharfbuzz-icu0_6.0.0-1_amd64.deb ...
- Unpacking libharfbuzz-icu0:amd64 (6.0.0-1) ...
- Selecting previously unselected package libharfbuzz-gobject0:amd64.
- Preparing to unpack .../195-libharfbuzz-gobject0_6.0.0-1_amd64.deb ...
- Unpacking libharfbuzz-gobject0:amd64 (6.0.0-1) ...
- Selecting previously unselected package libicu-dev:amd64.
- Preparing to unpack .../196-libicu-dev_72.1-3_amd64.deb ...
- Unpacking libicu-dev:amd64 (72.1-3) ...
- Selecting previously unselected package libharfbuzz-dev:amd64.
- Preparing to unpack .../197-libharfbuzz-dev_6.0.0-1_amd64.deb ...
- Unpacking libharfbuzz-dev:amd64 (6.0.0-1) ...
- Selecting previously unselected package libthai-dev:amd64.
- Preparing to unpack .../198-libthai-dev_0.1.29-1_amd64.deb ...
- Unpacking libthai-dev:amd64 (0.1.29-1) ...
- Selecting previously unselected package libxft-dev:amd64.
- Preparing to unpack .../199-libxft-dev_2.3.6-1_amd64.deb ...
- Unpacking libxft-dev:amd64 (2.3.6-1) ...
- Selecting previously unselected package pango1.0-tools.
- Preparing to unpack .../200-pango1.0-tools_1.50.12+ds-1_amd64.deb ...
- Unpacking pango1.0-tools (1.50.12+ds-1) ...
- Selecting previously unselected package libpango1.0-dev:amd64.
- Preparing to unpack .../201-libpango1.0-dev_1.50.12+ds-1_amd64.deb ...
- Unpacking libpango1.0-dev:amd64 (1.50.12+ds-1) ...
- Selecting previously unselected package libwayland-bin.
- Preparing to unpack .../202-libwayland-bin_1.21.0-1_amd64.deb ...
- Unpacking libwayland-bin (1.21.0-1) ...
- Selecting previously unselected package libwayland-dev:amd64.
- Preparing to unpack .../203-libwayland-dev_1.21.0-1_amd64.deb ...
- Unpacking libwayland-dev:amd64 (1.21.0-1) ...
- Selecting previously unselected package libxcomposite-dev:amd64.
- Preparing to unpack .../204-libxcomposite-dev_1%3a0.4.5-1_amd64.deb ...
- Unpacking libxcomposite-dev:amd64 (1:0.4.5-1) ...
- Selecting previously unselected package libxcursor-dev:amd64.
- Preparing to unpack .../205-libxcursor-dev_1%3a1.2.1-1_amd64.deb ...
- Unpacking libxcursor-dev:amd64 (1:1.2.1-1) ...
- Selecting previously unselected package libxdamage-dev:amd64.
- Preparing to unpack .../206-libxdamage-dev_1%3a1.1.6-1_amd64.deb ...
- Unpacking libxdamage-dev:amd64 (1:1.1.6-1) ...
- Selecting previously unselected package libxinerama-dev:amd64.
- Preparing to unpack .../207-libxinerama-dev_2%3a1.1.4-3_amd64.deb ...
- Unpacking libxinerama-dev:amd64 (2:1.1.4-3) ...
- Selecting previously unselected package libxkbcommon-dev:amd64.
- Preparing to unpack .../208-libxkbcommon-dev_1.5.0-1_amd64.deb ...
- Unpacking libxkbcommon-dev:amd64 (1.5.0-1) ...
- Selecting previously unselected package libxrandr-dev:amd64.
- Preparing to unpack .../209-libxrandr-dev_2%3a1.5.2-2+b1_amd64.deb ...
- Unpacking libxrandr-dev:amd64 (2:1.5.2-2+b1) ...
- Selecting previously unselected package wayland-protocols.
- Preparing to unpack .../210-wayland-protocols_1.31-1_all.deb ...
- Unpacking wayland-protocols (1.31-1) ...
- Selecting previously unselected package libgtk-3-dev:amd64.
- Preparing to unpack .../211-libgtk-3-dev_3.24.36-1_amd64.deb ...
- Unpacking libgtk-3-dev:amd64 (3.24.36-1) ...
- Selecting previously unselected package libxml2-dev:amd64.
- Preparing to unpack .../212-libxml2-dev_2.9.14+dfsg-1.1+b2_amd64.deb ...
- Unpacking libxml2-dev:amd64 (2.9.14+dfsg-1.1+b2) ...
- Selecting previously unselected package libgtksourceview-3.0-dev:amd64.
- Preparing to unpack .../213-libgtksourceview-3.0-dev_3.24.11-2+b1_amd64.deb ...
- Unpacking libgtksourceview-3.0-dev:amd64 (3.24.11-2+b1) ...
- Selecting previously unselected package libpng-tools.
- Preparing to unpack .../214-libpng-tools_1.6.39-2_amd64.deb ...
- Unpacking libpng-tools (1.6.39-2) ...
- Selecting previously unselected package librsvg2-2:amd64.
- Preparing to unpack .../215-librsvg2-2_2.54.5+dfsg-1_amd64.deb ...
- Unpacking librsvg2-2:amd64 (2.54.5+dfsg-1) ...
- Selecting previously unselected package librsvg2-common:amd64.
- Preparing to unpack .../216-librsvg2-common_2.54.5+dfsg-1_amd64.deb ...
- Unpacking librsvg2-common:amd64 (2.54.5+dfsg-1) ...
- Selecting previously unselected package xdg-user-dirs.
- Preparing to unpack .../217-xdg-user-dirs_0.18-1_amd64.deb ...
- Unpacking xdg-user-dirs (0.18-1) ...
- Setting up media-types (8.0.0) ...
- Setting up libgraphite2-3:amd64 (1.3.14-1) ...
- Setting up libxcb-dri3-0:amd64 (1.15-1) ...
- Setting up liblcms2-2:amd64 (2.14-1+b1) ...
- Setting up libpixman-1-0:amd64 (0.42.2-1) ...
- Setting up libwayland-server0:amd64 (1.21.0-1) ...
- Setting up libx11-xcb1:amd64 (2:1.8.3-3) ...
- Setting up libpciaccess0:amd64 (0.17-2) ...
- Setting up systemd-sysv (252.4-1) ...
- Setting up libpixman-1-dev:amd64 (0.42.2-1) ...
- Setting up libxdamage1:amd64 (1:1.1.6-1) ...
- Setting up libicu72:amd64 (72.1-3) ...
- Setting up libxcb-xfixes0:amd64 (1.15-1) ...
- Setting up libzstd-dev:amd64 (1.5.2+dfsg2-3) ...
- Setting up libglvnd-core-dev:amd64 (1.6.0-1) ...
- Setting up hicolor-icon-theme (0.17-2) ...
- Setting up libxi6:amd64 (2:1.8-1+b1) ...
- Setting up libxrender1:amd64 (1:0.9.10-1.1) ...
- Setting up libdatrie1:amd64 (0.2.13-2+b1) ...
- Setting up xdg-user-dirs (0.18-1) ...
- Setting up libpng-tools (1.6.39-2) ...
- Setting up libxcb-render0:amd64 (1.15-1) ...
- Setting up libglib2.0-0:amd64 (2.74.4-1) ...
- Setting up fontconfig-config (2.14.1-3) ...
- Installing new version of config file /etc/fonts/conf.d/README ...
- Installing new version of config file /etc/fonts/fonts.conf ...
- Setting up libglvnd0:amd64 (1.6.0-1) ...
- Setting up libxcb-glx0:amd64 (1.15-1) ...
- Setting up libwebpdemux2:amd64 (1.2.2-2+b3) ...
- Setting up libgdk-pixbuf2.0-common (2.42.10+dfsg-1) ...
- Setting up x11-common (1:7.7+23) ...
- invoke-rc.d: could not determine current runlevel
- invoke-rc.d: policy-rc.d denied execution of restart.
- Setting up libsensors-config (1:3.6.0-7.1) ...
- Setting up libjbig-dev:amd64 (2.1-6.1) ...
- Setting up m4 (1.4.19-2) ...
- Setting up libnss-systemd:amd64 (252.4-1) ...
- Setting up xkb-data (2.35.1-1) ...
- Setting up liblzo2-2:amd64 (2.10-2) ...
- Setting up libxcb-shm0:amd64 (1.15-1) ...
- Setting up libffi-dev:amd64 (3.4.4-1) ...
- Setting up libpcre2-16-0:amd64 (10.42-1) ...
- Setting up libcolord2:amd64 (1.4.6-2.1) ...
- Setting up libopengl0:amd64 (1.6.0-1) ...
- Setting up libxxf86vm1:amd64 (1:1.1.4-1+b2) ...
- Setting up libxcb-present0:amd64 (1.15-1) ...
- Setting up libdconf1:amd64 (0.40.0-4) ...
- Setting up libxcb-shm0-dev:amd64 (1.15-1) ...
- Setting up libgraphite2-dev:amd64 (1.3.14-1) ...
- Setting up autotools-dev (20220109.1) ...
- Setting up libz3-4:amd64 (4.8.12-3) ...
- Setting up libpcre2-32-0:amd64 (10.42-1) ...
- Setting up libglib2.0-data (2.74.4-1) ...
- Setting up libpkgconf3:amd64 (1.8.0-12) ...
- Setting up libgmpxx4ldbl:amd64 (2:6.2.1+dfsg1-1.1) ...
- Setting up libgles2:amd64 (1.6.0-1) ...
- Setting up libexpat1-dev:amd64 (2.5.0-1) ...
- Setting up libjpeg62-turbo-dev:amd64 (1:2.1.2-1+b1) ...
- Setting up libepoxy0:amd64 (1.5.10-1) ...
- Setting up libxfixes3:amd64 (1:6.0.0-2) ...
- Setting up libxcb-sync1:amd64 (1.15-1) ...
- Setting up uuid-dev:amd64 (2.38.1-4) ...
- Setting up libavahi-common-data:amd64 (0.8-7) ...
- Setting up libgles1:amd64 (1.6.0-1) ...
- Setting up libdbus-1-3:amd64 (1.14.4-1) ...
- Setting up libfribidi0:amd64 (1.0.8-2.1) ...
- Setting up libxinerama1:amd64 (2:1.1.4-3) ...
- Setting up systemd-timesyncd (252.4-1) ...
- Creating group 'systemd-timesync' with GID 997.
- Creating user 'systemd-timesync' (systemd Time Synchronization) with UID 997 and GID 997.
- Created symlink /etc/systemd/system/dbus-org.freedesktop.timesync1.service → /lib/systemd/system/systemd-timesyncd.service.
- Created symlink /etc/systemd/system/sysinit.target.wants/systemd-timesyncd.service → /lib/systemd/system/systemd-timesyncd.service.
- Setting up libxrandr2:amd64 (2:1.5.2-2+b1) ...
- Setting up icu-devtools (72.1-3) ...
- Setting up libsepol-dev:amd64 (3.4-2) ...
- Setting up libxcb-render0-dev:amd64 (1.15-1) ...
- Setting up pkgconf-bin (1.8.0-12) ...
- Setting up libsensors5:amd64 (1:3.6.0-7.1) ...
- Setting up liblerc-dev:amd64 (4.0.0+ds-2) ...
- Setting up libglapi-mesa:amd64 (22.3.3-1) ...
- Setting up autoconf (2.71-2) ...
- Setting up libxext-dev:amd64 (2:1.3.4-1+b1) ...
- Setting up liblzma-dev:amd64 (5.4.1-0.0) ...
- Setting up libxcb-dri2-0:amd64 (1.15-1) ...
- Setting up zlib1g-dev:amd64 (1:1.2.13.dfsg-1) ...
- Setting up libpcre2-posix3:amd64 (10.42-1) ...
- Setting up wayland-protocols (1.31-1) ...
- Setting up libxshmfence1:amd64 (1.3-1) ...
- Setting up at-spi2-common (2.46.0-4) ...
- Setting up libxcb-randr0:amd64 (1.15-1) ...
- Setting up dbus-session-bus-common (1.14.4-1) ...
- Setting up libgtksourceview-3.0-common (3.24.11-2) ...
- Setting up libmpdec3:amd64 (2.5.1-2) ...
- Setting up libharfbuzz0b:amd64 (6.0.0-1) ...
- Setting up libthai-data (0.1.29-1) ...
- Setting up libgirepository-1.0-1:amd64 (1.74.0-2+b1) ...
- Setting up sgml-base (1.31) ...
- Setting up libatk1.0-0:amd64 (2.46.0-4) ...
- Setting up libwayland-egl1:amd64 (1.21.0-1) ...
- Setting up libfontconfig1:amd64 (2.14.1-3) ...
- Setting up libopengl-dev:amd64 (1.6.0-1) ...
- Setting up dbus-system-bus-common (1.14.4-1) ...
- Setting up libwebpmux3:amd64 (1.2.2-2+b3) ...
- Setting up libtiffxx6:amd64 (4.5.0-3) ...
- Setting up libdeflate-dev:amd64 (1.14-1) ...
- Setting up libdrm-common (2.4.114-1) ...
- Setting up libelf1:amd64 (0.188-2) ...
- Setting up libxcomposite1:amd64 (1:0.4.5-1) ...
- Setting up libxrender-dev:amd64 (1:0.9.10-1.1) ...
- Setting up libicu-dev:amd64 (72.1-3) ...
- Setting up libxml2:amd64 (2.9.14+dfsg-1.1+b2) ...
- Setting up dbus-bin (1.14.4-1) ...
- Setting up libbrotli-dev:amd64 (1.0.9-2+b5) ...
- Setting up libxkbcommon0:amd64 (1.5.0-1) ...
- Setting up libwayland-client0:amd64 (1.21.0-1) ...
- Setting up automake (1:1.16.5-1.3) ...
- update-alternatives: using /usr/bin/automake-1.16 to provide /usr/bin/automake (automake) in auto mode
- Setting up libblkid-dev:amd64 (2.38.1-4) ...
- Setting up libice6:amd64 (2:1.0.10-1) ...
- Setting up fontconfig (2.14.1-3) ...
- Regenerating fonts cache... 
- done.
- Setting up libxft2:amd64 (2.3.6-1) ...
- Setting up libharfbuzz-icu0:amd64 (6.0.0-1) ...
- Setting up libgmp-dev:amd64 (2:6.2.1+dfsg1-1.1) ...
- Setting up libpcre2-dev:amd64 (10.42-1) ...
- Setting up libice-dev:amd64 (2:1.0.10-1) ...
- Setting up libselinux1-dev:amd64 (3.4-1+b4) ...
- Setting up libxtst6:amd64 (2:1.2.3-1.1) ...
- Setting up libfribidi-dev:amd64 (1.0.8-2.1) ...
- Setting up libpython3.11-stdlib:amd64 (3.11.1-2) ...
- Setting up libxkbcommon-dev:amd64 (1.5.0-1) ...
- Setting up libxcursor1:amd64 (1:1.2.1-1) ...
- Setting up libpng-dev:amd64 (1.6.39-2) ...
- Setting up libavahi-common3:amd64 (0.8-7) ...
- Setting up libjpeg-dev:amd64 (1:2.1.2-1+b1) ...
- Setting up libglib2.0-bin (2.74.4-1) ...
- Setting up dbus-daemon (1.14.4-1) ...
- Setting up libharfbuzz-gobject0:amd64 (6.0.0-1) ...
- Setting up libatspi2.0-0:amd64 (2.46.0-4) ...
- Setting up libcairo2:amd64 (1.16.0-7) ...
- Setting up pkgconf:amd64 (1.8.0-12) ...
- Setting up libfreetype-dev:amd64 (2.12.1+dfsg-4) ...
- Setting up libxfixes-dev:amd64 (1:6.0.0-2) ...
- Setting up libatk-bridge2.0-0:amd64 (2.46.0-4) ...
- Setting up libthai0:amd64 (0.1.29-1) ...
- Setting up libwayland-bin (1.21.0-1) ...
- Setting up libxrandr-dev:amd64 (2:1.5.2-2+b1) ...
- Setting up libxml2-dev:amd64 (2.9.14+dfsg-1.1+b2) ...
- Setting up libwebp-dev:amd64 (1.2.2-2+b3) ...
- Setting up libtiff-dev:amd64 (4.5.0-3) ...
- Setting up dbus (1.14.4-1) ...
- invoke-rc.d: could not determine current runlevel
- invoke-rc.d: policy-rc.d denied execution of start.
- Setting up shared-mime-info (2.2-1) ...
- Setting up pkg-config:amd64 (1.8.0-12) ...
- Setting up libxinerama-dev:amd64 (2:1.1.4-3) ...
- Setting up gir1.2-glib-2.0:amd64 (1.74.0-2+b1) ...
- Setting up libdrm2:amd64 (2.4.114-1) ...
- Setting up libdatrie-dev:amd64 (0.2.13-2+b1) ...
- Setting up libwayland-cursor0:amd64 (1.21.0-1) ...
- Setting up xml-core (0.18+nmu1) ...
- Setting up libllvm15:amd64 (1:15.0.6-4+b1) ...
- Setting up libpam-systemd:amd64 (252.4-1) ...
- Setting up libgdk-pixbuf-2.0-0:amd64 (2.42.10+dfsg-1+b1) ...
- Setting up libcairo-gobject2:amd64 (1.16.0-7) ...
- Setting up libxi-dev:amd64 (2:1.8-1+b1) ...
- Setting up libsm6:amd64 (2:1.2.3-1) ...
- Setting up libavahi-client3:amd64 (0.8-7) ...
- Setting up libmount-dev:amd64 (2.38.1-4) ...
- Setting up libpython3-stdlib:amd64 (3.11.1-1) ...
- Setting up libdrm-amdgpu1:amd64 (2.4.114-1) ...
- Setting up libxtst-dev:amd64 (2:1.2.3-1.1) ...
- Setting up libxdamage-dev:amd64 (1:1.1.6-1) ...
- Setting up libcairo-script-interpreter2:amd64 (1.16.0-7) ...
- Setting up gtk-update-icon-cache (3.24.36-1) ...
- Setting up python3.11 (3.11.1-2) ...
- Setting up libdrm-nouveau2:amd64 (2.4.114-1) ...
- Setting up gir1.2-freedesktop:amd64 (1.74.0-2+b1) ...
- Setting up gir1.2-gdkpixbuf-2.0:amd64 (2.42.10+dfsg-1+b1) ...
- Setting up libgbm1:amd64 (22.3.3-1) ...
- Setting up libfontconfig-dev:amd64 (2.14.1-3) ...
- Setting up gir1.2-atk-1.0:amd64 (2.46.0-4) ...
- Setting up libsm-dev:amd64 (2:1.2.3-1) ...
- Setting up libdrm-radeon1:amd64 (2.4.114-1) ...
- Setting up libxcomposite-dev:amd64 (1:0.4.5-1) ...
- Setting up libxcursor-dev:amd64 (1:1.2.1-1) ...
- Setting up libpango-1.0-0:amd64 (1.50.12+ds-1) ...
- Setting up libdrm-intel1:amd64 (2.4.114-1) ...
- Setting up libgl1-mesa-dri:amd64 (22.3.3-1) ...
- Setting up python3 (3.11.1-1) ...
- running python rtupdate hooks for python3.11...
- running python post-rtupdate hooks for python3.11...
- Setting up gir1.2-atspi-2.0:amd64 (2.46.0-4) ...
- Setting up libwayland-dev:amd64 (1.21.0-1) ...
- Setting up gir1.2-harfbuzz-0.0:amd64 (6.0.0-1) ...
- Setting up dbus-user-session (1.14.4-1) ...
- Setting up libegl-mesa0:amd64 (22.3.3-1) ...
- Setting up adwaita-icon-theme (43-1) ...
- update-alternatives: using /usr/share/icons/Adwaita/cursor.theme to provide /usr/share/icons/default/index.theme (x-cursor-theme) in auto mode
- Setting up libthai-dev:amd64 (0.1.29-1) ...
- Setting up libcups2:amd64 (2.4.2-1+b2) ...
- Setting up libgdk-pixbuf2.0-bin (2.42.10+dfsg-1+b1) ...
- Setting up libegl1:amd64 (1.6.0-1) ...
- Setting up libpangoft2-1.0-0:amd64 (1.50.12+ds-1) ...
- Setting up python3-lib2to3 (3.10.8-1) ...
- Setting up libpangocairo-1.0-0:amd64 (1.50.12+ds-1) ...
- Setting up libxft-dev:amd64 (2.3.6-1) ...
- Setting up python3-distutils (3.10.8-1) ...
- Setting up libglib2.0-dev-bin (2.74.4-1) ...
- Setting up libglx-mesa0:amd64 (22.3.3-1) ...
- Setting up libpangoxft-1.0-0:amd64 (1.50.12+ds-1) ...
- Setting up libglx0:amd64 (1.6.0-1) ...
- Setting up pango1.0-tools (1.50.12+ds-1) ...
- Setting up dconf-service (0.40.0-4) ...
- Setting up librsvg2-2:amd64 (2.54.5+dfsg-1) ...
- Setting up gir1.2-pango-1.0:amd64 (1.50.12+ds-1) ...
- Setting up libgl1:amd64 (1.6.0-1) ...
- Setting up libglib2.0-dev:amd64 (2.74.4-1) ...
- Setting up librsvg2-common:amd64 (2.54.5+dfsg-1) ...
- Setting up libglx-dev:amd64 (1.6.0-1) ...
- Setting up libcairo2-dev:amd64 (1.16.0-7) ...
- Setting up libgl-dev:amd64 (1.6.0-1) ...
- Setting up libatk1.0-dev:amd64 (2.46.0-4) ...
- Setting up libgdk-pixbuf-2.0-dev:amd64 (2.42.10+dfsg-1+b1) ...
- Setting up libharfbuzz-dev:amd64 (6.0.0-1) ...
- Setting up dconf-gsettings-backend:amd64 (0.40.0-4) ...
- Setting up libegl-dev:amd64 (1.6.0-1) ...
- Setting up libepoxy-dev:amd64 (1.5.10-1) ...
- Setting up libpango1.0-dev:amd64 (1.50.12+ds-1) ...
- Setting up libgles-dev:amd64 (1.6.0-1) ...
- Setting up libgtk-3-common (3.24.36-1) ...
- Setting up gsettings-desktop-schemas (43.0-1) ...
- Setting up libgtk-3-0:amd64 (3.24.36-1) ...
- Setting up gir1.2-gtk-3.0:amd64 (3.24.36-1) ...
- Setting up libglvnd-dev:amd64 (1.6.0-1) ...
- Setting up libgtk-3-bin (3.24.36-1) ...
- Setting up libgtksourceview-3.0-1:amd64 (3.24.11-2+b1) ...
- Setting up gir1.2-gtksource-3.0:amd64 (3.24.11-2+b1) ...
- Setting up at-spi2-core (2.46.0-4) ...
- Setting up libegl1-mesa-dev:amd64 (22.3.3-1) ...
- Processing triggers for libc-bin (2.36-8) ...
- Processing triggers for systemd (252.4-1) ...
- Processing triggers for sgml-base (1.31) ...
- Setting up libdbus-1-dev:amd64 (1.14.4-1) ...
- Setting up libatspi2.0-dev:amd64 (2.46.0-4) ...
- Setting up libatk-bridge2.0-dev:amd64 (2.46.0-4) ...
- Setting up libgtk-3-dev:amd64 (3.24.36-1) ...
- Setting up libgtksourceview-3.0-dev:amd64 (3.24.11-2+b1) ...
- Processing triggers for libgdk-pixbuf-2.0-0:amd64 (2.42.10+dfsg-1+b1) ...

<><> Processing actions <><><><><><><><><><><><><><><><><><><><><><><><><><><><>
Processing  1/84: [alt-ergo-lib.2.4.2, alt-ergo-parsers.2.4.2, altgr-ergo.2.4.2: http]
Processing  2/84: [alt-ergo-lib.2.4.2, alt-ergo-parsers.2.4.2, altgr-ergo.2.4.2: http] [cairo2.0.6.4: http]
Processing  3/84: [alt-ergo-lib.2.4.2, alt-ergo-parsers.2.4.2, altgr-ergo.2.4.2: http] [cairo2.0.6.4: http]
-> retrieved camlp-streams.5.0.1  (cached)
Processing  4/84: [alt-ergo-lib.2.4.2, alt-ergo-parsers.2.4.2, altgr-ergo.2.4.2: http] [cairo2.0.6.4: http]
-> retrieved camlzip.1.11  (cached)
Processing  5/84: [alt-ergo-lib.2.4.2, alt-ergo-parsers.2.4.2, altgr-ergo.2.4.2: http] [cairo2.0.6.4: http]
-> retrieved cmdliner.1.1.1  (cached)
Processing  6/84: [alt-ergo-lib.2.4.2, alt-ergo-parsers.2.4.2, altgr-ergo.2.4.2: http] [cairo2.0.6.4: http]
Processing  7/84: [alt-ergo-lib.2.4.2, alt-ergo-parsers.2.4.2, altgr-ergo.2.4.2: http] [cairo2.0.6.4: http]
Processing  8/84: [alt-ergo-lib.2.4.2, alt-ergo-parsers.2.4.2, altgr-ergo.2.4.2: http] [cairo2.0.6.4: http]
Processing  9/84: [alt-ergo-lib.2.4.2, alt-ergo-parsers.2.4.2, altgr-ergo.2.4.2: http] [cairo2.0.6.4: http]
Processing 10/84: [alt-ergo-lib.2.4.2, alt-ergo-parsers.2.4.2, altgr-ergo.2.4.2: http] [cairo2.0.6.4: http]
Processing 11/84: [alt-ergo-lib.2.4.2, alt-ergo-parsers.2.4.2, altgr-ergo.2.4.2: http] [cairo2.0.6.4: http]
Processing 12/84: [alt-ergo-lib.2.4.2, alt-ergo-parsers.2.4.2, altgr-ergo.2.4.2: http] [cairo2.0.6.4: http]
Processing 13/84: [alt-ergo-lib.2.4.2, alt-ergo-parsers.2.4.2, altgr-ergo.2.4.2: http] [cairo2.0.6.4: http]
Processing 14/84: [alt-ergo-lib.2.4.2, alt-ergo-parsers.2.4.2, altgr-ergo.2.4.2: http] [cairo2.0.6.4: http]
Processing 15/84: [alt-ergo-lib.2.4.2, alt-ergo-parsers.2.4.2, altgr-ergo.2.4.2: http] [cairo2.0.6.4: http] [cmdliner: make all]
Processing 16/84: [alt-ergo-lib.2.4.2, alt-ergo-parsers.2.4.2, altgr-ergo.2.4.2: http] [cairo2.0.6.4: http] [cmdliner: make all] [conf-gmp: sh]
Processing 17/84: [alt-ergo-lib.2.4.2, alt-ergo-parsers.2.4.2, altgr-ergo.2.4.2: http] [cairo2.0.6.4: http] [cmdliner: make all] [conf-gmp: sh] [conf-pkg-config: pkg-config]
Processing 18/84: [alt-ergo-lib.2.4.2, alt-ergo-parsers.2.4.2, altgr-ergo.2.4.2: http] [cairo2.0.6.4: http] [cmdliner: make all] [conf-gmp: sh] [conf-pkg-config: pkg-config] [conf-which: which which]
-> retrieved csexp.1.5.1  (cached)
Processing 19/84: [alt-ergo-lib.2.4.2, alt-ergo-parsers.2.4.2, altgr-ergo.2.4.2: http] [cairo2.0.6.4: http] [cmdliner: make all] [conf-gmp: sh] [conf-pkg-config: pkg-config] [conf-which: which which]
+ /home/opam/.opam/opam-init/hooks/sandbox.sh "build" "pkg-config" "--help" (CWD=/home/opam/.opam/5.1/.opam-switch/build/conf-pkg-config.2)
- usage: pkgconf [OPTIONS] [LIBRARIES]
- 
- basic options:
- 
-   --help                            this message
-   --about                           print pkgconf version and license to stdout
-   --version                         print supported pkg-config version to stdout
-   --atleast-pkgconfig-version       check whether or not pkgconf is compatible
-                                     with a specified pkg-config version
-   --errors-to-stdout                print all errors on stdout instead of stderr
-   --print-errors                    ensure all errors are printed
-   --short-errors                    be less verbose about some errors
-   --silence-errors                  explicitly be silent about errors
-   --list-all                        list all known packages
-   --list-package-names              list all known package names
-   --simulate                        simulate walking the calculated dependency graph
-   --no-cache                        do not cache already seen packages when
-                                     walking the dependency graph
-   --log-file=filename               write an audit log to a specified file
-   --with-path=path                  adds a directory to the search path
-   --define-prefix                   override the prefix variable with one that is guessed based on
-                                     the location of the .pc file
-   --dont-define-prefix              do not override the prefix variable under any circumstances
-   --prefix-variable=varname         sets the name of the variable that pkgconf considers
-                                     to be the package prefix
-   --relocate=path                   relocates a path and exits (mostly for testsuite)
-   --dont-relocate-paths             disables path relocation support
- 
- cross-compilation personality support:
- 
-   --personality=triplet|filename    sets the personality to 'triplet' or a file named 'filename'
-   --dump-personality                dumps details concerning selected personality
- 
- checking specific pkg-config database entries:
- 
-   --atleast-version                 require a specific version of a module
-   --exact-version                   require an exact version of a module
-   --max-version                     require a maximum version of a module
-   --exists                          check whether or not a module exists
-   --uninstalled                     check whether or not an uninstalled module will be used
-   --no-uninstalled                  never use uninstalled modules when satisfying dependencies
-   --no-provides                     do not use 'provides' rules to resolve dependencies
-   --maximum-traverse-depth          maximum allowed depth for dependency graph
-   --static                          be more aggressive when computing dependency graph
-                                     (for static linking)
-   --shared                          use a simplified dependency graph (usually default)
-   --pure                            optimize a static dependency graph as if it were a normal
-                                     dependency graph
-   --env-only                        look only for package entries in PKG_CONFIG_PATH
-   --ignore-conflicts                ignore 'conflicts' rules in modules
-   --validate                        validate specific .pc files for correctness
- 
- querying specific pkg-config database fields:
- 
-   --define-variable=varname=value   define variable 'varname' as 'value'
-   --variable=varname                print specified variable entry to stdout
-   --cflags                          print required CFLAGS to stdout
-   --cflags-only-I                   print required include-dir CFLAGS to stdout
-   --cflags-only-other               print required non-include-dir CFLAGS to stdout
-   --libs                            print required linker flags to stdout
-   --libs-only-L                     print required LDPATH linker flags to stdout
-   --libs-only-l                     print required LIBNAME linker flags to stdout
-   --libs-only-other                 print required other linker flags to stdout
-   --print-requires                  print required dependency frameworks to stdout
-   --print-requires-private          print required dependency frameworks for static
-                                     linking to stdout
-   --print-provides                  print provided dependencies to stdout
-   --print-variables                 print all known variables in module to stdout
-   --digraph                         print entire dependency graph in graphviz 'dot' format
-   --keep-system-cflags              keep -I/usr/include entries in cflags output
-   --keep-system-libs                keep -L/lib:/lib/i386-linux-gnu:/lib/x86_64-linux-gnu:/lib/x86_64-linux-gnux32:/lib32:/libx32:/usr/lib:/usr/lib/i386-linux-gnu:/usr/lib/x86_64-linux-gnu:/usr/lib/x86_64-linux-gnux32:/usr/lib32:/usr/libx32 entries in libs output
-   --path                            show the exact filenames for any matching .pc files
-   --modversion                      print the specified module's version to stdout
-   --internal-cflags                 do not filter 'internal' cflags from output
- 
- filtering output:
- 
-   --msvc-syntax                     print translatable fragments in MSVC syntax
-   --fragment-filter=types           filter output fragments to the specified types
- 
- report bugs to <https://github.com/pkgconf/pkgconf/issues/new>.
-> compiled  conf-pkg-config.2
Processing 19/84: [alt-ergo-lib.2.4.2, alt-ergo-parsers.2.4.2, altgr-ergo.2.4.2: http] [cairo2.0.6.4: http] [cmdliner: make all] [conf-gmp: sh] [conf-which: which which]
Processing 20/84: [alt-ergo-lib.2.4.2, alt-ergo-parsers.2.4.2, altgr-ergo.2.4.2: http] [cairo2.0.6.4: http] [cmdliner: make all] [conf-gmp: sh] [conf-which: which which] [conf-pkg-config: mkdir]
Processing 20/84: [cairo2.0.6.4: http] [cmdliner: make all] [conf-gmp: sh] [conf-which: which which] [conf-pkg-config: mkdir]
Processing 20/84: [cmdliner: make all] [conf-gmp: sh] [conf-which: which which] [conf-pkg-config: mkdir]
+ /home/opam/.opam/opam-init/hooks/sandbox.sh "build" "sh" "-exc" "cc -c $CFLAGS -I/usr/local/include test.c" (CWD=/home/opam/.opam/5.1/.opam-switch/build/conf-gmp.4)
- + cc -c -I/usr/local/include test.c
-> compiled  conf-gmp.4
Processing 20/84: [cmdliner: make all] [conf-which: which which] [conf-pkg-config: mkdir]
+ /home/opam/.opam/opam-init/hooks/sandbox.sh "build" "which" "which" (CWD=/home/opam/.opam/5.1/.opam-switch/build/conf-which.1)
- /usr/bin/which
-> compiled  conf-which.1
Processing 20/84: [cmdliner: make all] [conf-pkg-config: mkdir]
-> retrieved dune.3.6.1, dune-configurator.3.6.1  (cached)
Processing 21/84: [lablgtk3.3.1.3, lablgtk3-sourceview3.3.1.3: http] [cmdliner: make all] [conf-pkg-config: mkdir]
Processing 22/84: [lablgtk3.3.1.3, lablgtk3-sourceview3.3.1.3: http] [cmdliner: make all] [dune: ocaml 127] [conf-pkg-config: mkdir]
+ /home/opam/.opam/opam-init/hooks/sandbox.sh "build" "make" "all" "PREFIX=/home/opam/.opam/5.1" (CWD=/home/opam/.opam/5.1/.opam-switch/build/cmdliner.1.1.1)
- ocaml build.ml cma
- ocaml build.ml cmxa
- ocaml build.ml cmxs
-> compiled  cmdliner.1.1.1
Processing 22/84: [lablgtk3.3.1.3, lablgtk3-sourceview3.3.1.3: http] [dune: ocaml 127] [conf-pkg-config: mkdir]
+ /home/opam/.opam/opam-init/hooks/sandbox.sh "install" "mkdir" "-p" "/home/opam/.opam/5.1/lib/pkgconfig" (CWD=/home/opam/.opam/5.1/.opam-switch/build/conf-pkg-config.2)
-> installed conf-pkg-config.2
Processing 22/84: [lablgtk3.3.1.3, lablgtk3-sourceview3.3.1.3: http] [dune: ocaml 127]
Processing 23/84: [lablgtk3.3.1.3, lablgtk3-sourceview3.3.1.3: http] [conf-cairo: pkg-config cairo] [dune: ocaml 127]
Processing 24/84: [lablgtk3.3.1.3, lablgtk3-sourceview3.3.1.3: http] [conf-cairo: pkg-config cairo] [conf-gtk3: pkg-config 3.18] [dune: ocaml 127]
Processing 25/84: [lablgtk3.3.1.3, lablgtk3-sourceview3.3.1.3: http] [conf-cairo: pkg-config cairo] [conf-gtk3: pkg-config 3.18] [conf-gtksourceview3: pkg-config gtksourceview-3.0] [dune: ocaml 127]
Processing 26/84: [lablgtk3.3.1.3, lablgtk3-sourceview3.3.1.3: http] [conf-cairo: pkg-config cairo] [conf-gtk3: pkg-config 3.18] [conf-gtksourceview3: pkg-config gtksourceview-3.0] [conf-zlib: pkg-config zlib] [dune: ocaml 127]
Processing 27/84: [lablgtk3.3.1.3, lablgtk3-sourceview3.3.1.3: http] [conf-cairo: pkg-config cairo] [conf-gtk3: pkg-config 3.18] [conf-gtksourceview3: pkg-config gtksourceview-3.0] [conf-zlib: pkg-config zlib] [dune: ocaml 127] [cmdliner: make install]
-> retrieved alt-ergo-lib.2.4.2, alt-ergo-parsers.2.4.2, altgr-ergo.2.4.2  (https://github.com/OCamlPro/alt-ergo/archive/2.4.2.tar.gz)
Processing 28/84: [lablgtk3.3.1.3, lablgtk3-sourceview3.3.1.3: http] [conf-cairo: pkg-config cairo] [conf-gtk3: pkg-config 3.18] [conf-gtksourceview3: pkg-config gtksourceview-3.0] [conf-zlib: pkg-config zlib] [dune: ocaml 127] [cmdliner: make install]
-> retrieved cairo2.0.6.4  (https://github.com/Chris00/ocaml-cairo/releases/download/0.6.4/cairo2-0.6.4.tbz)
Processing 29/84: [lablgtk3.3.1.3, lablgtk3-sourceview3.3.1.3: http] [conf-cairo: pkg-config cairo] [conf-gtk3: pkg-config 3.18] [conf-gtksourceview3: pkg-config gtksourceview-3.0] [conf-zlib: pkg-config zlib] [dune: ocaml 127] [cmdliner: make install]
+ /home/opam/.opam/opam-init/hooks/sandbox.sh "build" "pkg-config" "cairo" (CWD=/home/opam/.opam/5.1/.opam-switch/build/conf-cairo.1)
-> compiled  conf-cairo.1
Processing 29/84: [lablgtk3.3.1.3, lablgtk3-sourceview3.3.1.3: http] [conf-gtk3: pkg-config 3.18] [conf-gtksourceview3: pkg-config gtksourceview-3.0] [conf-zlib: pkg-config zlib] [dune: ocaml 127] [cmdliner: make install]
+ /home/opam/.opam/opam-init/hooks/sandbox.sh "build" "pkg-config" "--short-errors" "--print-errors" "--atleast-version" "3.18" "gtk+-3.0" (CWD=/home/opam/.opam/5.1/.opam-switch/build/conf-gtk3.18)
-> compiled  conf-gtk3.18
Processing 29/84: [lablgtk3.3.1.3, lablgtk3-sourceview3.3.1.3: http] [conf-gtksourceview3: pkg-config gtksourceview-3.0] [conf-zlib: pkg-config zlib] [dune: ocaml 127] [cmdliner: make install]
+ /home/opam/.opam/opam-init/hooks/sandbox.sh "build" "pkg-config" "--short-errors" "--print-errors" "gtksourceview-3.0" (CWD=/home/opam/.opam/5.1/.opam-switch/build/conf-gtksourceview3.0+2)
-> compiled  conf-gtksourceview3.0+2
Processing 29/84: [lablgtk3.3.1.3, lablgtk3-sourceview3.3.1.3: http] [conf-zlib: pkg-config zlib] [dune: ocaml 127] [cmdliner: make install]
+ /home/opam/.opam/opam-init/hooks/sandbox.sh "build" "pkg-config" "zlib" (CWD=/home/opam/.opam/5.1/.opam-switch/build/conf-zlib.1)
-> compiled  conf-zlib.1
Processing 29/84: [lablgtk3.3.1.3, lablgtk3-sourceview3.3.1.3: http] [dune: ocaml 127] [cmdliner: make install]
+ /home/opam/.opam/opam-init/hooks/sandbox.sh "install" "make" "install" "LIBDIR=/home/opam/.opam/5.1/lib/cmdliner" "DOCDIR=/home/opam/.opam/5.1/doc/cmdliner" (CWD=/home/opam/.opam/5.1/.opam-switch/build/cmdliner.1.1.1)
- install -d /home/opam/.opam/5.1/lib/cmdliner
- install pkg/META _build/cmdliner.mli _build/cmdliner.cmi _build/cmdliner.cmti /home/opam/.opam/5.1/lib/cmdliner
- install cmdliner.opam /home/opam/.opam/5.1/lib/cmdliner/opam
- install _build/cmdliner.cma /home/opam/.opam/5.1/lib/cmdliner
- install _build/cmdliner.cmxa _build/cmdliner.a _build/cmdliner.cmx _build/cmdliner_arg.cmx _build/cmdliner_base.cmx _build/cmdliner_cline.cmx _build/cmdliner_cmd.cmx _build/cmdliner_docgen.cmx _build/cmdliner_eval.cmx _build/cmdliner_exit.cmx _build/cmdliner_info.cmx _build/cmdliner_manpage.cmx _build/cmdliner_msg.cmx _build/cmdliner_term.cmx _build/cmdliner_term_deprecated.cmx _build/cmdliner_trie.cmx \
-   /home/opam/.opam/5.1/lib/cmdliner
- install _build/cmdliner.cmxs /home/opam/.opam/5.1/lib/cmdliner
Processing 29/84: [lablgtk3.3.1.3, lablgtk3-sourceview3.3.1.3: http] [dune: ocaml 127] [cmdliner: make install-doc]
-> retrieved menhir.20220210, menhirLib.20220210, menhirSdk.20220210  (cached)
Processing 30/84: [lablgtk3.3.1.3, lablgtk3-sourceview3.3.1.3: http] [dune: ocaml 127] [cmdliner: make install-doc]
Processing 30/84: [dune: ocaml 127] [cmdliner: make install-doc]
-> retrieved num.1.4  (cached)
Processing 31/84: [dune: ocaml 127] [cmdliner: make install-doc]
+ /home/opam/.opam/opam-init/hooks/sandbox.sh "install" "make" "install-doc" "LIBDIR=/home/opam/.opam/5.1/lib/cmdliner" "DOCDIR=/home/opam/.opam/5.1/doc/cmdliner" (CWD=/home/opam/.opam/5.1/.opam-switch/build/cmdliner.1.1.1)
- install -d /home/opam/.opam/5.1/doc/cmdliner/odoc-pages
- install CHANGES.md LICENSE.md README.md /home/opam/.opam/5.1/doc/cmdliner
- install doc/index.mld doc/cli.mld doc/examples.mld doc/tutorial.mld \
-            doc/tool_man.mld /home/opam/.opam/5.1/doc/cmdliner/odoc-pages
-> installed cmdliner.1.1.1
Processing 31/84: [dune: ocaml 127]
-> installed conf-cairo.1
Processing 32/84: [dune: ocaml 127]
-> installed conf-gmp.4
Processing 33/84: [dune: ocaml 127]
-> installed conf-gtk3.18
Processing 34/84: [dune: ocaml 127]
-> installed conf-gtksourceview3.0+2
Processing 35/84: [dune: ocaml 127]
-> installed conf-which.1
Processing 36/84: [dune: ocaml 127]
Processing 37/84: [conf-autoconf: which autoconf] [dune: ocaml 127]
-> installed conf-zlib.1
Processing 38/84: [conf-autoconf: which autoconf] [dune: ocaml 127]
-> retrieved ocamlfind.1.9.5  (cached)
Processing 39/84: [conf-autoconf: which autoconf] [dune: ocaml 127]
[ocamlfind: patch] applying 0001-Fix-bug-when-installing-with-a-system-compiler.patch
Processing 40/84: [conf-autoconf: which autoconf] [dune: ocaml 127] [ocamlfind: patch]
-> retrieved ocplib-simplex.0.4  (cached)
Processing 41/84: [conf-autoconf: which autoconf] [dune: ocaml 127] [ocamlfind: patch]
Processing 42/84: [conf-autoconf: which autoconf] [dune: ocaml 127] [ocamlfind: patch]
Processing 43/84: [conf-autoconf: which autoconf] [dune: ocaml 127] [ocamlfind: patch]
-> installed seq.base
Processing 44/84: [conf-autoconf: which autoconf] [dune: ocaml 127] [ocamlfind: patch]
+ /home/opam/.opam/opam-init/hooks/sandbox.sh "build" "which" "autoconf" (CWD=/home/opam/.opam/5.1/.opam-switch/build/conf-autoconf.0.1)
- /usr/bin/autoconf
-> compiled  conf-autoconf.0.1
Processing 44/84: [dune: ocaml 127] [ocamlfind: patch]
-> installed conf-autoconf.0.1
Processing 45/84: [dune: ocaml 127] [ocamlfind: patch]
-> retrieved lablgtk3.3.1.3, lablgtk3-sourceview3.3.1.3  (https://github.com/garrigue/lablgtk/releases/download/3.1.3/lablgtk3-3.1.3.tbz)
Processing 46/84: [dune: ocaml 127] [ocamlfind: patch]
-> retrieved psmt2-frontend.0.4.0  (cached)
Processing 46/84: [dune: ocaml 127] [ocamlfind: ./configure]
-> retrieved stdlib-shims.0.3.0  (cached)
-> retrieved zarith.1.12  (cached)
+ /home/opam/.opam/opam-init/hooks/sandbox.sh "build" "./configure" "-bindir" "/home/opam/.opam/5.1/bin" "-sitelib" "/home/opam/.opam/5.1/lib" "-mandir" "/home/opam/.opam/5.1/man" "-config" "/home/opam/.opam/5.1/lib/findlib.conf" "-no-custom" "-no-camlp4" (CWD=/home/opam/.opam/5.1/.opam-switch/build/ocamlfind.1.9.5)
- Welcome to findlib version 1.9.5
- Configuring core...
- Checking for #remove_directory...
- Testing threading model...
- systhread_supported: true
- Testing DLLs...
- Testing whether ppxopt can be supported...
- Checking for ocamlc -opaque...
- Querying installation: META list not found
- make install will double-check installed META files
- Configuring libraries...
- unix: found (in +unix)
- dynlink: found (in +dynlink)
- bigarray: not present (possible since 4.08)
- compiler-libs: found
- dbm: not present (normal since 4.00)
- graphics: not present (normal since 4.09)
- num: not present (normal since 4.06)
- ocamlbuild: not present (normal since 4.03)
- ocamldoc: found (in +ocamldoc)
- raw_spacetime: not present (normal since 4.12)
- threads: found (in +threads)
- runtime_events: found (in +runtime_events)
- str: found (in +str)
- labltk: not present (normal since 4.02)
- native dynlink: found
- camlp4: disabled
- bytes: found, installing fake library
- Configuration for stdlib written to site-lib-src/stdlib/META
- Configuration for unix written to site-lib-src/unix/META
- Configuration for dynlink written to site-lib-src/dynlink/META
- Configuration for compiler-libs written to site-lib-src/compiler-libs/META
- Configuration for ocamldoc written to site-lib-src/ocamldoc/META
- Configuration for threads written to site-lib-src/threads/META
- Configuration for runtime_events written to site-lib-src/runtime_events/META
- Configuration for str written to site-lib-src/str/META
- Configuration for bytes written to site-lib-src/bytes/META
- Detecting compiler arguments: (extractor built) ok
- 
- About the OCAML core installation:
-     Standard library:      /home/opam/.opam/5.1/lib/ocaml
-     Binaries:              /home/opam/.opam/5.1/bin
-     Manual pages:          /home/opam/.opam/5.1/man
-     Multi-threading type:  posix
- The directory of site-specific packages will be
-     site-lib:              /home/opam/.opam/5.1/lib
- The configuration file is written to:
-     findlib config file:   /home/opam/.opam/5.1/lib/findlib.conf
- Software will be installed:
-     Libraries:             in <site-lib>/findlib
-     Binaries:              /home/opam/.opam/5.1/bin
-     Manual pages:          /home/opam/.opam/5.1/man
-     topfind script:        /home/opam/.opam/5.1/lib/ocaml
- Topfind ppxopt support:    yes
- Toolbox:                   no
- Link custom runtime:       no
- Need bytes compatibility:  no
- 
- Configuration has been written to Makefile.config
- 
- You can now do 'make all', and optionally 'make opt', to build ocamlfind.
Processing 46/84: [dune: ocaml 127] [ocamlfind: make all]
+ /home/opam/.opam/opam-init/hooks/sandbox.sh "build" "make" "all" (CWD=/home/opam/.opam/5.1/.opam-switch/build/ocamlfind.1.9.5)
- for p in findlib; do ( cd src/$p; make all ) || exit; done
- make[1]: Entering directory '/home/opam/.opam/5.1/.opam-switch/build/ocamlfind.1.9.5/src/findlib'
- ocamllex fl_meta.mll
- 22 states, 392 transitions, table size 1700 bytes
- USE_CYGPATH="0"; \
- export USE_CYGPATH; \
- cat findlib_config.mlp | \
-          ../../tools/patch '@CONFIGFILE@' '/home/opam/.opam/5.1/lib/findlib.conf' | \
-          ../../tools/patch '@STDLIB@' '/home/opam/.opam/5.1/lib/ocaml' | \
- 	sed -e 's;@AUTOLINK@;true;g' \
- 	    -e 's;@SYSTEM@;linux;g' \
- 	     >findlib_config.ml
- if [ "true" = "true" ]; then                 \
- 	cp topfind.ml.in topfind.ml;                             \
- else                                                             \
- 	sed -e '/PPXOPT_BEGIN/,/PPXOPT_END/ d' topfind.ml.in     \
- 		> topfind.ml ;                                   \
- fi
- ocamldep *.ml *.mli >depend
- ocamlc -I +compiler-libs -opaque   -I +unix -I +dynlink -g -c findlib_config.ml
- ocamlc -I +compiler-libs -opaque   -I +unix -I +dynlink -g -c fl_split.ml
- ocamlc -I +compiler-libs -opaque   -I +unix -I +dynlink -g -c fl_metatoken.ml
- ocamlc -I +compiler-libs -opaque   -I +unix -I +dynlink -g -c fl_meta.ml
- ocamlc -I +compiler-libs -opaque   -I +unix -I +dynlink -c fl_metascanner.mli
- ocamlc -I +compiler-libs -opaque   -I +unix -I +dynlink -g -c fl_metascanner.ml
- ocamlc -I +compiler-libs -opaque   -I +unix -I +dynlink -c fl_topo.mli
- ocamlc -I +compiler-libs -opaque   -I +unix -I +dynlink -g -c fl_topo.ml
- ocamlc -I +compiler-libs -opaque   -I +unix -I +dynlink -c fl_package_base.mli
- ocamlc -I +compiler-libs -opaque   -I +unix -I +dynlink -g -c fl_package_base.ml
- File "fl_package_base.ml", line 304, characters 22-40:
- 304 | 	 let pkg_ancestors = query_requirements predlist pkg in
-       	                     ^^^^^^^^^^^^^^^^^^
- Warning 6 [labels-omitted]: label preds was omitted in the application of this function.
- File "fl_package_base.ml", line 350, characters 18-36:
- 350 |   let ancestors = query_requirements predlist package_name in
-                         ^^^^^^^^^^^^^^^^^^
- Warning 6 [labels-omitted]: label preds was omitted in the application of this function.
- File "fl_package_base.ml", line 375, characters 23-41:
- 375 | 	  let pkg_ancestors = query_requirements predlist pkg in
-       	                      ^^^^^^^^^^^^^^^^^^
- Warning 6 [labels-omitted]: label preds was omitted in the application of this function.
- File "fl_package_base.ml", line 510, characters 16-35:
- 510 | 	     ( let c = package_definitions search_path pkg.package_name in
-       	               ^^^^^^^^^^^^^^^^^^^
- Warning 6 [labels-omitted]: label search_path was omitted in the application of this function.
- ocamlc -I +compiler-libs -opaque   -I +unix -I +dynlink -c findlib.mli
- ocamlc -I +compiler-libs -opaque   -I +unix -I +dynlink -g -c findlib.ml
- File "findlib.ml", line 390, characters 2-26:
- 390 |   Fl_package_base.requires predlist pkg
-         ^^^^^^^^^^^^^^^^^^^^^^^^
- Warning 6 [labels-omitted]: label preds was omitted in the application of this function.
- File "findlib.ml", line 396, characters 2-33:
- 396 |   Fl_package_base.requires_deeply predlist pkglist
-         ^^^^^^^^^^^^^^^^^^^^^^^^^^^^^^^
- Warning 6 [labels-omitted]: label preds was omitted in the application of this function.
- ocamlc -I +compiler-libs -opaque   -I +unix -I +dynlink -g -c fl_args.ml
- ocamlc -I +compiler-libs -opaque   -I +unix -I +dynlink -g -c fl_lint.ml
- ocamlc -I +compiler-libs -a -o findlib.cma findlib_config.cmo fl_split.cmo fl_metatoken.cmo fl_meta.cmo fl_metascanner.cmo fl_topo.cmo fl_package_base.cmo findlib.cmo fl_args.cmo fl_lint.cmo
- ocamlc -I +compiler-libs -opaque   -I +unix -I +dynlink -g -c ocaml_args.ml
- ocamlc -I +compiler-libs -opaque   -I +unix -I +dynlink -g -c frontend.ml
- File "frontend.ml", line 859, characters 10-39:
- 859 |           Fl_package_base.package_users predicates1 packages1
-                 ^^^^^^^^^^^^^^^^^^^^^^^^^^^^^
- Warning 6 [labels-omitted]: label preds was omitted in the application of this function.
- ocamlc -I +compiler-libs  -o ocamlfind -g findlib.cma unix.cma \
-            -I +unix -I +dynlink ocaml_args.cmo frontend.cmo
- ocamlc -I +compiler-libs -opaque   -I +unix -I +dynlink -c topfind.mli
- ocamlc -I +compiler-libs -opaque   -I +unix -I +dynlink -g -c topfind.ml
- File "topfind.ml", line 126, characters 40-63:
- 126 |                      match Hashtbl.find Toploop.directive_table "ppx" with
-                                               ^^^^^^^^^^^^^^^^^^^^^^^
- Alert deprecated: Toploop.directive_table
- File "topfind.ml", line 256, characters 4-27:
- 256 |     Toploop.directive_table
-           ^^^^^^^^^^^^^^^^^^^^^^^
- Alert deprecated: Toploop.directive_table
- File "topfind.ml", line 266, characters 4-27:
- 266 |     Toploop.directive_table
-           ^^^^^^^^^^^^^^^^^^^^^^^
- Alert deprecated: Toploop.directive_table
- File "topfind.ml", line 278, characters 4-27:
- 278 |     Toploop.directive_table
-           ^^^^^^^^^^^^^^^^^^^^^^^
- Alert deprecated: Toploop.directive_table
- File "topfind.ml", line 291, characters 4-27:
- 291 |     Toploop.directive_table
-           ^^^^^^^^^^^^^^^^^^^^^^^
- Alert deprecated: Toploop.directive_table
- File "topfind.ml", line 305, characters 4-27:
- 305 |     Toploop.directive_table
-           ^^^^^^^^^^^^^^^^^^^^^^^
- Alert deprecated: Toploop.directive_table
- File "topfind.ml", line 317, characters 4-27:
- 317 |     Toploop.directive_table
-           ^^^^^^^^^^^^^^^^^^^^^^^
- Alert deprecated: Toploop.directive_table
- ocamlc -I +compiler-libs -a -o findlib_top.cma topfind.cmo
- USE_CYGPATH="0"; \
- export USE_CYGPATH; \
- cat topfind_rd1.p | \
-          ../../tools/patch '@SITELIB@' '/home/opam/.opam/5.1/lib' \
-     	    >topfind
- ocamlc -I +compiler-libs -opaque   -I +unix -I +dynlink -c fl_dynload.mli
- ocamlc -I +compiler-libs -opaque   -I +unix -I +dynlink -g -c fl_dynload.ml
- ocamlc -I +compiler-libs -a -o findlib_dynload.cma fl_dynload.cmo
- make[1]: Leaving directory '/home/opam/.opam/5.1/.opam-switch/build/ocamlfind.1.9.5/src/findlib'
- make all-config
- make[1]: Entering directory '/home/opam/.opam/5.1/.opam-switch/build/ocamlfind.1.9.5'
- USE_CYGPATH="0"; \
- export USE_CYGPATH; \
- cat findlib.conf.in | \
-      tools/patch '@SITELIB@' '/home/opam/.opam/5.1/lib' >findlib.conf
- if ./tools/cmd_from_same_dir ocamlc; then \
- 	echo 'ocamlc="ocamlc.opt"' >>findlib.conf; \
- fi
- if ./tools/cmd_from_same_dir ocamlopt; then \
- 	echo 'ocamlopt="ocamlopt.opt"' >>findlib.conf; \
- fi
- if ./tools/cmd_from_same_dir ocamldep; then \
- 	echo 'ocamldep="ocamldep.opt"' >>findlib.conf; \
- fi
- if ./tools/cmd_from_same_dir ocamldoc; then \
- 	echo 'ocamldoc="ocamldoc.opt"' >>findlib.conf; \
- fi
- make[1]: Leaving directory '/home/opam/.opam/5.1/.opam-switch/build/ocamlfind.1.9.5'
Processing 46/84: [dune: ocaml 127] [ocamlfind: make opt]
+ /home/opam/.opam/opam-init/hooks/sandbox.sh "build" "make" "opt" (CWD=/home/opam/.opam/5.1/.opam-switch/build/ocamlfind.1.9.5)
- for p in findlib; do ( cd src/$p; make opt ) || exit; done
- make[1]: Entering directory '/home/opam/.opam/5.1/.opam-switch/build/ocamlfind.1.9.5/src/findlib'
- ocamlopt -I +compiler-libs -g -opaque  -I +unix -I +dynlink -c findlib_config.ml
- ocamlopt -I +compiler-libs -g -opaque  -I +unix -I +dynlink -c fl_split.ml
- ocamlopt -I +compiler-libs -g -opaque  -I +unix -I +dynlink -c fl_metatoken.ml
- ocamlopt -I +compiler-libs -g -opaque  -I +unix -I +dynlink -c fl_meta.ml
- ocamlopt -I +compiler-libs -g -opaque  -I +unix -I +dynlink -c fl_metascanner.ml
- ocamlopt -I +compiler-libs -g -opaque  -I +unix -I +dynlink -c fl_topo.ml
- ocamlopt -I +compiler-libs -g -opaque  -I +unix -I +dynlink -c fl_package_base.ml
- File "fl_package_base.ml", line 304, characters 22-40:
- 304 | 	 let pkg_ancestors = query_requirements predlist pkg in
-       	                     ^^^^^^^^^^^^^^^^^^
- Warning 6 [labels-omitted]: label preds was omitted in the application of this function.
- File "fl_package_base.ml", line 350, characters 18-36:
- 350 |   let ancestors = query_requirements predlist package_name in
-                         ^^^^^^^^^^^^^^^^^^
- Warning 6 [labels-omitted]: label preds was omitted in the application of this function.
- File "fl_package_base.ml", line 375, characters 23-41:
- 375 | 	  let pkg_ancestors = query_requirements predlist pkg in
-       	                      ^^^^^^^^^^^^^^^^^^
- Warning 6 [labels-omitted]: label preds was omitted in the application of this function.
- File "fl_package_base.ml", line 510, characters 16-35:
- 510 | 	     ( let c = package_definitions search_path pkg.package_name in
-       	               ^^^^^^^^^^^^^^^^^^^
- Warning 6 [labels-omitted]: label search_path was omitted in the application of this function.
- ocamlopt -I +compiler-libs -g -opaque  -I +unix -I +dynlink -c findlib.ml
- File "findlib.ml", line 390, characters 2-26:
- 390 |   Fl_package_base.requires predlist pkg
-         ^^^^^^^^^^^^^^^^^^^^^^^^
- Warning 6 [labels-omitted]: label preds was omitted in the application of this function.
- File "findlib.ml", line 396, characters 2-33:
- 396 |   Fl_package_base.requires_deeply predlist pkglist
-         ^^^^^^^^^^^^^^^^^^^^^^^^^^^^^^^
- Warning 6 [labels-omitted]: label preds was omitted in the application of this function.
- ocamlopt -I +compiler-libs -g -opaque  -I +unix -I +dynlink -c fl_args.ml
- ocamlopt -I +compiler-libs -g -opaque  -I +unix -I +dynlink -c fl_lint.ml
- ocamlopt -I +compiler-libs -g -a -o findlib.cmxa findlib_config.cmx fl_split.cmx fl_metatoken.cmx fl_meta.cmx fl_metascanner.cmx fl_topo.cmx fl_package_base.cmx findlib.cmx fl_args.cmx fl_lint.cmx
- if [ 1 -gt 0 ]; then \
-     ocamlopt -I +compiler-libs -g -shared -o findlib.cmxs findlib_config.cmx fl_split.cmx fl_metatoken.cmx fl_meta.cmx fl_metascanner.cmx fl_topo.cmx fl_package_base.cmx findlib.cmx fl_args.cmx fl_lint.cmx; \
- fi
- ocamlopt -I +compiler-libs -g -opaque  -I +unix -I +dynlink -c ocaml_args.ml
- ocamlopt -I +compiler-libs -g -opaque  -I +unix -I +dynlink -c frontend.ml
- File "frontend.ml", line 859, characters 10-39:
- 859 |           Fl_package_base.package_users predicates1 packages1
-                 ^^^^^^^^^^^^^^^^^^^^^^^^^^^^^
- Warning 6 [labels-omitted]: label preds was omitted in the application of this function.
- ocamlopt -I +compiler-libs -g -o ocamlfind_opt findlib.cmxa unix.cmxa \
- 	   -I +unix -I +dynlink ocaml_args.cmx frontend.cmx
- ocamlopt -I +compiler-libs -g -opaque  -I +unix -I +dynlink -c topfind.ml
- File "topfind.ml", line 126, characters 40-63:
- 126 |                      match Hashtbl.find Toploop.directive_table "ppx" with
-                                               ^^^^^^^^^^^^^^^^^^^^^^^
- Alert deprecated: Toploop.directive_table
- File "topfind.ml", line 256, characters 4-27:
- 256 |     Toploop.directive_table
-           ^^^^^^^^^^^^^^^^^^^^^^^
- Alert deprecated: Toploop.directive_table
- File "topfind.ml", line 266, characters 4-27:
- 266 |     Toploop.directive_table
-           ^^^^^^^^^^^^^^^^^^^^^^^
- Alert deprecated: Toploop.directive_table
- File "topfind.ml", line 278, characters 4-27:
- 278 |     Toploop.directive_table
-           ^^^^^^^^^^^^^^^^^^^^^^^
- Alert deprecated: Toploop.directive_table
- File "topfind.ml", line 291, characters 4-27:
- 291 |     Toploop.directive_table
-           ^^^^^^^^^^^^^^^^^^^^^^^
- Alert deprecated: Toploop.directive_table
- File "topfind.ml", line 305, characters 4-27:
- 305 |     Toploop.directive_table
-           ^^^^^^^^^^^^^^^^^^^^^^^
- Alert deprecated: Toploop.directive_table
- File "topfind.ml", line 317, characters 4-27:
- 317 |     Toploop.directive_table
-           ^^^^^^^^^^^^^^^^^^^^^^^
- Alert deprecated: Toploop.directive_table
- ocamlopt -I +compiler-libs -g -a -o findlib_top.cmxa topfind.cmx
- if [ 1 -gt 0 ]; then \
-     ocamlopt -I +compiler-libs -g -shared -o findlib_top.cmxs topfind.cmx; \
- fi
- ocamlopt -I +compiler-libs -g -opaque  -I +unix -I +dynlink -c fl_dynload.ml
- ocamlopt -I +compiler-libs -g -a -o findlib_dynload.cmxa fl_dynload.cmx
- if [ 1 -gt 0 ]; then \
-     ocamlopt -I +compiler-libs -g -shared -o findlib_dynload.cmxs fl_dynload.cmx; \
- fi
- make[1]: Leaving directory '/home/opam/.opam/5.1/.opam-switch/build/ocamlfind.1.9.5/src/findlib'
-> compiled  ocamlfind.1.9.5
Processing 46/84: [dune: ocaml 127]
Processing 47/84: [dune: ocaml 127] [ocamlfind: make install]
+ /home/opam/.opam/opam-init/hooks/sandbox.sh "install" "make" "install" (CWD=/home/opam/.opam/5.1/.opam-switch/build/ocamlfind.1.9.5)
- if [ "1" -eq 1 ]; then \
-     for x in camlp4 dbm graphics labltk num ocamlbuild; do \
-       if [ -f "/home/opam/.opam/5.1/lib/$x/META" ]; then \
-         if ! grep -Fq '[distributed with Ocaml]' "//home/opam/.opam/5.1/lib/$x/META"; then \
-           rm -f site-lib-src/$x/META; \
-         fi; \
-       fi; \
-     done; \
-     test -f "site-lib-src/num/META" || rm -f "site-lib-src/num-top/META"; \
-   fi
- echo 'SITELIB_META =' > Makefile.packages.in
- for x in `ls site-lib-src`; do test ! -f "site-lib-src/$x/META" || echo $x >> Makefile.packages.in; done
- tr '\n' ' ' < Makefile.packages.in > Makefile.packages
- rm Makefile.packages.in
- install -d "/home/opam/.opam/5.1/bin"
- install -d "/home/opam/.opam/5.1/man"
- make install-config
- make[1]: Entering directory '/home/opam/.opam/5.1/.opam-switch/build/ocamlfind.1.9.5'
- install -d "`dirname \"/home/opam/.opam/5.1/lib/findlib.conf\"`"
- test -f "/home/opam/.opam/5.1/lib/findlib.conf" || install -c findlib.conf "/home/opam/.opam/5.1/lib/findlib.conf"
- make[1]: Leaving directory '/home/opam/.opam/5.1/.opam-switch/build/ocamlfind.1.9.5'
- for p in findlib; do ( cd src/$p; make install ); done
- make[1]: Entering directory '/home/opam/.opam/5.1/.opam-switch/build/ocamlfind.1.9.5/src/findlib'
- install -d "/home/opam/.opam/5.1/lib/findlib"
- install -d "/home/opam/.opam/5.1/bin"
- test 1 -eq 0 || install -d "/home/opam/.opam/5.1/lib/ocaml"
- test 1 -eq 0 || install -c topfind "/home/opam/.opam/5.1/lib/ocaml/"
- files=` ../../tools/collect_files ../../Makefile.config \
- findlib.cmi findlib.mli findlib.cma findlib.cmxa findlib.a findlib.cmxs \
- findlib_config.cmi findlib_config.ml topfind.cmi topfind.mli \
- fl_args.cmi fl_lint.cmi fl_meta.cmi fl_split.cmi fl_topo.cmi ocaml_args.cmi \
- fl_package_base.mli fl_package_base.cmi fl_metascanner.mli fl_metascanner.cmi \
- fl_metatoken.cmi findlib_top.cma findlib_top.cmxa findlib_top.a findlib_top.cmxs \
- findlib_dynload.cma findlib_dynload.cmxa findlib_dynload.a findlib_dynload.cmxs fl_dynload.mli fl_dynload.cmi \
- META` && \
- install -c $files "/home/opam/.opam/5.1/lib/findlib/"
- f="ocamlfind"; { test -f ocamlfind_opt && f="ocamlfind_opt"; }; \
- install -c $f "/home/opam/.opam/5.1/bin/ocamlfind"
- # the following "if" block is only needed for 4.00beta2
- if [ 1 -eq 0 -a -f "/home/opam/.opam/5.1/lib/ocaml/compiler-libs/topdirs.cmi" ]; then \
-     cd "/home/opam/.opam/5.1/lib/ocaml/compiler-libs/"; \
-     install -c topdirs.cmi toploop.cmi "/home/opam/.opam/5.1/lib/findlib/"; \
- fi
- make[1]: Leaving directory '/home/opam/.opam/5.1/.opam-switch/build/ocamlfind.1.9.5/src/findlib'
- make install-meta
- make[1]: Entering directory '/home/opam/.opam/5.1/.opam-switch/build/ocamlfind.1.9.5'
- for x in bytes compiler-libs dynlink ocamldoc runtime_events stdlib str threads unix ; do install -d "/home/opam/.opam/5.1/lib/$x"; install -c site-lib-src/$x/META "/home/opam/.opam/5.1/lib/$x/META.tmp" && mv "/home/opam/.opam/5.1/lib/$x/META.tmp" "/home/opam/.opam/5.1/lib/$x/META"; done
- install -d "/home/opam/.opam/5.1/lib/findlib"; install -c Makefile.packages "/home/opam/.opam/5.1/lib/findlib/Makefile.packages"
- make[1]: Leaving directory '/home/opam/.opam/5.1/.opam-switch/build/ocamlfind.1.9.5'
- test ! -f 'site-lib-src/num-top/META' || { cd src/findlib; make install-num-top; }
- test ! -f 'site-lib-src/camlp4/META' ||	install -c tools/safe_camlp4 "/home/opam/.opam/5.1/bin"
- make install-doc
- make[1]: Entering directory '/home/opam/.opam/5.1/.opam-switch/build/ocamlfind.1.9.5'
- install -d "/home/opam/.opam/5.1/man/man1" "/home/opam/.opam/5.1/man/man3" "/home/opam/.opam/5.1/man/man5"
- install -c doc/ref-man/ocamlfind.1 "/home/opam/.opam/5.1/man/man1"
- install -c doc/ref-man/META.5 doc/ref-man/site-lib.5 doc/ref-man/findlib.conf.5 "/home/opam/.opam/5.1/man/man5"
- make[1]: Leaving directory '/home/opam/.opam/5.1/.opam-switch/build/ocamlfind.1.9.5'
-> installed ocamlfind.1.9.5
Processing 47/84: [dune: ocaml 127]
Processing 48/84: [camlzip: make all] [dune: ocaml 127]
Processing 49/84: [camlzip: make all] [dune: ocaml 127] [num: make]
Processing 50/84: [camlzip: make all] [dune: ocaml 127] [num: make] [zarith: ./configure]
+ /home/opam/.opam/opam-init/hooks/sandbox.sh "build" "./configure" (CWD=/home/opam/.opam/5.1/.opam-switch/build/zarith.1.12)
- binary ocaml: found in /home/opam/.opam/5.1/bin
- binary ocamlc: found in /home/opam/.opam/5.1/bin
- binary ocamldep: found in /home/opam/.opam/5.1/bin
- binary ocamlmklib: found in /home/opam/.opam/5.1/bin
- binary ocamldoc: found in /home/opam/.opam/5.1/bin
- binary gcc: found in /usr/bin
- binary ocamlopt: found in /home/opam/.opam/5.1/bin
- checking compilation with gcc -O3 -Wall -Wextra : working
- include caml/mlvalues.h: found
- library dynlink.cmxa: found
- binary ocamlfind: found in /home/opam/.opam/5.1/bin
- OCaml's word size is 64
- binary uname: found in /usr/bin
- include gmp.h: found
- library gmp: found
- OCaml supports -bin-annot to produce documentation
- 
- detected configuration:
- 
-   native-code:          yes
-   dynamic linking:      yes
-   defines:              -DHAS_GMP 
-   libraries:             -lgmp
-   C options:            -O3 -Wall -Wextra 
-   installation path:    /home/opam/.opam/5.1/lib
-   installation method   findlib
- 
- configuration successful!
- now type "make" to build
- then type "make install" or "sudo make install" to install
Processing 50/84: [camlzip: make all] [dune: ocaml 127] [num: make] [zarith: make]
+ /home/opam/.opam/opam-init/hooks/sandbox.sh "build" "make" "all" (CWD=/home/opam/.opam/5.1/.opam-switch/build/camlzip.1.11)
- ocamlfind ocamlc -g -safe-string -bin-annot -c -ccopt -g  zlibstubs.c
- ocamlfind ocamlmklib -oc camlzip zlibstubs.o  -lz
- ocamlfind ocamlc -g -safe-string -bin-annot -c zlib.mli
- ocamlfind ocamlc -g -safe-string -bin-annot -c zlib.ml
- ocamlfind ocamlc -g -safe-string -bin-annot -c zip.mli
- ocamlfind ocamlc -g -safe-string -bin-annot -c zip.ml
- File "_none_", line 1:
- Alert ocaml_deprecated_auto_include: 
- OCaml's lib directory layout changed in 5.0. The unix subdirectory has been
- automatically added to the search path, but you should add -I +unix to the
- command-line to silence this alert (e.g. by adding unix to the list of
- libraries in your dune file, or adding use_unix to your _tags file for
- ocamlbuild, or using -package unix for ocamlfind).
- ocamlfind ocamlc -g -safe-string -bin-annot -c gzip.mli
- ocamlfind ocamlc -g -safe-string -bin-annot -c gzip.ml
- ocamlfind ocamlmklib -o zip -oc camlzip zlib.cmo zip.cmo gzip.cmo  -lz
- ocamlfind ocamlopt -safe-string -c zlib.ml
- ocamlfind ocamlopt -safe-string -c zip.ml
- File "_none_", line 1:
- Alert ocaml_deprecated_auto_include: 
- OCaml's lib directory layout changed in 5.0. The unix subdirectory has been
- automatically added to the search path, but you should add -I +unix to the
- command-line to silence this alert (e.g. by adding unix to the list of
- libraries in your dune file, or adding use_unix to your _tags file for
- ocamlbuild, or using -package unix for ocamlfind).
- ocamlfind ocamlopt -safe-string -c gzip.ml
- ocamlfind ocamlmklib -o zip -oc camlzip zlib.cmx zip.cmx gzip.cmx  -lz
- ocamlfind ocamlopt -safe-string -shared -linkall -I ./ -o zip.cmxs zip.cmxa libcamlzip.a
-> compiled  camlzip.1.11
Processing 50/84: [dune: ocaml 127] [num: make] [zarith: make]
Processing 51/84: [dune: ocaml 127] [num: make] [zarith: make] [camlzip: make install]
+ /home/opam/.opam/opam-init/hooks/sandbox.sh "install" "make" "install" (CWD=/home/opam/.opam/5.1/.opam-switch/build/camlzip.1.11)
- cp META-zip META && \
-         ocamlfind install zip META *.cma *.a *.mli *.cmi *.cmti *.cmt gzip.cmx zip.cmx zlib.cmx zip.cmxa zip.cmxs dllcamlzip.so && \
-         rm META
- Installed /home/opam/.opam/5.1/lib/zip/zip.cmxs
- Installed /home/opam/.opam/5.1/lib/zip/zip.cmxa
- Installed /home/opam/.opam/5.1/lib/zip/zlib.cmx
- Installed /home/opam/.opam/5.1/lib/zip/zip.cmx
- Installed /home/opam/.opam/5.1/lib/zip/gzip.cmx
- Installed /home/opam/.opam/5.1/lib/zip/zlib.cmt
- Installed /home/opam/.opam/5.1/lib/zip/zip.cmt
- Installed /home/opam/.opam/5.1/lib/zip/gzip.cmt
- Installed /home/opam/.opam/5.1/lib/zip/zlib.cmti
- Installed /home/opam/.opam/5.1/lib/zip/zip.cmti
- Installed /home/opam/.opam/5.1/lib/zip/gzip.cmti
- Installed /home/opam/.opam/5.1/lib/zip/zlib.cmi
- Installed /home/opam/.opam/5.1/lib/zip/zip.cmi
- Installed /home/opam/.opam/5.1/lib/zip/gzip.cmi
- Installed /home/opam/.opam/5.1/lib/zip/zlib.mli
- Installed /home/opam/.opam/5.1/lib/zip/zip.mli
- Installed /home/opam/.opam/5.1/lib/zip/gzip.mli
- Installed /home/opam/.opam/5.1/lib/zip/zip.a
- Installed /home/opam/.opam/5.1/lib/zip/libcamlzip.a
- Installed /home/opam/.opam/5.1/lib/zip/zip.cma
- Installed /home/opam/.opam/5.1/lib/stublibs/dllcamlzip.so
- Installed /home/opam/.opam/5.1/lib/stublibs/dllcamlzip.so.owner
- ocamlfind: [WARNING] You have installed DLLs but the directory /home/opam/.opam/5.1/lib/stublibs is not mentioned in ld.conf
- Installed /home/opam/.opam/5.1/lib/zip/META
- cp META-camlzip META && \
-         ocamlfind install camlzip META && \
-         rm META
- Installed /home/opam/.opam/5.1/lib/camlzip/META
-> installed camlzip.1.11
Processing 51/84: [dune: ocaml 127] [num: make] [zarith: make]
+ /home/opam/.opam/opam-init/hooks/sandbox.sh "build" "make" (CWD=/home/opam/.opam/5.1/.opam-switch/build/num.1.4)
- make -C src all
- make[1]: Entering directory '/home/opam/.opam/5.1/.opam-switch/build/num.1.4/src'
- ocamlc -ccopt -DBNG_ARCH_amd64 -c bng.c
- ocamlc -ccopt -DBNG_ARCH_amd64 -c nat_stubs.c
- ocamlmklib -oc nums bng.o nat_stubs.o
- ocamlc -w +a-4-9-41-42-44-45-48 -warn-error A -bin-annot -g -safe-string -strict-sequence -strict-formats -c int_misc.mli
- ocamlc -w +a-4-9-41-42-44-45-48 -warn-error A -bin-annot -g -safe-string -strict-sequence -strict-formats -c int_misc.ml
- ocamlc -w +a-4-9-41-42-44-45-48 -warn-error A -bin-annot -g -safe-string -strict-sequence -strict-formats -c nat.mli
- ocamlc -w +a-4-9-41-42-44-45-48 -warn-error A -bin-annot -g -safe-string -strict-sequence -strict-formats -c nat.ml
- ocamlc -w +a-4-9-41-42-44-45-48 -warn-error A -bin-annot -g -safe-string -strict-sequence -strict-formats -c big_int.mli
- ocamlc -w +a-4-9-41-42-44-45-48 -warn-error A -bin-annot -g -safe-string -strict-sequence -strict-formats -c big_int.ml
- ocamlc -w +a-4-9-41-42-44-45-48 -warn-error A -bin-annot -g -safe-string -strict-sequence -strict-formats -c arith_flags.mli
- ocamlc -w +a-4-9-41-42-44-45-48 -warn-error A -bin-annot -g -safe-string -strict-sequence -strict-formats -c arith_flags.ml
- ocamlc -w +a-4-9-41-42-44-45-48 -warn-error A -bin-annot -g -safe-string -strict-sequence -strict-formats -c ratio.mli
- ocamlc -w +a-4-9-41-42-44-45-48 -warn-error A -bin-annot -g -safe-string -strict-sequence -strict-formats -c ratio.ml
- ocamlc -w +a-4-9-41-42-44-45-48 -warn-error A -bin-annot -g -safe-string -strict-sequence -strict-formats -c num.mli
- ocamlc -w +a-4-9-41-42-44-45-48 -warn-error A -bin-annot -g -safe-string -strict-sequence -strict-formats -c num.ml
- ocamlc -w +a-4-9-41-42-44-45-48 -warn-error A -bin-annot -g -safe-string -strict-sequence -strict-formats -c arith_status.mli
- ocamlc -w +a-4-9-41-42-44-45-48 -warn-error A -bin-annot -g -safe-string -strict-sequence -strict-formats -c arith_status.ml
- ocamlmklib -o nums -oc nums -linkall int_misc.cmo nat.cmo big_int.cmo arith_flags.cmo ratio.cmo num.cmo arith_status.cmo
- ocamlopt -w +a-4-9-41-42-44-45-48 -warn-error A -bin-annot -g -safe-string -strict-sequence -strict-formats -c int_misc.ml
- ocamlopt -w +a-4-9-41-42-44-45-48 -warn-error A -bin-annot -g -safe-string -strict-sequence -strict-formats -c nat.ml
- ocamlopt -w +a-4-9-41-42-44-45-48 -warn-error A -bin-annot -g -safe-string -strict-sequence -strict-formats -c big_int.ml
- ocamlopt -w +a-4-9-41-42-44-45-48 -warn-error A -bin-annot -g -safe-string -strict-sequence -strict-formats -c arith_flags.ml
- ocamlopt -w +a-4-9-41-42-44-45-48 -warn-error A -bin-annot -g -safe-string -strict-sequence -strict-formats -c ratio.ml
- ocamlopt -w +a-4-9-41-42-44-45-48 -warn-error A -bin-annot -g -safe-string -strict-sequence -strict-formats -c num.ml
- ocamlopt -w +a-4-9-41-42-44-45-48 -warn-error A -bin-annot -g -safe-string -strict-sequence -strict-formats -c arith_status.ml
- ocamlmklib -o nums -oc nums -linkall int_misc.cmx nat.cmx big_int.cmx arith_flags.cmx ratio.cmx num.cmx arith_status.cmx
- ocamlopt -w +a-4-9-41-42-44-45-48 -warn-error A -bin-annot -g -safe-string -strict-sequence -strict-formats -I . -shared -o nums.cmxs nums.cmxa
- make[1]: Leaving directory '/home/opam/.opam/5.1/.opam-switch/build/num.1.4/src'
- make -C toplevel all
- make[1]: Entering directory '/home/opam/.opam/5.1/.opam-switch/build/num.1.4/toplevel'
- ocamlc -I ../src -I +compiler-libs -w +a-4-9-41-42-44-45-48 -warn-error A -safe-string -strict-sequence -strict-formats -c num_top_printers.mli
- ocamlc -I ../src -I +compiler-libs -w +a-4-9-41-42-44-45-48 -warn-error A -safe-string -strict-sequence -strict-formats -c num_top_printers.ml
- ocamlc -I ../src -I +compiler-libs -w +a-4-9-41-42-44-45-48 -warn-error A -safe-string -strict-sequence -strict-formats -c num_top.mli
- ocamlc -I ../src -I +compiler-libs -w +a-4-9-41-42-44-45-48 -warn-error A -safe-string -strict-sequence -strict-formats -c num_top.ml
- ocamlc -I ../src -I +compiler-libs -w +a-4-9-41-42-44-45-48 -warn-error A -safe-string -strict-sequence -strict-formats -a -o num_top.cma num_top_printers.cmo num_top.cmo
- make[1]: Leaving directory '/home/opam/.opam/5.1/.opam-switch/build/num.1.4/toplevel'
-> compiled  num.1.4
Processing 51/84: [dune: ocaml 127] [zarith: make]
Processing 52/84: [dune: ocaml 127] [zarith: make] [num: ocamlfind remove]
+ /home/opam/.opam/opam-init/hooks/sandbox.sh "install" "ocamlfind" "remove" "num" (CWD=/home/opam/.opam/5.1/.opam-switch/build/num.1.4)
- ocamlfind: [WARNING] No such file: /home/opam/.opam/5.1/lib/num/META
+ /home/opam/.opam/opam-init/hooks/sandbox.sh "install" "ocamlfind" "remove" "num-top" (CWD=/home/opam/.opam/5.1/.opam-switch/build/num.1.4)
- ocamlfind: [WARNING] No such file: /home/opam/.opam/5.1/lib/num-top/META
Processing 52/84: [dune: ocaml 127] [zarith: make] [num: make install]
+ /home/opam/.opam/opam-init/hooks/sandbox.sh "install" "make" "install" (CWD=/home/opam/.opam/5.1/.opam-switch/build/num.1.4)
- make -C src install
- make[1]: Entering directory '/home/opam/.opam/5.1/.opam-switch/build/num.1.4/src'
- install -d /home/opam/.opam/5.1/lib/ocaml
- sed -e 's/%%VERSION%%/1.4/g' META.in > META
- ocamlfind install num META
- Installed /home/opam/.opam/5.1/lib/num/META
- rm -f META
- install -m 644 nums.cma libnums.a big_int.cmi nat.cmi num.cmi ratio.cmi arith_status.cmi big_int.mli nat.mli num.mli ratio.mli arith_status.mli big_int.cmti nat.cmti num.cmti ratio.cmti arith_status.cmti nums.cmxa nums.a int_misc.cmx nat.cmx big_int.cmx arith_flags.cmx ratio.cmx num.cmx arith_status.cmx nums.cmxs /home/opam/.opam/5.1/lib/ocaml
- install -d /home/opam/.opam/5.1/lib/ocaml/stublibs
- install dllnums.so /home/opam/.opam/5.1/lib/ocaml/stublibs
- make[1]: Leaving directory '/home/opam/.opam/5.1/.opam-switch/build/num.1.4/src'
- make -C toplevel install
- make[1]: Entering directory '/home/opam/.opam/5.1/.opam-switch/build/num.1.4/toplevel'
- sed -e 's/%%VERSION%%/1.4/g' META.in > META
- ocamlfind install num-top META num_top.cma num_top.cmi num_top_printers.cmi
- Installed /home/opam/.opam/5.1/lib/num-top/num_top_printers.cmi
- Installed /home/opam/.opam/5.1/lib/num-top/num_top.cmi
- Installed /home/opam/.opam/5.1/lib/num-top/num_top.cma
- Installed /home/opam/.opam/5.1/lib/num-top/META
- rm -f META
- make[1]: Leaving directory '/home/opam/.opam/5.1/.opam-switch/build/num.1.4/toplevel'
-> installed num.1.4
Processing 52/84: [dune: ocaml 127] [zarith: make]
Processing 53/84: [dune: ocaml 127] [ocplib-simplex: autoconf] [zarith: make]
+ /home/opam/.opam/opam-init/hooks/sandbox.sh "build" "autoconf" (CWD=/home/opam/.opam/5.1/.opam-switch/build/ocplib-simplex.0.4)
- configure.in:140: warning: AC_OUTPUT should be used without arguments.
- configure.in:140: You should run autoupdate.
Processing 53/84: [dune: ocaml 127] [ocplib-simplex: ./configure] [zarith: make]
+ /home/opam/.opam/opam-init/hooks/sandbox.sh "build" "./configure" "-prefix" "/home/opam/.opam/5.1" (CWD=/home/opam/.opam/5.1/.opam-switch/build/ocplib-simplex.0.4)
- checking for ocamlc... ocamlc
- ocaml version is 5.1.0+dev1-2022-06-09
- ocaml library path is /home/opam/.opam/5.1/lib/ocaml
- checking for ocamlfind... yes
- checking for ocamlopt... ocamlopt
- checking ocamlopt version... ok
- checking for ocamlc.opt... ocamlc.opt
- checking ocamlc.opt version... ok
- checking for ocamlopt.opt... ocamlopt.opt
- checking ocamlopt.opt version... ok
- checking for ocamldep... ocamldep
- checking platform... configure: creating ./config.status
- config.status: creating Makefile
- config.status: WARNING:  'Makefile.in' seems to ignore the --datarootdir setting
Processing 53/84: [dune: ocaml 127] [ocplib-simplex: make] [zarith: make]
+ /home/opam/.opam/opam-init/hooks/sandbox.sh "build" "make" (CWD=/home/opam/.opam/5.1/.opam-switch/build/ocplib-simplex.0.4)
- cp src/extSigs.mli src/extSigs.ml
- cp src/coreSig.mli src/coreSig.ml
- ocamldep -I src src/*.ml* > .depend
- ocamlc.opt -c -annot -absname -bin-annot -short-paths -strict-sequence -w +A -g -I src -for-pack OcplibSimplex src/version.mli
- ocamlc.opt -c -annot -absname -bin-annot -short-paths -strict-sequence -w +A -g -I src -for-pack OcplibSimplex src/version.ml
- ocamlc.opt -c -annot -absname -bin-annot -short-paths -strict-sequence -w +A -g -I src -for-pack OcplibSimplex src/extSigs.mli
- ocamlc.opt -c -annot -absname -bin-annot -short-paths -strict-sequence -w +A -g -I src -for-pack OcplibSimplex src/rat2.mli
- ocamlc.opt -c -annot -absname -bin-annot -short-paths -strict-sequence -w +A -g -I src -for-pack OcplibSimplex src/rat2.ml
- ocamlc.opt -c -annot -absname -bin-annot -short-paths -strict-sequence -w +A -g -I src -for-pack OcplibSimplex src/extSigs.ml
- ocamlc.opt -c -annot -absname -bin-annot -short-paths -strict-sequence -w +A -g -I src -for-pack OcplibSimplex src/polys.mli
- ocamlc.opt -c -annot -absname -bin-annot -short-paths -strict-sequence -w +A -g -I src -for-pack OcplibSimplex src/polys.ml
- ocamlc.opt -c -annot -absname -bin-annot -short-paths -strict-sequence -w +A -g -I src -for-pack OcplibSimplex src/coreSig.mli
- ocamlc.opt -c -annot -absname -bin-annot -short-paths -strict-sequence -w +A -g -I src -for-pack OcplibSimplex src/coreSig.ml
- ocamlc.opt -c -annot -absname -bin-annot -short-paths -strict-sequence -w +A -g -I src -for-pack OcplibSimplex src/core.mli
- ocamlc.opt -c -annot -absname -bin-annot -short-paths -strict-sequence -w +A -g -I src -for-pack OcplibSimplex src/core.ml
- File "/home/opam/.opam/5.1/.opam-switch/build/ocplib-simplex.0.4/src/core.ml", line 242, characters 14-75:
- 242 |               "%a   [ %a == (%4a , %4a) ]   %a   (computed %s) (flag %s)@."
-                     ^^^^^^^^^^^^^^^^^^^^^^^^^^^^^^^^^^^^^^^^^^^^^^^^^^^^^^^^^^^^^
- Error: invalid format "%a   [ %a == (%4a , %4a) ]   %a   (computed %s) (flag %s)@.": at character number 20, `padding' is incompatible with 'a' in sub-format "%4a"
- make: *** [Makefile:131: src/core.cmo] Error 2
Processing 53/84: [dune: ocaml 127] [zarith: make]
[ERROR] The compilation of ocplib-simplex.0.4 failed at "make".
Processing 54/84: [dune: ocaml 127] [zarith: make]
+ /home/opam/.opam/opam-init/hooks/sandbox.sh "build" "make" (CWD=/home/opam/.opam/5.1/.opam-switch/build/zarith.1.12)
- (echo "let"; grep "version" META | head -1) > zarith_version.ml
- ocamldep -native  zarith_version.ml z.ml q.ml big_int_Z.ml z.mli q.mli big_int_Z.mli > depend
- ocamlc -I +compiler-libs -bin-annot  -c zarith_version.ml
- ocamlc -I +compiler-libs -bin-annot  -c z.mli
- ocamlc -I +compiler-libs -bin-annot  -c z.ml
- ocamlc -I +compiler-libs -bin-annot  -c q.mli
- ocamlc -I +compiler-libs -bin-annot  -c q.ml
- File "q.ml", line 537, characters 9-23:
- 537 |         (Z.of_substring s 0 i)
-                ^^^^^^^^^^^^^^
- Warning 6 [labels-omitted]: labels pos, len were omitted in the application of this function.
- File "q.ml", line 538, characters 9-23:
- 538 |         (Z.of_substring s (i+1) (String.length s-i-1))
-                ^^^^^^^^^^^^^^
- Warning 6 [labels-omitted]: labels pos, len were omitted in the application of this function.
- ocamlc -I +compiler-libs -bin-annot  -c big_int_Z.mli
- ocamlc -I +compiler-libs -bin-annot  -c big_int_Z.ml
- ocamlmklib -failsafe -o zarith zarith_version.cmo z.cmo q.cmo big_int_Z.cmo -lgmp
- ocamlc -ccopt "-I/home/opam/.opam/5.1/lib/ocaml  -DHAS_GMP  -O3 -Wall -Wextra " -c caml_z.c
- ocamlmklib -failsafe -o zarith caml_z.o -lgmp
- ocamlc -I +compiler-libs -bin-annot  -c zarith_top.ml
- ocamlc -o zarith_top.cma -a zarith_top.cmo
- ocamlopt -I +compiler-libs  -c zarith_version.ml
- ocamlopt -I +compiler-libs  -c z.ml
- ocamlopt -I +compiler-libs  -c q.ml
- File "q.ml", line 537, characters 9-23:
- 537 |         (Z.of_substring s 0 i)
-                ^^^^^^^^^^^^^^
- Warning 6 [labels-omitted]: labels pos, len were omitted in the application of this function.
- File "q.ml", line 538, characters 9-23:
- 538 |         (Z.of_substring s (i+1) (String.length s-i-1))
-                ^^^^^^^^^^^^^^
- Warning 6 [labels-omitted]: labels pos, len were omitted in the application of this function.
- ocamlopt -I +compiler-libs  -c big_int_Z.ml
- ocamlmklib -failsafe -o zarith zarith_version.cmx z.cmx q.cmx big_int_Z.cmx -lgmp
- ocamlopt -shared -o zarith.cmxs -I . zarith.cmxa -linkall
-> compiled  zarith.1.12
Processing 54/84: [dune: ocaml 127]
Processing 55/84: [dune: ocaml 127] [zarith: make install]
+ /home/opam/.opam/opam-init/hooks/sandbox.sh "install" "make" "install" (CWD=/home/opam/.opam/5.1/.opam-switch/build/zarith.1.12)
- ocamlfind install -destdir "/home/opam/.opam/5.1/lib" zarith META zarith.cma libzarith.a z.cmi q.cmi big_int_Z.cmi zarith_top.cma z.mli zarith.cmxa z.cmx q.cmx big_int_Z.cmx zarith.cmxs zarith.h q.mli big_int_Z.mli zarith.a z.cmti q.cmti big_int_Z.cmti -optional dllzarith.so
- Installed /home/opam/.opam/5.1/lib/zarith/big_int_Z.cmti
- Installed /home/opam/.opam/5.1/lib/zarith/q.cmti
- Installed /home/opam/.opam/5.1/lib/zarith/z.cmti
- Installed /home/opam/.opam/5.1/lib/zarith/zarith.a
- Installed /home/opam/.opam/5.1/lib/zarith/big_int_Z.mli
- Installed /home/opam/.opam/5.1/lib/zarith/q.mli
- Installed /home/opam/.opam/5.1/lib/zarith/zarith.h
- Installed /home/opam/.opam/5.1/lib/zarith/zarith.cmxs
- Installed /home/opam/.opam/5.1/lib/zarith/big_int_Z.cmx
- Installed /home/opam/.opam/5.1/lib/zarith/q.cmx
- Installed /home/opam/.opam/5.1/lib/zarith/z.cmx
- Installed /home/opam/.opam/5.1/lib/zarith/zarith.cmxa
- Installed /home/opam/.opam/5.1/lib/zarith/z.mli
- Installed /home/opam/.opam/5.1/lib/zarith/zarith_top.cma
- Installed /home/opam/.opam/5.1/lib/zarith/big_int_Z.cmi
- Installed /home/opam/.opam/5.1/lib/zarith/q.cmi
- Installed /home/opam/.opam/5.1/lib/zarith/z.cmi
- Installed /home/opam/.opam/5.1/lib/zarith/libzarith.a
- Installed /home/opam/.opam/5.1/lib/zarith/zarith.cma
- Installed /home/opam/.opam/5.1/lib/stublibs/dllzarith.so
- Installed /home/opam/.opam/5.1/lib/stublibs/dllzarith.so.owner
- ocamlfind: [WARNING] You have installed DLLs but the directory /home/opam/.opam/5.1/lib/stublibs is not mentioned in ld.conf
- Installed /home/opam/.opam/5.1/lib/zarith/META
-> installed zarith.1.12
Processing 55/84: [dune: ocaml 127]
+ /home/opam/.opam/opam-init/hooks/sandbox.sh "build" "ocaml" "boot/bootstrap.ml" "-j" "127" (CWD=/home/opam/.opam/5.1/.opam-switch/build/dune.3.6.1)
- ocamlc -output-complete-exe -w -24 -g -o .duneboot.exe -I boot -I +unix unix.cma boot/libs.ml boot/duneboot.ml
- ./.duneboot.exe -j 127
- cd _boot && /home/opam/.opam/5.1/bin/ocamlopt.opt -c -g -no-alias-deps -w -49-6 -alert -unstable -I +unix -I +threads build_path_prefix_map.ml
- File "vendor/build_path_prefix_map/src/build_path_prefix_map.ml", line 5, characters 17-31:
- Alert deprecated: Stdlib.Printf.kprintf
- Use Printf.ksprintf instead.
- cd _boot && /home/opam/.opam/5.1/bin/ocamlopt.opt -c -g -no-alias-deps -w -49-6 -alert -unstable -I +unix -I +threads opamLexer.ml
- File "vendor/opam-file-format/src/opamLexer.mll", line 21, characters 2-16:
- Alert deprecated: Stdlib.Printf.kprintf
- Use Printf.ksprintf instead.
- 

Processing 55/84: [dune: ./_boot/dune.exe build]
+ /home/opam/.opam/opam-init/hooks/sandbox.sh "build" "./_boot/dune.exe" "build" "dune.install" "--release" "--profile" "dune-bootstrap" "-j" "127" (CWD=/home/opam/.opam/5.1/.opam-switch/build/dune.3.6.1)
-> compiled  dune.3.6.1
-> installed dune.3.6.1
Processing 57/84: [camlp-streams: dune build]
Processing 58/84: [camlp-streams: dune build] [csexp: dune build]
Processing 59/84: [camlp-streams: dune build] [csexp: dune build] [menhirLib: dune build]
Processing 60/84: [camlp-streams: dune build] [csexp: dune build] [menhirLib: dune build] [menhirSdk: dune build]
Processing 61/84: [camlp-streams: dune build] [csexp: dune build] [menhirLib: dune build] [menhirSdk: dune build] [stdlib-shims: dune build]
+ /home/opam/.opam/opam-init/hooks/sandbox.sh "build" "dune" "build" "-p" "csexp" "-j" "127" "@install" (CWD=/home/opam/.opam/5.1/.opam-switch/build/csexp.1.5.1)
-> compiled  csexp.1.5.1
Processing 61/84: [camlp-streams: dune build] [menhirLib: dune build] [menhirSdk: dune build] [stdlib-shims: dune build]
-> installed csexp.1.5.1
Processing 62/84: [camlp-streams: dune build] [menhirLib: dune build] [menhirSdk: dune build] [stdlib-shims: dune build]
Processing 63/84: [camlp-streams: dune build] [dune-configurator: rm] [menhirLib: dune build] [menhirSdk: dune build] [stdlib-shims: dune build]
+ /home/opam/.opam/opam-init/hooks/sandbox.sh "build" "dune" "build" "-p" "camlp-streams" "-j" "127" "@install" (CWD=/home/opam/.opam/5.1/.opam-switch/build/camlp-streams.5.0.1)
-> compiled  camlp-streams.5.0.1
Processing 63/84: [dune-configurator: rm] [menhirLib: dune build] [menhirSdk: dune build] [stdlib-shims: dune build]
-> installed camlp-streams.5.0.1
Processing 64/84: [dune-configurator: rm] [menhirLib: dune build] [menhirSdk: dune build] [stdlib-shims: dune build]
+ /home/opam/.opam/opam-init/hooks/sandbox.sh "build" "dune" "build" "-p" "menhirSdk" "-j" "127" (CWD=/home/opam/.opam/5.1/.opam-switch/build/menhirSdk.20220210)
-> compiled  menhirSdk.20220210
Processing 64/84: [dune-configurator: rm] [menhirLib: dune build] [stdlib-shims: dune build]
-> installed menhirSdk.20220210
Processing 65/84: [dune-configurator: rm] [menhirLib: dune build] [stdlib-shims: dune build]
+ /home/opam/.opam/opam-init/hooks/sandbox.sh "build" "dune" "build" "-p" "stdlib-shims" "-j" "127" (CWD=/home/opam/.opam/5.1/.opam-switch/build/stdlib-shims.0.3.0)
-> compiled  stdlib-shims.0.3.0
Processing 65/84: [dune-configurator: rm] [menhirLib: dune build]
-> installed stdlib-shims.0.3.0
Processing 66/84: [dune-configurator: rm] [menhirLib: dune build]
+ /home/opam/.opam/opam-init/hooks/sandbox.sh "build" "rm" "-rf" "vendor/csexp" (CWD=/home/opam/.opam/5.1/.opam-switch/build/dune-configurator.3.6.1)
+ /home/opam/.opam/opam-init/hooks/sandbox.sh "build" "rm" "-rf" "vendor/pp" (CWD=/home/opam/.opam/5.1/.opam-switch/build/dune-configurator.3.6.1)
Processing 66/84: [dune-configurator: dune build] [menhirLib: dune build]
+ /home/opam/.opam/opam-init/hooks/sandbox.sh "build" "dune" "build" "-p" "menhirLib" "-j" "127" (CWD=/home/opam/.opam/5.1/.opam-switch/build/menhirLib.20220210)
- (cd _build/default/lib/pack && ./pack.exe)
- Creating menhirLib.ml...
- Creating menhirLib.mli...
-> compiled  menhirLib.20220210
Processing 66/84: [dune-configurator: dune build]
-> installed menhirLib.20220210
Processing 67/84: [dune-configurator: dune build]
Processing 68/84: [dune-configurator: dune build] [menhir: dune build]
+ /home/opam/.opam/opam-init/hooks/sandbox.sh "build" "dune" "build" "-p" "dune-configurator" "-j" "127" "@install" (CWD=/home/opam/.opam/5.1/.opam-switch/build/dune-configurator.3.6.1)
-> compiled  dune-configurator.3.6.1
Processing 68/84: [menhir: dune build]
-> installed dune-configurator.3.6.1
Processing 69/84: [menhir: dune build]
Processing 70/84: [menhir: dune build]
Processing 71/84: [cairo2: dune build] [menhir: dune build]
Processing 72/84: [cairo2: dune build] [menhir: dune build]
+ /home/opam/.opam/opam-init/hooks/sandbox.sh "build" "dune" "build" "-p" "cairo2" "-j" "127" (CWD=/home/opam/.opam/5.1/.opam-switch/build/cairo2.0.6.4)
-> compiled  cairo2.0.6.4
Processing 72/84: [menhir: dune build]
-> installed cairo2.0.6.4
Processing 73/84: [menhir: dune build]
Processing 74/84: [lablgtk3: dune build] [menhir: dune build]
+ /home/opam/.opam/opam-init/hooks/sandbox.sh "build" "dune" "build" "-p" "lablgtk3" "-j" "127" (CWD=/home/opam/.opam/5.1/.opam-switch/build/lablgtk3.3.1.3)
- (cd _build/default/src && ../.bin/propcc gtkBase.props)
- Warning: no conversion for type GdkWindow_opt in class GtkWidget
- (cd _build/default/src && ../.bin/propcc gtkMisc.props)
- Warning: no conversion for type PangoAttrList in class GtkLabel
- Warning: no conversion for type GIcon in class GtkImage
- Warning: no conversion for type GdkPixbufAnimation in class GtkImage
- Warning: no conversion for type CairoSurface in class GtkImage
- (cd _build/default/src && ../.bin/propcc gtkText.props)
- Warning: no conversion for type PangoTabArray in class GtkTextView
- Warning: no conversion for type PangoTabArray in class GtkTextTag
- (cd _build/default/src && ../.bin/propcc gtkTree.props)
- Warning: no conversion for type PangoAttrList in class GtkCellRendererText
- (cd _build/default/src && /usr/bin/gcc -O2 -fno-strict-aliasing -fwrapv -pthread -fPIC -D_FILE_OFFSET_BITS=64 -I/usr/include/gtk-3.0 -I/usr/include/pango-1.0 -I/usr/include/glib-2.0 -I/usr/lib/x86_64-linux-gnu/glib-2.0/include -I/usr/include/harfbuzz -I/usr/include/freetype2 -I/usr/include/libpng16 -I/usr/include/libmount -I/usr/include/blkid -I/usr/include/fribidi -I/usr/include/cairo -I/usr/include/pixman-1 -I/usr/include/gdk-pixbuf-2.0 -I/usr/include/x86_64-linux-gnu -I/usr/include/gio-unix-2.0 -I/usr/include/atk-1.0 -I/usr/include/at-spi2-atk/2.0 -I/usr/include/at-spi-2.0 -I/usr/include/dbus-1.0 -I/usr/lib/x86_64-linux-gnu/dbus-1.0/include -pthread -Wno-deprecated-declarations -g -I /home/opam/.opam/5.1/lib/ocaml -I /home/opam/.opam/5.1/lib/cairo2 -I /home/opam/.opam/5.1/lib/ocaml/threads -I /home/opam/.opam/5.1/lib/ocaml/unix -o ml_gobject.o -c ml_gobject.c)
- In file included from ml_gobject.c:34:
- ml_gobject.c: In function 'GValue_val':
- wrappers.h:125:9: warning: initialization discards 'volatile' qualifier from pointer target type [-Wdiscarded-qualifiers]
-   125 |         ((int)Field(val,1) == 2 ? &Field(val,2) : (void*)Field(val,1))
-       |         ^
- ml_gobject.c:262:15: note: in expansion of macro 'MLPointer_val'
-   262 |     void *v = MLPointer_val(val);
-       |               ^~~~~~~~~~~~~
- ml_gobject.c: In function 'g_value_set_mlvariant':
- wrappers.h:332:37: warning: passing argument 2 of 'g_value_set_boxed' discards 'volatile' qualifier from pointer target type [-Wdiscarded-qualifiers]
-   332 | ((long)val-1 ? unwrap(Field(val,0)) : default)
-       | ~~~~~~~~~~~~~~~~~~~~~~~~~~~~~~~~~~~~^~~~~~~~~~
- ml_gobject.c:454:34: note: in expansion of macro 'Option_val'
-   454 |           g_value_set_boxed(val, Option_val(data,MLPointer_val,NULL));
-       |                                  ^~~~~~~~~~
- In file included from /usr/include/glib-2.0/gobject/gobject.h:31,
-                  from /usr/include/glib-2.0/gobject/gbinding.h:31,
-                  from /usr/include/glib-2.0/glib-object.h:24,
-                  from ml_gobject.c:26:
- /usr/include/glib-2.0/gobject/gboxed.h:79:59: note: expected 'gconstpointer' {aka 'const void *'} but argument is of type 'volatile void *'
-    79 |                                            gconstpointer  v_boxed);
-       |                                            ~~~~~~~~~~~~~~~^~~~~~~
- ml_gobject.c:459:24: warning: assignment discards 'volatile' qualifier from pointer target type [-Wdiscarded-qualifiers]
-   459 |         DATA.v_pointer = Option_val(data,MLPointer_val,NULL);
-       |                        ^
- (cd _build/default/src && /usr/bin/gcc -O2 -fno-strict-aliasing -fwrapv -pthread -fPIC -D_FILE_OFFSET_BITS=64 -I/usr/include/gtk-3.0 -I/usr/include/pango-1.0 -I/usr/include/glib-2.0 -I/usr/lib/x86_64-linux-gnu/glib-2.0/include -I/usr/include/harfbuzz -I/usr/include/freetype2 -I/usr/include/libpng16 -I/usr/include/libmount -I/usr/include/blkid -I/usr/include/fribidi -I/usr/include/cairo -I/usr/include/pixman-1 -I/usr/include/gdk-pixbuf-2.0 -I/usr/include/x86_64-linux-gnu -I/usr/include/gio-unix-2.0 -I/usr/include/atk-1.0 -I/usr/include/at-spi2-atk/2.0 -I/usr/include/at-spi-2.0 -I/usr/include/dbus-1.0 -I/usr/lib/x86_64-linux-gnu/dbus-1.0/include -pthread -Wno-deprecated-declarations -g -I /home/opam/.opam/5.1/lib/ocaml -I /home/opam/.opam/5.1/lib/cairo2 -I /home/opam/.opam/5.1/lib/ocaml/threads -I /home/opam/.opam/5.1/lib/ocaml/unix -o ml_glib.o -c ml_glib.c)
- ml_glib.c: In function 'ml_g_main_iteration':
- ml_glib.c:262:13: warning: Deprecated pre-processor symbol: replace with "g_main_context_iteration"
-   262 | ML_1 (g_main_iteration, Bool_val, Val_bool)
-       |             ^~~~~~~~~~~~~~~~~~~~~~~~~~~~~~~                                             
- ml_glib.c: In function 'ml_g_main_pending':
- ml_glib.c:263:13: warning: Deprecated pre-processor symbol: replace with "g_main_context_pending"
-   263 | ML_0 (g_main_pending, Val_bool)
-       |             ^~~~~~~~~~~~~~~~~~~                                                       
- ml_glib.c: In function 'ml_g_main_is_running':
- ml_glib.c:264:13: warning: Deprecated pre-processor symbol: replace with "g_main_loop_is_running"
-   264 | ML_1 (g_main_is_running, GMainLoop_val, Val_bool)
-       |             ^~~~~~~~~~~~~~~~~~~~~~~~~~~~~~~~~~~~~                                     
- ml_glib.c: In function 'ml_g_main_quit':
- ml_glib.c:265:13: warning: Deprecated pre-processor symbol: replace with "g_main_loop_quit"
-   265 | ML_1 (g_main_quit, GMainLoop_val, Unit)
-       |             ^~~~~~~~~~~~~~~~~~~~~~~~~~~                                         
- ml_glib.c: In function 'ml_g_main_destroy':
- ml_glib.c:266:13: warning: Deprecated pre-processor symbol: replace with "g_main_loop_unref"
-   266 | ML_1 (g_main_destroy, GMainLoop_val, Unit)
-       |             ^~~~~~~~~~~~~~~~~~~~~~~~~~~~~~                                       
- ml_glib.c: In function 'ml_g_get_charset':
- ml_glib.c:547:13: warning: Deprecated pre-processor symbol: replace with "const"
-   547 |   G_CONST_RETURN char *c;
-       |             ^~~~~~~~~~~~~                                            
-> compiled  lablgtk3.3.1.3
Processing 74/84: [menhir: dune build]
-> installed lablgtk3.3.1.3
Processing 75/84: [menhir: dune build]
Processing 76/84: [lablgtk3-sourceview3: dune build] [menhir: dune build]
+ /home/opam/.opam/opam-init/hooks/sandbox.sh "build" "dune" "build" "-p" "lablgtk3-sourceview3" "-j" "127" (CWD=/home/opam/.opam/5.1/.opam-switch/build/lablgtk3-sourceview3.3.1.3)
- (cd _build/default/src-sourceview3 && /usr/bin/gcc -O2 -fno-strict-aliasing -fwrapv -pthread -fPIC -D_FILE_OFFSET_BITS=64 -I/usr/include/gtksourceview-3.0 -I/usr/include/glib-2.0 -I/usr/lib/x86_64-linux-gnu/glib-2.0/include -I/usr/include/libmount -I/usr/include/blkid -I/usr/include/gtk-3.0 -I/usr/include/pango-1.0 -I/usr/include/harfbuzz -I/usr/include/freetype2 -I/usr/include/libpng16 -I/usr/include/fribidi -I/usr/include/cairo -I/usr/include/pixman-1 -I/usr/include/gdk-pixbuf-2.0 -I/usr/include/x86_64-linux-gnu -I/usr/include/gio-unix-2.0 -I/usr/include/atk-1.0 -I/usr/include/at-spi2-atk/2.0 -I/usr/include/at-spi-2.0 -I/usr/include/dbus-1.0 -I/usr/lib/x86_64-linux-gnu/dbus-1.0/include -pthread -I/usr/include/libxml2 -Wno-deprecated-declarations -g -I /home/opam/.opam/5.1/lib/ocaml -I /home/opam/.opam/5.1/lib/cairo2 -I /home/opam/.opam/5.1/lib/lablgtk3 -I /home/opam/.opam/5.1/lib/ocaml/threads -I /home/opam/.opam/5.1/lib/ocaml/unix -o ml_gtksourceview3.o -c ml_gtksourceview3.c)
- ml_gtksourceview3.c:796:13: warning: Deprecated pre-processor symbol: replace with "const"
-   796 | static G_CONST_RETURN gchar *
-       |             ^~~~~~~~~~~~~~~~~                                        
-> compiled  lablgtk3-sourceview3.3.1.3
Processing 76/84: [menhir: dune build]
-> installed lablgtk3-sourceview3.3.1.3
Processing 77/84: [menhir: dune build]
+ /home/opam/.opam/opam-init/hooks/sandbox.sh "build" "dune" "build" "-p" "menhir" "-j" "127" (CWD=/home/opam/.opam/5.1/.opam-switch/build/menhir.20220210)
- (cd _build/default/src/stage2 && .bin/menhir --exn-carries-state --no-pager --require-aliases --strict parser.mly --compare-errors parserMessages.auto.messages --compare-errors parserMessages.messages) > _build/default/src/stage2/parserMessages.check
- Read 101 sample input sentences and 101 error messages.
- Read 101 sample input sentences and 48 error messages.
- (cd _build/default && src/stage2/.bin/menhir --exn-carries-state --no-pager --require-aliases --strict -lg 1 -la 1 -lc 1 -v src/stage2/parser.mly --base src/stage2/parser --infer-read-reply src/stage2/parser__mock.mli.inferred)
- Grammar has 56 nonterminal symbols, among which 1 start symbols.
- Grammar has 37 terminal symbols.
- Grammar has 129 productions.
- Built an LR(0) automaton with 194 states.
- The grammar is not SLR(1) -- 5 states have a conflict.
- The construction mode is no-pager.
- Built an LR(1) automaton with 298 states.
- One shift/reduce conflict was silently solved.
- Extra reductions on error were added in 40 states.
- Priority played a role in 0 of these states.
- 152 out of 298 states have a default reduction.
- 102 out of 298 states are represented.
- 44 out of 96 symbols keep track of their start position.
- 41 out of 96 symbols keep track of their end position.
- 264 specialized copies of 64 functions have been created.
- The StackLang code contains 5161 instructions in 241 blocks.
- The StackLang code comprises 5 mutually recursive groups.
- (cd _build/default/src/stage2 && .bin/menhir --exn-carries-state --no-pager --require-aliases --strict parser.mly --compile-errors parserMessages.messages) > _build/default/src/stage2/parserMessages.ml
- Read 101 sample input sentences and 48 error messages.
-> compiled  menhir.20220210
-> installed menhir.20220210
Processing 79/84: [psmt2-frontend: dune build]
+ /home/opam/.opam/opam-init/hooks/sandbox.sh "build" "dune" "build" "-p" "psmt2-frontend" "-j" "127" "@install" (CWD=/home/opam/.opam/5.1/.opam-switch/build/psmt2-frontend.0.4.0)
- (cd _build/default && /home/opam/.opam/5.1/bin/menhir src/lib/smtlib_parser.mly --base src/lib/smtlib_parser --infer-write-query src/lib/smtlib_parser__mock.ml.mock)
- Note: the nonterminal symbol option (from src/lib/smtlib_parser.mly) is renamed src_lib_smtlib_parser_option.
- (cd _build/default && /home/opam/.opam/5.1/bin/menhir src/lib/smtlib_parser.mly --base src/lib/smtlib_parser --infer-read-reply src/lib/smtlib_parser__mock.mli.inferred)
- Note: the nonterminal symbol option (from src/lib/smtlib_parser.mly) is renamed src_lib_smtlib_parser_option.
- Warning: 22 end-of-stream conflicts were arbitrarily resolved.
- File "<standard.mly>", line 206, characters 16-16:
- Warning: production list(term) -> is never reduced.
- Warning: in total, 1 production is never reduced.
-> compiled  psmt2-frontend.0.4.0
-> installed psmt2-frontend.0.4.0

#=== ERROR while compiling ocplib-simplex.0.4 =================================#
# context              2.2.0~alpha~dev | linux/x86_64 | ocaml-variants.5.1.0+trunk | file:///home/opam/opam-repository
# path                 ~/.opam/5.1/.opam-switch/build/ocplib-simplex.0.4
# command              ~/.opam/opam-init/hooks/sandbox.sh build make
# exit-code            2
# env-file             ~/.opam/log/ocplib-simplex-8-932cf4.env
# output-file          ~/.opam/log/ocplib-simplex-8-932cf4.out
### output ###
# cp src/extSigs.mli src/extSigs.ml
# cp src/coreSig.mli src/coreSig.ml
# ocamldep -I src src/*.ml* > .depend
# ocamlc.opt -c -annot -absname -bin-annot -short-paths -strict-sequence -w +A -g -I src -for-pack OcplibSimplex src/version.mli
# ocamlc.opt -c -annot -absname -bin-annot -short-paths -strict-sequence -w +A -g -I src -for-pack OcplibSimplex src/version.ml
# ocamlc.opt -c -annot -absname -bin-annot -short-paths -strict-sequence -w +A -g -I src -for-pack OcplibSimplex src/extSigs.mli
# ocamlc.opt -c -annot -absname -bin-annot -short-paths -strict-sequence -w +A -g -I src -for-pack OcplibSimplex src/rat2.mli
# ocamlc.opt -c -annot -absname -bin-annot -short-paths -strict-sequence -w +A -g -I src -for-pack OcplibSimplex src/rat2.ml
# ocamlc.opt -c -annot -absname -bin-annot -short-paths -strict-sequence -w +A -g -I src -for-pack OcplibSimplex src/extSigs.ml
# ocamlc.opt -c -annot -absname -bin-annot -short-paths -strict-sequence -w +A -g -I src -for-pack OcplibSimplex src/polys.mli
# ocamlc.opt -c -annot -absname -bin-annot -short-paths -strict-sequence -w +A -g -I src -for-pack OcplibSimplex src/polys.ml
# ocamlc.opt -c -annot -absname -bin-annot -short-paths -strict-sequence -w +A -g -I src -for-pack OcplibSimplex src/coreSig.mli
# ocamlc.opt -c -annot -absname -bin-annot -short-paths -strict-sequence -w +A -g -I src -for-pack OcplibSimplex src/coreSig.ml
# ocamlc.opt -c -annot -absname -bin-annot -short-paths -strict-sequence -w +A -g -I src -for-pack OcplibSimplex src/core.mli
# ocamlc.opt -c -annot -absname -bin-annot -short-paths -strict-sequence -w +A -g -I src -for-pack OcplibSimplex src/core.ml
# File "/home/opam/.opam/5.1/.opam-switch/build/ocplib-simplex.0.4/src/core.ml", line 242, characters 14-75:
# 242 |               "%a   [ %a == (%4a , %4a) ]   %a   (computed %s) (flag %s)@."
#                     ^^^^^^^^^^^^^^^^^^^^^^^^^^^^^^^^^^^^^^^^^^^^^^^^^^^^^^^^^^^^^
# Error: invalid format "%a   [ %a == (%4a , %4a) ]   %a   (computed %s) (flag %s)@.": at character number 20, `padding' is incompatible with 'a' in sub-format "%4a"
# make: *** [Makefile:131: src/core.cmo] Error 2



<><> Error report <><><><><><><><><><><><><><><><><><><><><><><><><><><><><><><>
+- The following actions were aborted
| - install alt-ergo-lib     2.4.2
| - install alt-ergo-parsers 2.4.2
| - install altgr-ergo       2.4.2
+- 
+- The following actions failed
| - build ocplib-simplex 0.4
+- 
+- The following changes have been performed (the rest was aborted)
| - install cairo2               0.6.4
| - install camlp-streams        5.0.1
| - install camlzip              1.11
| - install cmdliner             1.1.1
| - install conf-autoconf        0.1
| - install conf-cairo           1
| - install conf-gmp             4
| - install conf-gtk3            18
| - install conf-gtksourceview3  0+2
| - install conf-pkg-config      2
| - install conf-which           1
| - install conf-zlib            1
| - install csexp                1.5.1
| - install dune                 3.6.1
| - install dune-configurator    3.6.1
| - install lablgtk3             3.1.3
| - install lablgtk3-sourceview3 3.1.3
| - install menhir               20220210
| - install menhirLib            20220210
| - install menhirSdk            20220210
| - install num                  1.4
| - install ocamlfind            1.9.5
| - install psmt2-frontend       0.4.0
| - install seq                  base
| - install stdlib-shims         0.3.0
| - install zarith               1.12
+- 
# Run eval $(opam env) to update the current shell environment

The former state can be restored with:
    /usr/bin/opam switch import "/home/opam/.opam/5.1/.opam-switch/backup/state-20230116123834.export"
'opam install -vy altgr-ergo.2.4.2' failed.
"/bin/bash" "-c"
"
opam remove -y "altgr-ergo.2.4.2"
opam install -vy "altgr-ergo.2.4.2"
res=$?
if [ $res = 31 ]; then
    if opam show -f x-ci-accept-failures: "altgr-ergo.2.4.2" | grep -q '"debian-unstable"'; then
        echo "This package failed and has been disabled for CI using the 'x-ci-accept-failures' field."
        exit 69
    fi
fi


exit $res
" failed with exit status 31
Failed: Build failed