OCamllabs icon Home|Differences with the last checks|Previous runs


Building on apache.ocamllabs.io

(from ocaml/opam:debian-unstable@sha256:ca0a0544477c6a9a763f100587b518646c93ce73d78874d823b27e8f935bb951)
Unable to find image 'ocaml/opam:debian-unstable@sha256:ca0a0544477c6a9a763f100587b518646c93ce73d78874d823b27e8f935bb951' locally
docker.io/ocaml/opam@sha256:ca0a0544477c6a9a763f100587b518646c93ce73d78874d823b27e8f935bb951: Pulling from ocaml/opam
4ab10c654db5: Pulling fs layer
4ab10c654db5: Verifying Checksum
4ab10c654db5: Download complete
4ab10c654db5: Pull complete
Digest: sha256:ca0a0544477c6a9a763f100587b518646c93ce73d78874d823b27e8f935bb951
Status: Downloaded newer image for ocaml/opam@sha256:ca0a0544477c6a9a763f100587b518646c93ce73d78874d823b27e8f935bb951
2023-01-16 12:35.55 ---> using "94874f478e26ede84037b9b3ffc4aac7c83b2542bbac8788a2cc7da937a47054" from cache

/: (user (uid 1000) (gid 1000))

/: (env OPAMPRECISETRACKING 1)

/: (env OPAMUTF8 never)

/: (env OPAMEXTERNALSOLVER builtin-0install)

/: (env OPAMCRITERIA +removed)

/: (run (shell "sudo ln -f /usr/bin/opam-dev /usr/bin/opam"))
2023-01-16 12:35.55 ---> using "e2ed8ca10c7e97a3eeacb1721604176c2efe0af3ca6e435d47ef0dd2f6bd15ce" from cache

/: (run (network host)
        (shell "rm -rf ~/opam-repository && git clone -q 'https://github.com/ocaml/opam-repository' ~/opam-repository && git -C ~/opam-repository checkout -q e0171a799fbb4458db77a10f76a6279727aac521"))
2023-01-16 12:35.55 ---> using "3864620b78a5bfd4a34825831d954f85d91d614ee4f51a2a653199fcbdb63f63" from cache

/: (run (shell "rm -rf ~/.opam && opam init -ya --bare --config ~/.opamrc-sandbox ~/opam-repository"))
Configuring from /home/opam/.opamrc-sandbox, then /home/opam/.opamrc, and finally from built-in defaults.
Checking for available remotes: rsync and local, git.
  - you won't be able to use mercurial repositories unless you install the hg command on your system.
  - you won't be able to use darcs repositories unless you install the darcs command on your system.


<><> Fetching repository information ><><><><><><><><><><><><><><><><><><><><><>
[default] Initialised

User configuration:
  ~/.profile is already up-to-date.
[NOTE] Make sure that ~/.profile is well sourced in your ~/.bashrc.

2023-01-16 12:35.55 ---> using "4e975791caadc63ea7aadc58806396bb379155c55894dc8ed37de19ce13ba00b" from cache

/: (run (cache (opam-archives (target /home/opam/.opam/download-cache)))
        (network host)
        (shell "opam switch create --repositories=default '5.1' '5.1.0+trunk'"))

<><> Installing new switch packages <><><><><><><><><><><><><><><><><><><><><><>
Switch invariant: ["ocaml-variants" {= "5.1.0+trunk"}]

<><> Processing actions <><><><><><><><><><><><><><><><><><><><><><><><><><><><>
-> installed base-bigarray.base
-> installed base-threads.base
-> installed base-unix.base
-> retrieved ocaml-variants.5.1.0+trunk  (https://github.com/ocaml/ocaml/archive/trunk.tar.gz)
-> installed ocaml-variants.5.1.0+trunk
-> installed ocaml-config.3
-> installed ocaml.5.1.0
-> installed base-domains.base
-> installed base-nnp.base
Done.
# Run eval $(opam env --switch=5.1) to update the current shell environment
2023-01-16 12:35.55 ---> using "1a9eb5e7f5c7386ab6bc96ce04ac8e6c5d9d8c68403bd67e5ea7158485ffab84" from cache

/: (run (network host)
        (shell "opam update --depexts"))
+ /usr/bin/sudo "apt-get" "update"
- Get:1 http://deb.debian.org/debian unstable InRelease [161 kB]
- Get:2 http://deb.debian.org/debian unstable/main amd64 Packages.diff/Index [63.6 kB]
- Get:3 http://deb.debian.org/debian unstable/main amd64 Packages T-2023-01-14-0804.37-F-2023-01-13-2043.11.pdiff [63.8 kB]
- Get:3 http://deb.debian.org/debian unstable/main amd64 Packages T-2023-01-14-0804.37-F-2023-01-13-2043.11.pdiff [63.8 kB]
- Fetched 289 kB in 2s (135 kB/s)
- Reading package lists...
- 
2023-01-16 12:35.55 ---> using "6db3368afb7eb8f3aed80233260d7b0c18ee4c4c2d75df31e9d439f60de86758" from cache

/: (run (cache (opam-archives (target /home/opam/.opam/download-cache)))
        (network host)
        (shell  "\
               \nopam remove -y \"alt-ergo-lib.2.4.2\"\
               \nopam install -vy \"alt-ergo-lib.2.4.2\"\
               \nres=$?\
               \nif [ $res = 31 ]; then\
               \n    if opam show -f x-ci-accept-failures: \"alt-ergo-lib.2.4.2\" | grep -q '\"debian-unstable\"'; then\
               \n        echo \"This package failed and has been disabled for CI using the 'x-ci-accept-failures' field.\"\
               \n        exit 69\
               \n    fi\
               \nfi\
               \n\
               \n\
               \nexit $res\
               \n"))
[NOTE] alt-ergo-lib.2.4.2 is not installed.

Nothing to do.
The following actions will be performed:
=== install 13 packages
  - install alt-ergo-lib      2.4.2
  - install conf-autoconf     0.1   [required by ocplib-simplex]
  - install conf-gmp          4     [required by zarith]
  - install conf-which        1     [required by conf-autoconf]
  - install csexp             1.5.1 [required by dune-configurator]
  - install dune              3.6.1 [required by alt-ergo-lib]
  - install dune-configurator 3.6.1 [required by alt-ergo-lib]
  - install num               1.4   [required by alt-ergo-lib]
  - install ocamlfind         1.9.5 [required by ocplib-simplex, num, zarith]
  - install ocplib-simplex    0.4   [required by alt-ergo-lib]
  - install seq               base  [required by alt-ergo-lib]
  - install stdlib-shims      0.3.0 [required by alt-ergo-lib]
  - install zarith            1.12  [required by alt-ergo-lib]

The following system packages will first need to be installed:
    autoconf libgmp-dev

<><> Handling external dependencies <><><><><><><><><><><><><><><><><><><><><><>

opam believes some required external dependencies are missing. opam can:
> 1. Run apt-get to install them (may need root/sudo access)
  2. Display the recommended apt-get command and wait while you run it manually (e.g. in another terminal)
  3. Attempt installation anyway, and permanently register that this external dependency is present, but not detectable
  4. Abort the installation

[1/2/3/4] 1

+ /usr/bin/sudo "apt-get" "install" "-qq" "-yy" "autoconf" "libgmp-dev"
- debconf: delaying package configuration, since apt-utils is not installed
- Selecting previously unselected package m4.
- (Reading database ... 
(Reading database ... 5%
(Reading database ... 10%
(Reading database ... 15%
(Reading database ... 20%
(Reading database ... 25%
(Reading database ... 30%
(Reading database ... 35%
(Reading database ... 40%
(Reading database ... 45%
(Reading database ... 50%
(Reading database ... 55%
(Reading database ... 60%
(Reading database ... 65%
(Reading database ... 70%
(Reading database ... 75%
(Reading database ... 80%
(Reading database ... 85%
(Reading database ... 90%
(Reading database ... 95%
(Reading database ... 100%
(Reading database ... 18671 files and directories currently installed.)
- Preparing to unpack .../0-m4_1.4.19-2_amd64.deb ...
- Unpacking m4 (1.4.19-2) ...
- Selecting previously unselected package autoconf.
- Preparing to unpack .../1-autoconf_2.71-2_all.deb ...
- Unpacking autoconf (2.71-2) ...
- Selecting previously unselected package autotools-dev.
- Preparing to unpack .../2-autotools-dev_20220109.1_all.deb ...
- Unpacking autotools-dev (20220109.1) ...
- Selecting previously unselected package automake.
- Preparing to unpack .../3-automake_1%3a1.16.5-1.3_all.deb ...
- Unpacking automake (1:1.16.5-1.3) ...
- Selecting previously unselected package libgmpxx4ldbl:amd64.
- Preparing to unpack .../4-libgmpxx4ldbl_2%3a6.2.1+dfsg1-1.1_amd64.deb ...
- Unpacking libgmpxx4ldbl:amd64 (2:6.2.1+dfsg1-1.1) ...
- Selecting previously unselected package libgmp-dev:amd64.
- Preparing to unpack .../5-libgmp-dev_2%3a6.2.1+dfsg1-1.1_amd64.deb ...
- Unpacking libgmp-dev:amd64 (2:6.2.1+dfsg1-1.1) ...
- Setting up m4 (1.4.19-2) ...
- Setting up autotools-dev (20220109.1) ...
- Setting up libgmpxx4ldbl:amd64 (2:6.2.1+dfsg1-1.1) ...
- Setting up autoconf (2.71-2) ...
- Setting up automake (1:1.16.5-1.3) ...
- update-alternatives: using /usr/bin/automake-1.16 to provide /usr/bin/automake (automake) in auto mode
- Setting up libgmp-dev:amd64 (2:6.2.1+dfsg1-1.1) ...
- Processing triggers for libc-bin (2.36-8) ...

<><> Processing actions <><><><><><><><><><><><><><><><><><><><><><><><><><><><>
Processing  1/38:
Processing  2/38:
Processing  3/38:
Processing  4/38:
Processing  5/38:
Processing  6/38:
Processing  7/38: [conf-gmp: sh]
Processing  8/38: [conf-gmp: sh] [conf-which: which which]
-> retrieved csexp.1.5.1  (cached)
Processing  9/38: [conf-gmp: sh] [conf-which: which which]
-> retrieved num.1.4  (cached)
Processing 10/38: [conf-gmp: sh] [conf-which: which which]
+ /home/opam/.opam/opam-init/hooks/sandbox.sh "build" "which" "which" (CWD=/home/opam/.opam/5.1/.opam-switch/build/conf-which.1)
- /usr/bin/which
-> compiled  conf-which.1
Processing 10/38: [conf-gmp: sh]
-> installed conf-which.1
Processing 11/38: [conf-gmp: sh]
Processing 12/38: [conf-autoconf: which autoconf] [conf-gmp: sh]
-> retrieved ocamlfind.1.9.5  (cached)
Processing 13/38: [conf-autoconf: which autoconf] [conf-gmp: sh]
[ocamlfind: patch] applying 0001-Fix-bug-when-installing-with-a-system-compiler.patch
Processing 14/38: [conf-autoconf: which autoconf] [conf-gmp: sh] [ocamlfind: patch]
-> retrieved alt-ergo-lib.2.4.2  (cached)
Processing 15/38: [conf-autoconf: which autoconf] [conf-gmp: sh] [ocamlfind: patch]
Processing 16/38: [conf-autoconf: which autoconf] [conf-gmp: sh] [ocamlfind: patch]
Processing 17/38: [conf-autoconf: which autoconf] [conf-gmp: sh] [ocamlfind: patch]
-> installed seq.base
Processing 18/38: [conf-autoconf: which autoconf] [conf-gmp: sh] [ocamlfind: patch]
+ /home/opam/.opam/opam-init/hooks/sandbox.sh "build" "sh" "-exc" "cc -c $CFLAGS -I/usr/local/include test.c" (CWD=/home/opam/.opam/5.1/.opam-switch/build/conf-gmp.4)
- + cc -c -I/usr/local/include test.c
-> compiled  conf-gmp.4
Processing 18/38: [conf-autoconf: which autoconf] [ocamlfind: patch]
-> installed conf-gmp.4
Processing 19/38: [conf-autoconf: which autoconf] [ocamlfind: patch]
+ /home/opam/.opam/opam-init/hooks/sandbox.sh "build" "which" "autoconf" (CWD=/home/opam/.opam/5.1/.opam-switch/build/conf-autoconf.0.1)
- /usr/bin/autoconf
-> compiled  conf-autoconf.0.1
Processing 19/38: [ocamlfind: patch]
-> installed conf-autoconf.0.1
Processing 20/38: [ocamlfind: patch]
-> retrieved ocplib-simplex.0.4  (cached)
Processing 21/38: [ocamlfind: patch]
Processing 21/38: [ocamlfind: ./configure]
-> retrieved stdlib-shims.0.3.0  (cached)
-> retrieved zarith.1.12  (cached)
-> retrieved dune.3.6.1, dune-configurator.3.6.1  (cached)
Processing 22/38: [dune: ocaml 127] [ocamlfind: ./configure]
+ /home/opam/.opam/opam-init/hooks/sandbox.sh "build" "./configure" "-bindir" "/home/opam/.opam/5.1/bin" "-sitelib" "/home/opam/.opam/5.1/lib" "-mandir" "/home/opam/.opam/5.1/man" "-config" "/home/opam/.opam/5.1/lib/findlib.conf" "-no-custom" "-no-camlp4" (CWD=/home/opam/.opam/5.1/.opam-switch/build/ocamlfind.1.9.5)
- Welcome to findlib version 1.9.5
- Configuring core...
- Checking for #remove_directory...
- Testing threading model...
- systhread_supported: true
- Testing DLLs...
- Testing whether ppxopt can be supported...
- Checking for ocamlc -opaque...
- Querying installation: META list not found
- make install will double-check installed META files
- Configuring libraries...
- unix: found (in +unix)
- dynlink: found (in +dynlink)
- bigarray: not present (possible since 4.08)
- compiler-libs: found
- dbm: not present (normal since 4.00)
- graphics: not present (normal since 4.09)
- num: not present (normal since 4.06)
- ocamlbuild: not present (normal since 4.03)
- ocamldoc: found (in +ocamldoc)
- raw_spacetime: not present (normal since 4.12)
- threads: found (in +threads)
- runtime_events: found (in +runtime_events)
- str: found (in +str)
- labltk: not present (normal since 4.02)
- native dynlink: found
- camlp4: disabled
- bytes: found, installing fake library
- Configuration for stdlib written to site-lib-src/stdlib/META
- Configuration for unix written to site-lib-src/unix/META
- Configuration for dynlink written to site-lib-src/dynlink/META
- Configuration for compiler-libs written to site-lib-src/compiler-libs/META
- Configuration for ocamldoc written to site-lib-src/ocamldoc/META
- Configuration for threads written to site-lib-src/threads/META
- Configuration for runtime_events written to site-lib-src/runtime_events/META
- Configuration for str written to site-lib-src/str/META
- Configuration for bytes written to site-lib-src/bytes/META
- Detecting compiler arguments: (extractor built) ok
- 
- About the OCAML core installation:
-     Standard library:      /home/opam/.opam/5.1/lib/ocaml
-     Binaries:              /home/opam/.opam/5.1/bin
-     Manual pages:          /home/opam/.opam/5.1/man
-     Multi-threading type:  posix
- The directory of site-specific packages will be
-     site-lib:              /home/opam/.opam/5.1/lib
- The configuration file is written to:
-     findlib config file:   /home/opam/.opam/5.1/lib/findlib.conf
- Software will be installed:
-     Libraries:             in <site-lib>/findlib
-     Binaries:              /home/opam/.opam/5.1/bin
-     Manual pages:          /home/opam/.opam/5.1/man
-     topfind script:        /home/opam/.opam/5.1/lib/ocaml
- Topfind ppxopt support:    yes
- Toolbox:                   no
- Link custom runtime:       no
- Need bytes compatibility:  no
- 
- Configuration has been written to Makefile.config
- 
- You can now do 'make all', and optionally 'make opt', to build ocamlfind.
Processing 22/38: [dune: ocaml 127] [ocamlfind: make all]
+ /home/opam/.opam/opam-init/hooks/sandbox.sh "build" "make" "all" (CWD=/home/opam/.opam/5.1/.opam-switch/build/ocamlfind.1.9.5)
- for p in findlib; do ( cd src/$p; make all ) || exit; done
- make[1]: Entering directory '/home/opam/.opam/5.1/.opam-switch/build/ocamlfind.1.9.5/src/findlib'
- ocamllex fl_meta.mll
- 22 states, 392 transitions, table size 1700 bytes
- USE_CYGPATH="0"; \
- export USE_CYGPATH; \
- cat findlib_config.mlp | \
-          ../../tools/patch '@CONFIGFILE@' '/home/opam/.opam/5.1/lib/findlib.conf' | \
-          ../../tools/patch '@STDLIB@' '/home/opam/.opam/5.1/lib/ocaml' | \
- 	sed -e 's;@AUTOLINK@;true;g' \
- 	    -e 's;@SYSTEM@;linux;g' \
- 	     >findlib_config.ml
- if [ "true" = "true" ]; then                 \
- 	cp topfind.ml.in topfind.ml;                             \
- else                                                             \
- 	sed -e '/PPXOPT_BEGIN/,/PPXOPT_END/ d' topfind.ml.in     \
- 		> topfind.ml ;                                   \
- fi
- ocamldep *.ml *.mli >depend
- ocamlc -I +compiler-libs -opaque   -I +unix -I +dynlink -g -c findlib_config.ml
- ocamlc -I +compiler-libs -opaque   -I +unix -I +dynlink -g -c fl_split.ml
- ocamlc -I +compiler-libs -opaque   -I +unix -I +dynlink -g -c fl_metatoken.ml
- ocamlc -I +compiler-libs -opaque   -I +unix -I +dynlink -g -c fl_meta.ml
- ocamlc -I +compiler-libs -opaque   -I +unix -I +dynlink -c fl_metascanner.mli
- ocamlc -I +compiler-libs -opaque   -I +unix -I +dynlink -g -c fl_metascanner.ml
- ocamlc -I +compiler-libs -opaque   -I +unix -I +dynlink -c fl_topo.mli
- ocamlc -I +compiler-libs -opaque   -I +unix -I +dynlink -g -c fl_topo.ml
- ocamlc -I +compiler-libs -opaque   -I +unix -I +dynlink -c fl_package_base.mli
- ocamlc -I +compiler-libs -opaque   -I +unix -I +dynlink -g -c fl_package_base.ml
- File "fl_package_base.ml", line 304, characters 22-40:
- 304 | 	 let pkg_ancestors = query_requirements predlist pkg in
-       	                     ^^^^^^^^^^^^^^^^^^
- Warning 6 [labels-omitted]: label preds was omitted in the application of this function.
- File "fl_package_base.ml", line 350, characters 18-36:
- 350 |   let ancestors = query_requirements predlist package_name in
-                         ^^^^^^^^^^^^^^^^^^
- Warning 6 [labels-omitted]: label preds was omitted in the application of this function.
- File "fl_package_base.ml", line 375, characters 23-41:
- 375 | 	  let pkg_ancestors = query_requirements predlist pkg in
-       	                      ^^^^^^^^^^^^^^^^^^
- Warning 6 [labels-omitted]: label preds was omitted in the application of this function.
- File "fl_package_base.ml", line 510, characters 16-35:
- 510 | 	     ( let c = package_definitions search_path pkg.package_name in
-       	               ^^^^^^^^^^^^^^^^^^^
- Warning 6 [labels-omitted]: label search_path was omitted in the application of this function.
- ocamlc -I +compiler-libs -opaque   -I +unix -I +dynlink -c findlib.mli
- ocamlc -I +compiler-libs -opaque   -I +unix -I +dynlink -g -c findlib.ml
- File "findlib.ml", line 390, characters 2-26:
- 390 |   Fl_package_base.requires predlist pkg
-         ^^^^^^^^^^^^^^^^^^^^^^^^
- Warning 6 [labels-omitted]: label preds was omitted in the application of this function.
- File "findlib.ml", line 396, characters 2-33:
- 396 |   Fl_package_base.requires_deeply predlist pkglist
-         ^^^^^^^^^^^^^^^^^^^^^^^^^^^^^^^
- Warning 6 [labels-omitted]: label preds was omitted in the application of this function.
- ocamlc -I +compiler-libs -opaque   -I +unix -I +dynlink -g -c fl_args.ml
- ocamlc -I +compiler-libs -opaque   -I +unix -I +dynlink -g -c fl_lint.ml
- ocamlc -I +compiler-libs -a -o findlib.cma findlib_config.cmo fl_split.cmo fl_metatoken.cmo fl_meta.cmo fl_metascanner.cmo fl_topo.cmo fl_package_base.cmo findlib.cmo fl_args.cmo fl_lint.cmo
- ocamlc -I +compiler-libs -opaque   -I +unix -I +dynlink -g -c ocaml_args.ml
- ocamlc -I +compiler-libs -opaque   -I +unix -I +dynlink -g -c frontend.ml
- File "frontend.ml", line 859, characters 10-39:
- 859 |           Fl_package_base.package_users predicates1 packages1
-                 ^^^^^^^^^^^^^^^^^^^^^^^^^^^^^
- Warning 6 [labels-omitted]: label preds was omitted in the application of this function.
- ocamlc -I +compiler-libs  -o ocamlfind -g findlib.cma unix.cma \
-            -I +unix -I +dynlink ocaml_args.cmo frontend.cmo
- ocamlc -I +compiler-libs -opaque   -I +unix -I +dynlink -c topfind.mli
- ocamlc -I +compiler-libs -opaque   -I +unix -I +dynlink -g -c topfind.ml
- File "topfind.ml", line 126, characters 40-63:
- 126 |                      match Hashtbl.find Toploop.directive_table "ppx" with
-                                               ^^^^^^^^^^^^^^^^^^^^^^^
- Alert deprecated: Toploop.directive_table
- File "topfind.ml", line 256, characters 4-27:
- 256 |     Toploop.directive_table
-           ^^^^^^^^^^^^^^^^^^^^^^^
- Alert deprecated: Toploop.directive_table
- File "topfind.ml", line 266, characters 4-27:
- 266 |     Toploop.directive_table
-           ^^^^^^^^^^^^^^^^^^^^^^^
- Alert deprecated: Toploop.directive_table
- File "topfind.ml", line 278, characters 4-27:
- 278 |     Toploop.directive_table
-           ^^^^^^^^^^^^^^^^^^^^^^^
- Alert deprecated: Toploop.directive_table
- File "topfind.ml", line 291, characters 4-27:
- 291 |     Toploop.directive_table
-           ^^^^^^^^^^^^^^^^^^^^^^^
- Alert deprecated: Toploop.directive_table
- File "topfind.ml", line 305, characters 4-27:
- 305 |     Toploop.directive_table
-           ^^^^^^^^^^^^^^^^^^^^^^^
- Alert deprecated: Toploop.directive_table
- File "topfind.ml", line 317, characters 4-27:
- 317 |     Toploop.directive_table
-           ^^^^^^^^^^^^^^^^^^^^^^^
- Alert deprecated: Toploop.directive_table
- ocamlc -I +compiler-libs -a -o findlib_top.cma topfind.cmo
- USE_CYGPATH="0"; \
- export USE_CYGPATH; \
- cat topfind_rd1.p | \
-          ../../tools/patch '@SITELIB@' '/home/opam/.opam/5.1/lib' \
-     	    >topfind
- ocamlc -I +compiler-libs -opaque   -I +unix -I +dynlink -c fl_dynload.mli
- ocamlc -I +compiler-libs -opaque   -I +unix -I +dynlink -g -c fl_dynload.ml
- ocamlc -I +compiler-libs -a -o findlib_dynload.cma fl_dynload.cmo
- make[1]: Leaving directory '/home/opam/.opam/5.1/.opam-switch/build/ocamlfind.1.9.5/src/findlib'
- make all-config
- make[1]: Entering directory '/home/opam/.opam/5.1/.opam-switch/build/ocamlfind.1.9.5'
- USE_CYGPATH="0"; \
- export USE_CYGPATH; \
- cat findlib.conf.in | \
-      tools/patch '@SITELIB@' '/home/opam/.opam/5.1/lib' >findlib.conf
- if ./tools/cmd_from_same_dir ocamlc; then \
- 	echo 'ocamlc="ocamlc.opt"' >>findlib.conf; \
- fi
- if ./tools/cmd_from_same_dir ocamlopt; then \
- 	echo 'ocamlopt="ocamlopt.opt"' >>findlib.conf; \
- fi
- if ./tools/cmd_from_same_dir ocamldep; then \
- 	echo 'ocamldep="ocamldep.opt"' >>findlib.conf; \
- fi
- if ./tools/cmd_from_same_dir ocamldoc; then \
- 	echo 'ocamldoc="ocamldoc.opt"' >>findlib.conf; \
- fi
- make[1]: Leaving directory '/home/opam/.opam/5.1/.opam-switch/build/ocamlfind.1.9.5'
Processing 22/38: [dune: ocaml 127] [ocamlfind: make opt]
+ /home/opam/.opam/opam-init/hooks/sandbox.sh "build" "make" "opt" (CWD=/home/opam/.opam/5.1/.opam-switch/build/ocamlfind.1.9.5)
- for p in findlib; do ( cd src/$p; make opt ) || exit; done
- make[1]: Entering directory '/home/opam/.opam/5.1/.opam-switch/build/ocamlfind.1.9.5/src/findlib'
- ocamlopt -I +compiler-libs -g -opaque  -I +unix -I +dynlink -c findlib_config.ml
- ocamlopt -I +compiler-libs -g -opaque  -I +unix -I +dynlink -c fl_split.ml
- ocamlopt -I +compiler-libs -g -opaque  -I +unix -I +dynlink -c fl_metatoken.ml
- ocamlopt -I +compiler-libs -g -opaque  -I +unix -I +dynlink -c fl_meta.ml
- ocamlopt -I +compiler-libs -g -opaque  -I +unix -I +dynlink -c fl_metascanner.ml
- ocamlopt -I +compiler-libs -g -opaque  -I +unix -I +dynlink -c fl_topo.ml
- ocamlopt -I +compiler-libs -g -opaque  -I +unix -I +dynlink -c fl_package_base.ml
- File "fl_package_base.ml", line 304, characters 22-40:
- 304 | 	 let pkg_ancestors = query_requirements predlist pkg in
-       	                     ^^^^^^^^^^^^^^^^^^
- Warning 6 [labels-omitted]: label preds was omitted in the application of this function.
- File "fl_package_base.ml", line 350, characters 18-36:
- 350 |   let ancestors = query_requirements predlist package_name in
-                         ^^^^^^^^^^^^^^^^^^
- Warning 6 [labels-omitted]: label preds was omitted in the application of this function.
- File "fl_package_base.ml", line 375, characters 23-41:
- 375 | 	  let pkg_ancestors = query_requirements predlist pkg in
-       	                      ^^^^^^^^^^^^^^^^^^
- Warning 6 [labels-omitted]: label preds was omitted in the application of this function.
- File "fl_package_base.ml", line 510, characters 16-35:
- 510 | 	     ( let c = package_definitions search_path pkg.package_name in
-       	               ^^^^^^^^^^^^^^^^^^^
- Warning 6 [labels-omitted]: label search_path was omitted in the application of this function.
- ocamlopt -I +compiler-libs -g -opaque  -I +unix -I +dynlink -c findlib.ml
- File "findlib.ml", line 390, characters 2-26:
- 390 |   Fl_package_base.requires predlist pkg
-         ^^^^^^^^^^^^^^^^^^^^^^^^
- Warning 6 [labels-omitted]: label preds was omitted in the application of this function.
- File "findlib.ml", line 396, characters 2-33:
- 396 |   Fl_package_base.requires_deeply predlist pkglist
-         ^^^^^^^^^^^^^^^^^^^^^^^^^^^^^^^
- Warning 6 [labels-omitted]: label preds was omitted in the application of this function.
- ocamlopt -I +compiler-libs -g -opaque  -I +unix -I +dynlink -c fl_args.ml
- ocamlopt -I +compiler-libs -g -opaque  -I +unix -I +dynlink -c fl_lint.ml
- ocamlopt -I +compiler-libs -g -a -o findlib.cmxa findlib_config.cmx fl_split.cmx fl_metatoken.cmx fl_meta.cmx fl_metascanner.cmx fl_topo.cmx fl_package_base.cmx findlib.cmx fl_args.cmx fl_lint.cmx
- if [ 1 -gt 0 ]; then \
-     ocamlopt -I +compiler-libs -g -shared -o findlib.cmxs findlib_config.cmx fl_split.cmx fl_metatoken.cmx fl_meta.cmx fl_metascanner.cmx fl_topo.cmx fl_package_base.cmx findlib.cmx fl_args.cmx fl_lint.cmx; \
- fi
- ocamlopt -I +compiler-libs -g -opaque  -I +unix -I +dynlink -c ocaml_args.ml
- ocamlopt -I +compiler-libs -g -opaque  -I +unix -I +dynlink -c frontend.ml
- File "frontend.ml", line 859, characters 10-39:
- 859 |           Fl_package_base.package_users predicates1 packages1
-                 ^^^^^^^^^^^^^^^^^^^^^^^^^^^^^
- Warning 6 [labels-omitted]: label preds was omitted in the application of this function.
- ocamlopt -I +compiler-libs -g -o ocamlfind_opt findlib.cmxa unix.cmxa \
- 	   -I +unix -I +dynlink ocaml_args.cmx frontend.cmx
- ocamlopt -I +compiler-libs -g -opaque  -I +unix -I +dynlink -c topfind.ml
- File "topfind.ml", line 126, characters 40-63:
- 126 |                      match Hashtbl.find Toploop.directive_table "ppx" with
-                                               ^^^^^^^^^^^^^^^^^^^^^^^
- Alert deprecated: Toploop.directive_table
- File "topfind.ml", line 256, characters 4-27:
- 256 |     Toploop.directive_table
-           ^^^^^^^^^^^^^^^^^^^^^^^
- Alert deprecated: Toploop.directive_table
- File "topfind.ml", line 266, characters 4-27:
- 266 |     Toploop.directive_table
-           ^^^^^^^^^^^^^^^^^^^^^^^
- Alert deprecated: Toploop.directive_table
- File "topfind.ml", line 278, characters 4-27:
- 278 |     Toploop.directive_table
-           ^^^^^^^^^^^^^^^^^^^^^^^
- Alert deprecated: Toploop.directive_table
- File "topfind.ml", line 291, characters 4-27:
- 291 |     Toploop.directive_table
-           ^^^^^^^^^^^^^^^^^^^^^^^
- Alert deprecated: Toploop.directive_table
- File "topfind.ml", line 305, characters 4-27:
- 305 |     Toploop.directive_table
-           ^^^^^^^^^^^^^^^^^^^^^^^
- Alert deprecated: Toploop.directive_table
- File "topfind.ml", line 317, characters 4-27:
- 317 |     Toploop.directive_table
-           ^^^^^^^^^^^^^^^^^^^^^^^
- Alert deprecated: Toploop.directive_table
- ocamlopt -I +compiler-libs -g -a -o findlib_top.cmxa topfind.cmx
- if [ 1 -gt 0 ]; then \
-     ocamlopt -I +compiler-libs -g -shared -o findlib_top.cmxs topfind.cmx; \
- fi
- ocamlopt -I +compiler-libs -g -opaque  -I +unix -I +dynlink -c fl_dynload.ml
- ocamlopt -I +compiler-libs -g -a -o findlib_dynload.cmxa fl_dynload.cmx
- if [ 1 -gt 0 ]; then \
-     ocamlopt -I +compiler-libs -g -shared -o findlib_dynload.cmxs fl_dynload.cmx; \
- fi
- make[1]: Leaving directory '/home/opam/.opam/5.1/.opam-switch/build/ocamlfind.1.9.5/src/findlib'
-> compiled  ocamlfind.1.9.5
Processing 22/38: [dune: ocaml 127]
Processing 23/38: [dune: ocaml 127] [ocamlfind: make install]
+ /home/opam/.opam/opam-init/hooks/sandbox.sh "install" "make" "install" (CWD=/home/opam/.opam/5.1/.opam-switch/build/ocamlfind.1.9.5)
- if [ "1" -eq 1 ]; then \
-     for x in camlp4 dbm graphics labltk num ocamlbuild; do \
-       if [ -f "/home/opam/.opam/5.1/lib/$x/META" ]; then \
-         if ! grep -Fq '[distributed with Ocaml]' "//home/opam/.opam/5.1/lib/$x/META"; then \
-           rm -f site-lib-src/$x/META; \
-         fi; \
-       fi; \
-     done; \
-     test -f "site-lib-src/num/META" || rm -f "site-lib-src/num-top/META"; \
-   fi
- echo 'SITELIB_META =' > Makefile.packages.in
- for x in `ls site-lib-src`; do test ! -f "site-lib-src/$x/META" || echo $x >> Makefile.packages.in; done
- tr '\n' ' ' < Makefile.packages.in > Makefile.packages
- rm Makefile.packages.in
- install -d "/home/opam/.opam/5.1/bin"
- install -d "/home/opam/.opam/5.1/man"
- make install-config
- make[1]: Entering directory '/home/opam/.opam/5.1/.opam-switch/build/ocamlfind.1.9.5'
- install -d "`dirname \"/home/opam/.opam/5.1/lib/findlib.conf\"`"
- test -f "/home/opam/.opam/5.1/lib/findlib.conf" || install -c findlib.conf "/home/opam/.opam/5.1/lib/findlib.conf"
- make[1]: Leaving directory '/home/opam/.opam/5.1/.opam-switch/build/ocamlfind.1.9.5'
- for p in findlib; do ( cd src/$p; make install ); done
- make[1]: Entering directory '/home/opam/.opam/5.1/.opam-switch/build/ocamlfind.1.9.5/src/findlib'
- install -d "/home/opam/.opam/5.1/lib/findlib"
- install -d "/home/opam/.opam/5.1/bin"
- test 1 -eq 0 || install -d "/home/opam/.opam/5.1/lib/ocaml"
- test 1 -eq 0 || install -c topfind "/home/opam/.opam/5.1/lib/ocaml/"
- files=` ../../tools/collect_files ../../Makefile.config \
- findlib.cmi findlib.mli findlib.cma findlib.cmxa findlib.a findlib.cmxs \
- findlib_config.cmi findlib_config.ml topfind.cmi topfind.mli \
- fl_args.cmi fl_lint.cmi fl_meta.cmi fl_split.cmi fl_topo.cmi ocaml_args.cmi \
- fl_package_base.mli fl_package_base.cmi fl_metascanner.mli fl_metascanner.cmi \
- fl_metatoken.cmi findlib_top.cma findlib_top.cmxa findlib_top.a findlib_top.cmxs \
- findlib_dynload.cma findlib_dynload.cmxa findlib_dynload.a findlib_dynload.cmxs fl_dynload.mli fl_dynload.cmi \
- META` && \
- install -c $files "/home/opam/.opam/5.1/lib/findlib/"
- f="ocamlfind"; { test -f ocamlfind_opt && f="ocamlfind_opt"; }; \
- install -c $f "/home/opam/.opam/5.1/bin/ocamlfind"
- # the following "if" block is only needed for 4.00beta2
- if [ 1 -eq 0 -a -f "/home/opam/.opam/5.1/lib/ocaml/compiler-libs/topdirs.cmi" ]; then \
-     cd "/home/opam/.opam/5.1/lib/ocaml/compiler-libs/"; \
-     install -c topdirs.cmi toploop.cmi "/home/opam/.opam/5.1/lib/findlib/"; \
- fi
- make[1]: Leaving directory '/home/opam/.opam/5.1/.opam-switch/build/ocamlfind.1.9.5/src/findlib'
- make install-meta
- make[1]: Entering directory '/home/opam/.opam/5.1/.opam-switch/build/ocamlfind.1.9.5'
- for x in bytes compiler-libs dynlink ocamldoc runtime_events stdlib str threads unix ; do install -d "/home/opam/.opam/5.1/lib/$x"; install -c site-lib-src/$x/META "/home/opam/.opam/5.1/lib/$x/META.tmp" && mv "/home/opam/.opam/5.1/lib/$x/META.tmp" "/home/opam/.opam/5.1/lib/$x/META"; done
- install -d "/home/opam/.opam/5.1/lib/findlib"; install -c Makefile.packages "/home/opam/.opam/5.1/lib/findlib/Makefile.packages"
- make[1]: Leaving directory '/home/opam/.opam/5.1/.opam-switch/build/ocamlfind.1.9.5'
- test ! -f 'site-lib-src/num-top/META' || { cd src/findlib; make install-num-top; }
- test ! -f 'site-lib-src/camlp4/META' ||	install -c tools/safe_camlp4 "/home/opam/.opam/5.1/bin"
- make install-doc
- make[1]: Entering directory '/home/opam/.opam/5.1/.opam-switch/build/ocamlfind.1.9.5'
- install -d "/home/opam/.opam/5.1/man/man1" "/home/opam/.opam/5.1/man/man3" "/home/opam/.opam/5.1/man/man5"
- install -c doc/ref-man/ocamlfind.1 "/home/opam/.opam/5.1/man/man1"
- install -c doc/ref-man/META.5 doc/ref-man/site-lib.5 doc/ref-man/findlib.conf.5 "/home/opam/.opam/5.1/man/man5"
- make[1]: Leaving directory '/home/opam/.opam/5.1/.opam-switch/build/ocamlfind.1.9.5'
-> installed ocamlfind.1.9.5
Processing 23/38: [dune: ocaml 127]
Processing 24/38: [dune: ocaml 127] [num: make]
Processing 25/38: [dune: ocaml 127] [num: make] [zarith: ./configure]
+ /home/opam/.opam/opam-init/hooks/sandbox.sh "build" "./configure" (CWD=/home/opam/.opam/5.1/.opam-switch/build/zarith.1.12)
- binary ocaml: found in /home/opam/.opam/5.1/bin
- binary ocamlc: found in /home/opam/.opam/5.1/bin
- binary ocamldep: found in /home/opam/.opam/5.1/bin
- binary ocamlmklib: found in /home/opam/.opam/5.1/bin
- binary ocamldoc: found in /home/opam/.opam/5.1/bin
- binary gcc: found in /usr/bin
- binary ocamlopt: found in /home/opam/.opam/5.1/bin
- checking compilation with gcc -O3 -Wall -Wextra : working
- include caml/mlvalues.h: found
- library dynlink.cmxa: found
- binary ocamlfind: found in /home/opam/.opam/5.1/bin
- OCaml's word size is 64
- binary uname: found in /usr/bin
- include gmp.h: found
- library gmp: found
- OCaml supports -bin-annot to produce documentation
- 
- detected configuration:
- 
-   native-code:          yes
-   dynamic linking:      yes
-   defines:              -DHAS_GMP 
-   libraries:             -lgmp
-   C options:            -O3 -Wall -Wextra 
-   installation path:    /home/opam/.opam/5.1/lib
-   installation method   findlib
- 
- configuration successful!
- now type "make" to build
- then type "make install" or "sudo make install" to install
Processing 25/38: [dune: ocaml 127] [num: make] [zarith: make]
+ /home/opam/.opam/opam-init/hooks/sandbox.sh "build" "make" (CWD=/home/opam/.opam/5.1/.opam-switch/build/num.1.4)
- make -C src all
- make[1]: Entering directory '/home/opam/.opam/5.1/.opam-switch/build/num.1.4/src'
- ocamlc -ccopt -DBNG_ARCH_amd64 -c bng.c
- ocamlc -ccopt -DBNG_ARCH_amd64 -c nat_stubs.c
- ocamlmklib -oc nums bng.o nat_stubs.o
- ocamlc -w +a-4-9-41-42-44-45-48 -warn-error A -bin-annot -g -safe-string -strict-sequence -strict-formats -c int_misc.mli
- ocamlc -w +a-4-9-41-42-44-45-48 -warn-error A -bin-annot -g -safe-string -strict-sequence -strict-formats -c int_misc.ml
- ocamlc -w +a-4-9-41-42-44-45-48 -warn-error A -bin-annot -g -safe-string -strict-sequence -strict-formats -c nat.mli
- ocamlc -w +a-4-9-41-42-44-45-48 -warn-error A -bin-annot -g -safe-string -strict-sequence -strict-formats -c nat.ml
- ocamlc -w +a-4-9-41-42-44-45-48 -warn-error A -bin-annot -g -safe-string -strict-sequence -strict-formats -c big_int.mli
- ocamlc -w +a-4-9-41-42-44-45-48 -warn-error A -bin-annot -g -safe-string -strict-sequence -strict-formats -c big_int.ml
- ocamlc -w +a-4-9-41-42-44-45-48 -warn-error A -bin-annot -g -safe-string -strict-sequence -strict-formats -c arith_flags.mli
- ocamlc -w +a-4-9-41-42-44-45-48 -warn-error A -bin-annot -g -safe-string -strict-sequence -strict-formats -c arith_flags.ml
- ocamlc -w +a-4-9-41-42-44-45-48 -warn-error A -bin-annot -g -safe-string -strict-sequence -strict-formats -c ratio.mli
- ocamlc -w +a-4-9-41-42-44-45-48 -warn-error A -bin-annot -g -safe-string -strict-sequence -strict-formats -c ratio.ml
- ocamlc -w +a-4-9-41-42-44-45-48 -warn-error A -bin-annot -g -safe-string -strict-sequence -strict-formats -c num.mli
- ocamlc -w +a-4-9-41-42-44-45-48 -warn-error A -bin-annot -g -safe-string -strict-sequence -strict-formats -c num.ml
- ocamlc -w +a-4-9-41-42-44-45-48 -warn-error A -bin-annot -g -safe-string -strict-sequence -strict-formats -c arith_status.mli
- ocamlc -w +a-4-9-41-42-44-45-48 -warn-error A -bin-annot -g -safe-string -strict-sequence -strict-formats -c arith_status.ml
- ocamlmklib -o nums -oc nums -linkall int_misc.cmo nat.cmo big_int.cmo arith_flags.cmo ratio.cmo num.cmo arith_status.cmo
- ocamlopt -w +a-4-9-41-42-44-45-48 -warn-error A -bin-annot -g -safe-string -strict-sequence -strict-formats -c int_misc.ml
- ocamlopt -w +a-4-9-41-42-44-45-48 -warn-error A -bin-annot -g -safe-string -strict-sequence -strict-formats -c nat.ml
- ocamlopt -w +a-4-9-41-42-44-45-48 -warn-error A -bin-annot -g -safe-string -strict-sequence -strict-formats -c big_int.ml
- ocamlopt -w +a-4-9-41-42-44-45-48 -warn-error A -bin-annot -g -safe-string -strict-sequence -strict-formats -c arith_flags.ml
- ocamlopt -w +a-4-9-41-42-44-45-48 -warn-error A -bin-annot -g -safe-string -strict-sequence -strict-formats -c ratio.ml
- ocamlopt -w +a-4-9-41-42-44-45-48 -warn-error A -bin-annot -g -safe-string -strict-sequence -strict-formats -c num.ml
- ocamlopt -w +a-4-9-41-42-44-45-48 -warn-error A -bin-annot -g -safe-string -strict-sequence -strict-formats -c arith_status.ml
- ocamlmklib -o nums -oc nums -linkall int_misc.cmx nat.cmx big_int.cmx arith_flags.cmx ratio.cmx num.cmx arith_status.cmx
- ocamlopt -w +a-4-9-41-42-44-45-48 -warn-error A -bin-annot -g -safe-string -strict-sequence -strict-formats -I . -shared -o nums.cmxs nums.cmxa
- make[1]: Leaving directory '/home/opam/.opam/5.1/.opam-switch/build/num.1.4/src'
- make -C toplevel all
- make[1]: Entering directory '/home/opam/.opam/5.1/.opam-switch/build/num.1.4/toplevel'
- ocamlc -I ../src -I +compiler-libs -w +a-4-9-41-42-44-45-48 -warn-error A -safe-string -strict-sequence -strict-formats -c num_top_printers.mli
- ocamlc -I ../src -I +compiler-libs -w +a-4-9-41-42-44-45-48 -warn-error A -safe-string -strict-sequence -strict-formats -c num_top_printers.ml
- ocamlc -I ../src -I +compiler-libs -w +a-4-9-41-42-44-45-48 -warn-error A -safe-string -strict-sequence -strict-formats -c num_top.mli
- ocamlc -I ../src -I +compiler-libs -w +a-4-9-41-42-44-45-48 -warn-error A -safe-string -strict-sequence -strict-formats -c num_top.ml
- ocamlc -I ../src -I +compiler-libs -w +a-4-9-41-42-44-45-48 -warn-error A -safe-string -strict-sequence -strict-formats -a -o num_top.cma num_top_printers.cmo num_top.cmo
- make[1]: Leaving directory '/home/opam/.opam/5.1/.opam-switch/build/num.1.4/toplevel'
-> compiled  num.1.4
Processing 25/38: [dune: ocaml 127] [zarith: make]
Processing 26/38: [dune: ocaml 127] [zarith: make] [num: ocamlfind remove]
+ /home/opam/.opam/opam-init/hooks/sandbox.sh "install" "ocamlfind" "remove" "num" (CWD=/home/opam/.opam/5.1/.opam-switch/build/num.1.4)
- ocamlfind: [WARNING] No such file: /home/opam/.opam/5.1/lib/num/META
+ /home/opam/.opam/opam-init/hooks/sandbox.sh "install" "ocamlfind" "remove" "num-top" (CWD=/home/opam/.opam/5.1/.opam-switch/build/num.1.4)
- ocamlfind: [WARNING] No such file: /home/opam/.opam/5.1/lib/num-top/META
Processing 26/38: [dune: ocaml 127] [zarith: make] [num: make install]
+ /home/opam/.opam/opam-init/hooks/sandbox.sh "install" "make" "install" (CWD=/home/opam/.opam/5.1/.opam-switch/build/num.1.4)
- make -C src install
- make[1]: Entering directory '/home/opam/.opam/5.1/.opam-switch/build/num.1.4/src'
- install -d /home/opam/.opam/5.1/lib/ocaml
- sed -e 's/%%VERSION%%/1.4/g' META.in > META
- ocamlfind install num META
- Installed /home/opam/.opam/5.1/lib/num/META
- rm -f META
- install -m 644 nums.cma libnums.a big_int.cmi nat.cmi num.cmi ratio.cmi arith_status.cmi big_int.mli nat.mli num.mli ratio.mli arith_status.mli big_int.cmti nat.cmti num.cmti ratio.cmti arith_status.cmti nums.cmxa nums.a int_misc.cmx nat.cmx big_int.cmx arith_flags.cmx ratio.cmx num.cmx arith_status.cmx nums.cmxs /home/opam/.opam/5.1/lib/ocaml
- install -d /home/opam/.opam/5.1/lib/ocaml/stublibs
- install dllnums.so /home/opam/.opam/5.1/lib/ocaml/stublibs
- make[1]: Leaving directory '/home/opam/.opam/5.1/.opam-switch/build/num.1.4/src'
- make -C toplevel install
- make[1]: Entering directory '/home/opam/.opam/5.1/.opam-switch/build/num.1.4/toplevel'
- sed -e 's/%%VERSION%%/1.4/g' META.in > META
- ocamlfind install num-top META num_top.cma num_top.cmi num_top_printers.cmi
- Installed /home/opam/.opam/5.1/lib/num-top/num_top_printers.cmi
- Installed /home/opam/.opam/5.1/lib/num-top/num_top.cmi
- Installed /home/opam/.opam/5.1/lib/num-top/num_top.cma
- Installed /home/opam/.opam/5.1/lib/num-top/META
- rm -f META
- make[1]: Leaving directory '/home/opam/.opam/5.1/.opam-switch/build/num.1.4/toplevel'
-> installed num.1.4
Processing 26/38: [dune: ocaml 127] [zarith: make]
Processing 27/38: [dune: ocaml 127] [ocplib-simplex: autoconf] [zarith: make]
+ /home/opam/.opam/opam-init/hooks/sandbox.sh "build" "autoconf" (CWD=/home/opam/.opam/5.1/.opam-switch/build/ocplib-simplex.0.4)
- configure.in:140: warning: AC_OUTPUT should be used without arguments.
- configure.in:140: You should run autoupdate.
Processing 27/38: [dune: ocaml 127] [ocplib-simplex: ./configure] [zarith: make]
+ /home/opam/.opam/opam-init/hooks/sandbox.sh "build" "./configure" "-prefix" "/home/opam/.opam/5.1" (CWD=/home/opam/.opam/5.1/.opam-switch/build/ocplib-simplex.0.4)
- checking for ocamlc... ocamlc
- ocaml version is 5.1.0+dev1-2022-06-09
- ocaml library path is /home/opam/.opam/5.1/lib/ocaml
- checking for ocamlfind... yes
- checking for ocamlopt... ocamlopt
- checking ocamlopt version... ok
- checking for ocamlc.opt... ocamlc.opt
- checking ocamlc.opt version... ok
- checking for ocamlopt.opt... ocamlopt.opt
- checking ocamlopt.opt version... ok
- checking for ocamldep... ocamldep
- checking platform... configure: creating ./config.status
- config.status: creating Makefile
- config.status: WARNING:  'Makefile.in' seems to ignore the --datarootdir setting
Processing 27/38: [dune: ocaml 127] [ocplib-simplex: make] [zarith: make]
+ /home/opam/.opam/opam-init/hooks/sandbox.sh "build" "make" (CWD=/home/opam/.opam/5.1/.opam-switch/build/ocplib-simplex.0.4)
- cp src/extSigs.mli src/extSigs.ml
- cp src/coreSig.mli src/coreSig.ml
- ocamldep -I src src/*.ml* > .depend
- ocamlc.opt -c -annot -absname -bin-annot -short-paths -strict-sequence -w +A -g -I src -for-pack OcplibSimplex src/version.mli
- ocamlc.opt -c -annot -absname -bin-annot -short-paths -strict-sequence -w +A -g -I src -for-pack OcplibSimplex src/version.ml
- ocamlc.opt -c -annot -absname -bin-annot -short-paths -strict-sequence -w +A -g -I src -for-pack OcplibSimplex src/extSigs.mli
- ocamlc.opt -c -annot -absname -bin-annot -short-paths -strict-sequence -w +A -g -I src -for-pack OcplibSimplex src/rat2.mli
- ocamlc.opt -c -annot -absname -bin-annot -short-paths -strict-sequence -w +A -g -I src -for-pack OcplibSimplex src/rat2.ml
- ocamlc.opt -c -annot -absname -bin-annot -short-paths -strict-sequence -w +A -g -I src -for-pack OcplibSimplex src/extSigs.ml
- ocamlc.opt -c -annot -absname -bin-annot -short-paths -strict-sequence -w +A -g -I src -for-pack OcplibSimplex src/polys.mli
- ocamlc.opt -c -annot -absname -bin-annot -short-paths -strict-sequence -w +A -g -I src -for-pack OcplibSimplex src/polys.ml
- ocamlc.opt -c -annot -absname -bin-annot -short-paths -strict-sequence -w +A -g -I src -for-pack OcplibSimplex src/coreSig.mli
- ocamlc.opt -c -annot -absname -bin-annot -short-paths -strict-sequence -w +A -g -I src -for-pack OcplibSimplex src/coreSig.ml
- ocamlc.opt -c -annot -absname -bin-annot -short-paths -strict-sequence -w +A -g -I src -for-pack OcplibSimplex src/core.mli
- ocamlc.opt -c -annot -absname -bin-annot -short-paths -strict-sequence -w +A -g -I src -for-pack OcplibSimplex src/core.ml
- File "/home/opam/.opam/5.1/.opam-switch/build/ocplib-simplex.0.4/src/core.ml", line 242, characters 14-75:
- 242 |               "%a   [ %a == (%4a , %4a) ]   %a   (computed %s) (flag %s)@."
-                     ^^^^^^^^^^^^^^^^^^^^^^^^^^^^^^^^^^^^^^^^^^^^^^^^^^^^^^^^^^^^^
- Error: invalid format "%a   [ %a == (%4a , %4a) ]   %a   (computed %s) (flag %s)@.": at character number 20, `padding' is incompatible with 'a' in sub-format "%4a"
- make: *** [Makefile:131: src/core.cmo] Error 2
[ERROR] The compilation of ocplib-simplex.0.4 failed at "make".
Processing 27/38: [dune: ocaml 127] [zarith: make]
Processing 28/38: [dune: ocaml 127] [zarith: make]
+ /home/opam/.opam/opam-init/hooks/sandbox.sh "build" "make" (CWD=/home/opam/.opam/5.1/.opam-switch/build/zarith.1.12)
- (echo "let"; grep "version" META | head -1) > zarith_version.ml
- ocamldep -native  zarith_version.ml z.ml q.ml big_int_Z.ml z.mli q.mli big_int_Z.mli > depend
- ocamlc -I +compiler-libs -bin-annot  -c zarith_version.ml
- ocamlc -I +compiler-libs -bin-annot  -c z.mli
- ocamlc -I +compiler-libs -bin-annot  -c z.ml
- ocamlc -I +compiler-libs -bin-annot  -c q.mli
- ocamlc -I +compiler-libs -bin-annot  -c q.ml
- File "q.ml", line 537, characters 9-23:
- 537 |         (Z.of_substring s 0 i)
-                ^^^^^^^^^^^^^^
- Warning 6 [labels-omitted]: labels pos, len were omitted in the application of this function.
- File "q.ml", line 538, characters 9-23:
- 538 |         (Z.of_substring s (i+1) (String.length s-i-1))
-                ^^^^^^^^^^^^^^
- Warning 6 [labels-omitted]: labels pos, len were omitted in the application of this function.
- ocamlc -I +compiler-libs -bin-annot  -c big_int_Z.mli
- ocamlc -I +compiler-libs -bin-annot  -c big_int_Z.ml
- ocamlmklib -failsafe -o zarith zarith_version.cmo z.cmo q.cmo big_int_Z.cmo -lgmp
- ocamlc -ccopt "-I/home/opam/.opam/5.1/lib/ocaml  -DHAS_GMP  -O3 -Wall -Wextra " -c caml_z.c
- ocamlmklib -failsafe -o zarith caml_z.o -lgmp
- ocamlc -I +compiler-libs -bin-annot  -c zarith_top.ml
- ocamlc -o zarith_top.cma -a zarith_top.cmo
- ocamlopt -I +compiler-libs  -c zarith_version.ml
- ocamlopt -I +compiler-libs  -c z.ml
- ocamlopt -I +compiler-libs  -c q.ml
- File "q.ml", line 537, characters 9-23:
- 537 |         (Z.of_substring s 0 i)
-                ^^^^^^^^^^^^^^
- Warning 6 [labels-omitted]: labels pos, len were omitted in the application of this function.
- File "q.ml", line 538, characters 9-23:
- 538 |         (Z.of_substring s (i+1) (String.length s-i-1))
-                ^^^^^^^^^^^^^^
- Warning 6 [labels-omitted]: labels pos, len were omitted in the application of this function.
- ocamlopt -I +compiler-libs  -c big_int_Z.ml
- ocamlmklib -failsafe -o zarith zarith_version.cmx z.cmx q.cmx big_int_Z.cmx -lgmp
- ocamlopt -shared -o zarith.cmxs -I . zarith.cmxa -linkall
-> compiled  zarith.1.12
Processing 28/38: [dune: ocaml 127]
Processing 29/38: [dune: ocaml 127] [zarith: make install]
+ /home/opam/.opam/opam-init/hooks/sandbox.sh "install" "make" "install" (CWD=/home/opam/.opam/5.1/.opam-switch/build/zarith.1.12)
- ocamlfind install -destdir "/home/opam/.opam/5.1/lib" zarith META zarith.cma libzarith.a z.cmi q.cmi big_int_Z.cmi zarith_top.cma z.mli zarith.cmxa z.cmx q.cmx big_int_Z.cmx zarith.cmxs zarith.h q.mli big_int_Z.mli zarith.a z.cmti q.cmti big_int_Z.cmti -optional dllzarith.so
- Installed /home/opam/.opam/5.1/lib/zarith/big_int_Z.cmti
- Installed /home/opam/.opam/5.1/lib/zarith/q.cmti
- Installed /home/opam/.opam/5.1/lib/zarith/z.cmti
- Installed /home/opam/.opam/5.1/lib/zarith/zarith.a
- Installed /home/opam/.opam/5.1/lib/zarith/big_int_Z.mli
- Installed /home/opam/.opam/5.1/lib/zarith/q.mli
- Installed /home/opam/.opam/5.1/lib/zarith/zarith.h
- Installed /home/opam/.opam/5.1/lib/zarith/zarith.cmxs
- Installed /home/opam/.opam/5.1/lib/zarith/big_int_Z.cmx
- Installed /home/opam/.opam/5.1/lib/zarith/q.cmx
- Installed /home/opam/.opam/5.1/lib/zarith/z.cmx
- Installed /home/opam/.opam/5.1/lib/zarith/zarith.cmxa
- Installed /home/opam/.opam/5.1/lib/zarith/z.mli
- Installed /home/opam/.opam/5.1/lib/zarith/zarith_top.cma
- Installed /home/opam/.opam/5.1/lib/zarith/big_int_Z.cmi
- Installed /home/opam/.opam/5.1/lib/zarith/q.cmi
- Installed /home/opam/.opam/5.1/lib/zarith/z.cmi
- Installed /home/opam/.opam/5.1/lib/zarith/libzarith.a
- Installed /home/opam/.opam/5.1/lib/zarith/zarith.cma
- Installed /home/opam/.opam/5.1/lib/stublibs/dllzarith.so
- Installed /home/opam/.opam/5.1/lib/stublibs/dllzarith.so.owner
- ocamlfind: [WARNING] You have installed DLLs but the directory /home/opam/.opam/5.1/lib/stublibs is not mentioned in ld.conf
- Installed /home/opam/.opam/5.1/lib/zarith/META
-> installed zarith.1.12
Processing 29/38: [dune: ocaml 127]
+ /home/opam/.opam/opam-init/hooks/sandbox.sh "build" "ocaml" "boot/bootstrap.ml" "-j" "127" (CWD=/home/opam/.opam/5.1/.opam-switch/build/dune.3.6.1)
- ocamlc -output-complete-exe -w -24 -g -o .duneboot.exe -I boot -I +unix unix.cma boot/libs.ml boot/duneboot.ml
- ./.duneboot.exe -j 127
- cd _boot && /home/opam/.opam/5.1/bin/ocamlopt.opt -c -g -no-alias-deps -w -49-6 -alert -unstable -I +unix -I +threads build_path_prefix_map.ml
- File "vendor/build_path_prefix_map/src/build_path_prefix_map.ml", line 5, characters 17-31:
- Alert deprecated: Stdlib.Printf.kprintf
- Use Printf.ksprintf instead.
- cd _boot && /home/opam/.opam/5.1/bin/ocamlopt.opt -c -g -no-alias-deps -w -49-6 -alert -unstable -I +unix -I +threads opamLexer.ml
- File "vendor/opam-file-format/src/opamLexer.mll", line 21, characters 2-16:
- Alert deprecated: Stdlib.Printf.kprintf
- Use Printf.ksprintf instead.
- 

Processing 29/38: [dune: ./_boot/dune.exe build]
+ /home/opam/.opam/opam-init/hooks/sandbox.sh "build" "./_boot/dune.exe" "build" "dune.install" "--release" "--profile" "dune-bootstrap" "-j" "127" (CWD=/home/opam/.opam/5.1/.opam-switch/build/dune.3.6.1)
-> compiled  dune.3.6.1
-> installed dune.3.6.1
Processing 31/38: [csexp: dune build]
Processing 32/38: [csexp: dune build] [stdlib-shims: dune build]
+ /home/opam/.opam/opam-init/hooks/sandbox.sh "build" "dune" "build" "-p" "csexp" "-j" "127" "@install" (CWD=/home/opam/.opam/5.1/.opam-switch/build/csexp.1.5.1)
-> compiled  csexp.1.5.1
Processing 32/38: [stdlib-shims: dune build]
-> installed csexp.1.5.1
Processing 33/38: [stdlib-shims: dune build]
Processing 34/38: [dune-configurator: rm] [stdlib-shims: dune build]
+ /home/opam/.opam/opam-init/hooks/sandbox.sh "build" "rm" "-rf" "vendor/csexp" (CWD=/home/opam/.opam/5.1/.opam-switch/build/dune-configurator.3.6.1)
+ /home/opam/.opam/opam-init/hooks/sandbox.sh "build" "dune" "build" "-p" "stdlib-shims" "-j" "127" (CWD=/home/opam/.opam/5.1/.opam-switch/build/stdlib-shims.0.3.0)
-> compiled  stdlib-shims.0.3.0
Processing 34/38: [dune-configurator: rm]
-> installed stdlib-shims.0.3.0
Processing 35/38: [dune-configurator: rm]
+ /home/opam/.opam/opam-init/hooks/sandbox.sh "build" "rm" "-rf" "vendor/pp" (CWD=/home/opam/.opam/5.1/.opam-switch/build/dune-configurator.3.6.1)
Processing 35/38: [dune-configurator: dune build]
+ /home/opam/.opam/opam-init/hooks/sandbox.sh "build" "dune" "build" "-p" "dune-configurator" "-j" "127" "@install" (CWD=/home/opam/.opam/5.1/.opam-switch/build/dune-configurator.3.6.1)
-> compiled  dune-configurator.3.6.1
-> installed dune-configurator.3.6.1

#=== ERROR while compiling ocplib-simplex.0.4 =================================#
# context              2.2.0~alpha~dev | linux/x86_64 | ocaml-variants.5.1.0+trunk | file:///home/opam/opam-repository
# path                 ~/.opam/5.1/.opam-switch/build/ocplib-simplex.0.4
# command              ~/.opam/opam-init/hooks/sandbox.sh build make
# exit-code            2
# env-file             ~/.opam/log/ocplib-simplex-8-90aa7e.env
# output-file          ~/.opam/log/ocplib-simplex-8-90aa7e.out
### output ###
# cp src/extSigs.mli src/extSigs.ml
# cp src/coreSig.mli src/coreSig.ml
# ocamldep -I src src/*.ml* > .depend
# ocamlc.opt -c -annot -absname -bin-annot -short-paths -strict-sequence -w +A -g -I src -for-pack OcplibSimplex src/version.mli
# ocamlc.opt -c -annot -absname -bin-annot -short-paths -strict-sequence -w +A -g -I src -for-pack OcplibSimplex src/version.ml
# ocamlc.opt -c -annot -absname -bin-annot -short-paths -strict-sequence -w +A -g -I src -for-pack OcplibSimplex src/extSigs.mli
# ocamlc.opt -c -annot -absname -bin-annot -short-paths -strict-sequence -w +A -g -I src -for-pack OcplibSimplex src/rat2.mli
# ocamlc.opt -c -annot -absname -bin-annot -short-paths -strict-sequence -w +A -g -I src -for-pack OcplibSimplex src/rat2.ml
# ocamlc.opt -c -annot -absname -bin-annot -short-paths -strict-sequence -w +A -g -I src -for-pack OcplibSimplex src/extSigs.ml
# ocamlc.opt -c -annot -absname -bin-annot -short-paths -strict-sequence -w +A -g -I src -for-pack OcplibSimplex src/polys.mli
# ocamlc.opt -c -annot -absname -bin-annot -short-paths -strict-sequence -w +A -g -I src -for-pack OcplibSimplex src/polys.ml
# ocamlc.opt -c -annot -absname -bin-annot -short-paths -strict-sequence -w +A -g -I src -for-pack OcplibSimplex src/coreSig.mli
# ocamlc.opt -c -annot -absname -bin-annot -short-paths -strict-sequence -w +A -g -I src -for-pack OcplibSimplex src/coreSig.ml
# ocamlc.opt -c -annot -absname -bin-annot -short-paths -strict-sequence -w +A -g -I src -for-pack OcplibSimplex src/core.mli
# ocamlc.opt -c -annot -absname -bin-annot -short-paths -strict-sequence -w +A -g -I src -for-pack OcplibSimplex src/core.ml
# File "/home/opam/.opam/5.1/.opam-switch/build/ocplib-simplex.0.4/src/core.ml", line 242, characters 14-75:
# 242 |               "%a   [ %a == (%4a , %4a) ]   %a   (computed %s) (flag %s)@."
#                     ^^^^^^^^^^^^^^^^^^^^^^^^^^^^^^^^^^^^^^^^^^^^^^^^^^^^^^^^^^^^^
# Error: invalid format "%a   [ %a == (%4a , %4a) ]   %a   (computed %s) (flag %s)@.": at character number 20, `padding' is incompatible with 'a' in sub-format "%4a"
# make: *** [Makefile:131: src/core.cmo] Error 2



<><> Error report <><><><><><><><><><><><><><><><><><><><><><><><><><><><><><><>
+- The following actions were aborted
| - install alt-ergo-lib 2.4.2
+- 
+- The following actions failed
| - build ocplib-simplex 0.4
+- 
+- The following changes have been performed (the rest was aborted)
| - install conf-autoconf     0.1
| - install conf-gmp          4
| - install conf-which        1
| - install csexp             1.5.1
| - install dune              3.6.1
| - install dune-configurator 3.6.1
| - install num               1.4
| - install ocamlfind         1.9.5
| - install seq               base
| - install stdlib-shims      0.3.0
| - install zarith            1.12
+- 
# Run eval $(opam env) to update the current shell environment

The former state can be restored with:
    /usr/bin/opam switch import "/home/opam/.opam/5.1/.opam-switch/backup/state-20230116123558.export"
'opam install -vy alt-ergo-lib.2.4.2' failed.
"/bin/bash" "-c"
"
opam remove -y "alt-ergo-lib.2.4.2"
opam install -vy "alt-ergo-lib.2.4.2"
res=$?
if [ $res = 31 ]; then
    if opam show -f x-ci-accept-failures: "alt-ergo-lib.2.4.2" | grep -q '"debian-unstable"'; then
        echo "This package failed and has been disabled for CI using the 'x-ci-accept-failures' field."
        exit 69
    fi
fi


exit $res
" failed with exit status 31
Failed: Build failed