OCamllabs icon Home|Differences with the last checks|Previous runs


Building on x86-bm-3.ocamllabs.io

(from ocaml/opam:debian-unstable@sha256:5d9d58dd88e8e3a7a3c180578c753118efcfd5a451781452c6731c99fc9e27dd)
2022-11-15 09:10.07 ---> using "32efe2878d8713cc073fbcba05b477fab5020dac81ac1f841ea37ae67b4d70a6" from cache

/: (user (uid 1000) (gid 1000))

/: (env OPAMPRECISETRACKING 1)

/: (env OPAMUTF8 never)

/: (env OPAMEXTERNALSOLVER builtin-0install)

/: (env OPAMCRITERIA +removed)

/: (run (shell "sudo ln -f /usr/bin/opam-dev /usr/bin/opam"))
2022-11-15 09:10.07 ---> using "c06b21e9e23147ff65065b0caeb2932b761f6e4408d2fb429e6eafaede540fdc" from cache

/: (run (network host)
        (shell "rm -rf ~/opam-repository && git clone -q 'https://github.com/ocaml/opam-repository' ~/opam-repository && git -C ~/opam-repository checkout -q 88d0c6b952c255f868635fbb4c8bc650f1fa4fd8"))
2022-11-15 09:10.07 ---> using "f5ff03689bfa4493e0d56b41d99787e727484001ba6ca3d348cc9bb14b0a105c" from cache

/: (run (shell "rm -rf ~/.opam && opam init -ya --bare --config ~/.opamrc-sandbox ~/opam-repository"))
Configuring from /home/opam/.opamrc-sandbox, then /home/opam/.opamrc, and finally from built-in defaults.
Checking for available remotes: rsync and local, git.
  - you won't be able to use mercurial repositories unless you install the hg command on your system.
  - you won't be able to use darcs repositories unless you install the darcs command on your system.


<><> Fetching repository information ><><><><><><><><><><><><><><><><><><><><><>
[default] Initialised

User configuration:
  ~/.profile is already up-to-date.
[NOTE] Make sure that ~/.profile is well sourced in your ~/.bashrc.

2022-11-15 09:10.07 ---> using "c8ce34507d61810fd57bc948c6ee6daad97dafa9d9e05febabf80edf14a81a6c" from cache

/: (run (network host)
        (shell "git clone -q 'https://github.com/kit-ty-kate/opam-alpha-repository' ~/'alpha' && git -C ~/'alpha' checkout -q 0a81964b3d1e27a6aaf699e3a2153059b77435e2"))
2022-11-15 09:10.07 ---> using "42a878a316e3a0bdfc012c44a01fbdae39c9a8a1709ec3f4b13e9594f6c04d0b" from cache

/: (run (shell "opam repository add --dont-select 'alpha' ~/'alpha'"))
[alpha] Initialised
2022-11-15 09:10.07 ---> using "218e9a1d188e4b1d99339b688cdbf348f059cdef81a58d331d526ae6b37a3ac2" from cache

/: (run (cache (opam-archives (target /home/opam/.opam/download-cache)))
        (network host)
        (shell "opam switch create --repositories=alpha,default '5.0+alpha-repo' '5.0.0+trunk'"))

<><> Installing new switch packages <><><><><><><><><><><><><><><><><><><><><><>
Switch invariant: ["ocaml-variants" {= "5.0.0+trunk"}]

<><> Processing actions <><><><><><><><><><><><><><><><><><><><><><><><><><><><>
-> installed base-bigarray.base
-> installed base-threads.base
-> installed base-unix.base
-> retrieved ocaml-variants.5.0.0+trunk  (https://github.com/ocaml/ocaml/archive/5.0.tar.gz)
-> installed ocaml-variants.5.0.0+trunk
-> installed ocaml-config.3
-> installed ocaml.5.0.0
-> installed base-domains.base
-> installed base-nnp.base
Done.
# Run eval $(opam env --switch=5.0+alpha-repo) to update the current shell environment
2022-11-15 09:10.07 ---> using "85f2729387a48ad8cb84ce419e91dee7cf3000cd97181cb39ea68b3cffaee436" from cache

/: (run (network host)
        (shell "opam update --depexts"))
+ /usr/bin/sudo "apt-get" "update"
- Get:1 http://deb.debian.org/debian unstable InRelease [161 kB]
- Get:2 http://deb.debian.org/debian unstable/main amd64 Packages.diff/Index [63.6 kB]
- Get:3 http://deb.debian.org/debian unstable/main amd64 Packages T-2022-11-15-0207.35-F-2022-11-08-2013.29.pdiff [530 kB]
- Get:3 http://deb.debian.org/debian unstable/main amd64 Packages T-2022-11-15-0207.35-F-2022-11-08-2013.29.pdiff [530 kB]
- Fetched 755 kB in 2s (325 kB/s)
- Reading package lists...
- 
2022-11-15 09:10.07 ---> using "e188bd22dc139d4b52e3a827c2d66777fbc0a88bcd3d75a8d7ec21e782ee3ef2" from cache

/: (run (cache (opam-archives (target /home/opam/.opam/download-cache)))
        (network host)
        (shell  "\
               \nopam remove -y \"aws-s3.4.8.0\"\
               \nopam install -vy \"aws-s3.4.8.0\"\
               \nres=$?\
               \nif [ $res = 31 ]; then\
               \n    if opam show -f x-ci-accept-failures: \"aws-s3.4.8.0\" | grep -q '\"debian-unstable\"'; then\
               \n        echo \"This package failed and has been disabled for CI using the 'x-ci-accept-failures' field.\"\
               \n        exit 69\
               \n    fi\
               \nfi\
               \n\
               \n\
               \nexit $res\
               \n"))
[NOTE] aws-s3.4.8.0 is not installed.

Nothing to do.
The following actions will be performed:
=== install 58 packages
  - install angstrom               0.15.0  [required by uri]
  - install aws-s3                 4.8.0
  - install base                   v0.15.1 [required by ppx_expect, ppx_protocol_conv]
  - install base-bytes             base    [required by base64]
  - install base64                 3.5.0   [required by aws-s3]
  - install bigstringaf            0.9.0   [required by angstrom]
  - install biniou                 1.2.2   [required by yojson]
  - install camlp-streams          5.0.1   [required by biniou]
  - install cmdliner               1.1.1   [required by aws-s3]
  - install conf-libpcre           1       [required by pcre]
  - install conf-pkg-config        2       [required by digestif]
  - install cppo                   1.6.9   [required by yojson]
  - install csexp                  1.5.1   [required by dune-configurator]
  - install cstruct                6.1.1   [required by eqaf]
  - install digestif               1.1.3   [required by aws-s3]
  - install dune                   3.5.0   [required by aws-s3]
  - install dune-configurator      3.5.0   [required by pcre]
  - install easy-format            1.3.4   [required by yojson]
  - install eqaf                   0.9     [required by digestif]
  - install ezxmlm                 1.1.0   [required by aws-s3]
  - install fmt                    0.9.0   [required by cstruct]
  - install jane-street-headers    v0.15.0 [required by time_now]
  - install jst-config             v0.15.1 [required by time_now]
  - install ocaml-compiler-libs    v0.12.4 [required by ppxlib]
  - install ocaml-inifiles         1.2     [required by aws-s3]
  - install ocaml-syntax-shims     1.0.0   [required by angstrom]
  - install ocamlbuild             0.14.2  [required by ptime]
  - install ocamlfind              1.9.5   [required by ocaml-inifiles, ptime]
  - install pcre                   7.5.0   [required by ocaml-inifiles]
  - install ppx_assert             v0.15.0 [required by jst-config]
  - install ppx_base               v0.15.0 [required by time_now]
  - install ppx_cold               v0.15.0 [required by ppx_base]
  - install ppx_compare            v0.15.0 [required by ppx_base]
  - install ppx_derivers           1.2.1   [required by ppxlib]
  - install ppx_enumerate          v0.15.0 [required by ppx_base]
  - install ppx_expect             v0.15.1 [required by ppx_protocol_conv_json]
  - install ppx_hash               v0.15.0 [required by ppx_base]
  - install ppx_here               v0.15.0 [required by ppx_expect]
  - install ppx_inline_test        v0.15.0 [required by ppx_protocol_conv_json]
  - install ppx_optcomp            v0.15.0 [required by time_now]
  - install ppx_protocol_conv      5.2.0   [required by ppx_protocol_conv_json, ppx_protocol_conv_xmlm]
  - install ppx_protocol_conv_json 5.2.0   [required by aws-s3]
  - install ppx_protocol_conv_xmlm 5.2.0   [required by aws-s3]
  - install ppx_sexp_conv          v0.15.1 [required by ppx_base]
  - install ppxlib                 0.28.0  [required by ppx_expect, ppx_protocol_conv]
  - install ptime                  1.0.0   [required by aws-s3]
  - install re                     1.10.4  [required by ppx_expect]
  - install result                 1.5     [required by angstrom]
  - install seq                    base    [required by re]
  - install sexplib0               v0.15.1 [required by base]
  - install stdio                  v0.15.0 [required by ppx_expect]
  - install stdlib-shims           0.3.0   [required by ppxlib]
  - install stringext              1.6.0   [required by uri]
  - install time_now               v0.15.0 [required by ppx_inline_test]
  - install topkg                  1.0.6   [required by ptime]
  - install uri                    4.2.0   [required by aws-s3]
  - install xmlm                   1.4.0   [required by ezxmlm]
  - install yojson                 1.7.0   [required by aws-s3]

The following system packages will first need to be installed:
    libpcre3-dev pkg-config

<><> Handling external dependencies <><><><><><><><><><><><><><><><><><><><><><>

opam believes some required external dependencies are missing. opam can:
> 1. Run apt-get to install them (may need root/sudo access)
  2. Display the recommended apt-get command and wait while you run it manually (e.g. in another terminal)
  3. Attempt installation anyway, and permanently register that this external dependency is present, but not detectable
  4. Abort the installation

[1/2/3/4] 1

+ /usr/bin/sudo "apt-get" "install" "-qq" "-yy" "libpcre3-dev" "pkg-config"
- debconf: delaying package configuration, since apt-utils is not installed
- Selecting previously unselected package libpcre16-3:amd64.
- (Reading database ... 
- (Reading database ... 5%
(Reading database ... 10%
(Reading database ... 15%
(Reading database ... 20%
(Reading database ... 25%
(Reading database ... 30%
(Reading database ... 35%
(Reading database ... 40%
(Reading database ... 45%
(Reading database ... 50%
(Reading database ... 55%
(Reading database ... 60%
(Reading database ... 65%
(Reading database ... 70%
(Reading database ... 75%
(Reading database ... 80%
(Reading database ... 85%
(Reading database ... 90%
(Reading database ... 95%
(Reading database ... 100%
(Reading database ... 19056 files and directories currently installed.)
- Preparing to unpack .../0-libpcre16-3_2%3a8.39-14_amd64.deb ...
- Unpacking libpcre16-3:amd64 (2:8.39-14) ...
- Selecting previously unselected package libpcre3:amd64.
- Preparing to unpack .../1-libpcre3_2%3a8.39-14_amd64.deb ...
- Unpacking libpcre3:amd64 (2:8.39-14) ...
- Selecting previously unselected package libpcre32-3:amd64.
- Preparing to unpack .../2-libpcre32-3_2%3a8.39-14_amd64.deb ...
- Unpacking libpcre32-3:amd64 (2:8.39-14) ...
- Selecting previously unselected package libpcrecpp0v5:amd64.
- Preparing to unpack .../3-libpcrecpp0v5_2%3a8.39-14_amd64.deb ...
- Unpacking libpcrecpp0v5:amd64 (2:8.39-14) ...
- Selecting previously unselected package libpcre3-dev:amd64.
- Preparing to unpack .../4-libpcre3-dev_2%3a8.39-14_amd64.deb ...
- Unpacking libpcre3-dev:amd64 (2:8.39-14) ...
- Selecting previously unselected package libpkgconf3:amd64.
- Preparing to unpack .../5-libpkgconf3_1.8.0-10_amd64.deb ...
- Unpacking libpkgconf3:amd64 (1.8.0-10) ...
- Selecting previously unselected package pkgconf-bin.
- Preparing to unpack .../6-pkgconf-bin_1.8.0-10_amd64.deb ...
- Unpacking pkgconf-bin (1.8.0-10) ...
- Selecting previously unselected package pkgconf:amd64.
- Preparing to unpack .../7-pkgconf_1.8.0-10_amd64.deb ...
- Unpacking pkgconf:amd64 (1.8.0-10) ...
- Selecting previously unselected package pkg-config:amd64.
- Preparing to unpack .../8-pkg-config_1.8.0-10_amd64.deb ...
- Unpacking pkg-config:amd64 (1.8.0-10) ...
- Setting up libpcre16-3:amd64 (2:8.39-14) ...
- Setting up libpcre3:amd64 (2:8.39-14) ...
- Setting up libpkgconf3:amd64 (1.8.0-10) ...
- Setting up libpcre32-3:amd64 (2:8.39-14) ...
- Setting up pkgconf-bin (1.8.0-10) ...
- Setting up libpcrecpp0v5:amd64 (2:8.39-14) ...
- Setting up libpcre3-dev:amd64 (2:8.39-14) ...
- Setting up pkgconf:amd64 (1.8.0-10) ...
- Setting up pkg-config:amd64 (1.8.0-10) ...
- Processing triggers for libc-bin (2.36-4) ...

<><> Processing actions <><><><><><><><><><><><><><><><><><><><><><><><><><><><>
Processing  1/171:
Processing  2/171:
Processing  3/171:
-> retrieved aws-s3.4.8.0  (cached)
Processing  4/171:
Processing  5/171:
-> retrieved angstrom.0.15.0  (cached)
Processing  6/171:
-> retrieved base.v0.15.1  (cached)
Processing  7/171:
-> retrieved base64.3.5.0  (cached)
Processing  8/171:
-> retrieved bigstringaf.0.9.0  (cached)
Processing  9/171:
-> retrieved biniou.1.2.2  (cached)
Processing 10/171:
Processing 11/171:
Processing 12/171:
Processing 13/171: [conf-pkg-config: pkg-config]
-> retrieved camlp-streams.5.0.1  (cached)
Processing 14/171: [conf-pkg-config: pkg-config]
-> retrieved cmdliner.1.1.1  (cached)
Processing 15/171: [conf-pkg-config: pkg-config]
Processing 16/171: [cmdliner: make all] [conf-pkg-config: pkg-config]
-> retrieved cppo.1.6.9  (cached)
Processing 17/171: [cmdliner: make all] [conf-pkg-config: pkg-config]
+ /home/opam/.opam/opam-init/hooks/sandbox.sh "build" "pkg-config" "--help" (CWD=/home/opam/.opam/5.0+alpha-repo/.opam-switch/build/conf-pkg-config.2)
- usage: pkgconf [OPTIONS] [LIBRARIES]
- 
- basic options:
- 
-   --help                            this message
-   --about                           print pkgconf version and license to stdout
-   --version                         print supported pkg-config version to stdout
-   --atleast-pkgconfig-version       check whether or not pkgconf is compatible
-                                     with a specified pkg-config version
-   --errors-to-stdout                print all errors on stdout instead of stderr
-   --print-errors                    ensure all errors are printed
-   --short-errors                    be less verbose about some errors
-   --silence-errors                  explicitly be silent about errors
-   --list-all                        list all known packages
-   --list-package-names              list all known package names
-   --simulate                        simulate walking the calculated dependency graph
-   --no-cache                        do not cache already seen packages when
-                                     walking the dependency graph
-   --log-file=filename               write an audit log to a specified file
-   --with-path=path                  adds a directory to the search path
-   --define-prefix                   override the prefix variable with one that is guessed based on
-                                     the location of the .pc file
-   --dont-define-prefix              do not override the prefix variable under any circumstances
-   --prefix-variable=varname         sets the name of the variable that pkgconf considers
-                                     to be the package prefix
-   --relocate=path                   relocates a path and exits (mostly for testsuite)
-   --dont-relocate-paths             disables path relocation support
- 
- cross-compilation personality support:
- 
-   --personality=triplet|filename    sets the personality to 'triplet' or a file named 'filename'
-   --dump-personality                dumps details concerning selected personality
- 
- checking specific pkg-config database entries:
- 
-   --atleast-version                 require a specific version of a module
-   --exact-version                   require an exact version of a module
-   --max-version                     require a maximum version of a module
-   --exists                          check whether or not a module exists
-   --uninstalled                     check whether or not an uninstalled module will be used
-   --no-uninstalled                  never use uninstalled modules when satisfying dependencies
-   --no-provides                     do not use 'provides' rules to resolve dependencies
-   --maximum-traverse-depth          maximum allowed depth for dependency graph
-   --static                          be more aggressive when computing dependency graph
-                                     (for static linking)
-   --shared                          use a simplified dependency graph (usually default)
-   --pure                            optimize a static dependency graph as if it were a normal
-                                     dependency graph
-   --env-only                        look only for package entries in PKG_CONFIG_PATH
-   --ignore-conflicts                ignore 'conflicts' rules in modules
-   --validate                        validate specific .pc files for correctness
- 
- querying specific pkg-config database fields:
- 
-   --define-variable=varname=value   define variable 'varname' as 'value'
-   --variable=varname                print specified variable entry to stdout
-   --cflags                          print required CFLAGS to stdout
-   --cflags-only-I                   print required include-dir CFLAGS to stdout
-   --cflags-only-other               print required non-include-dir CFLAGS to stdout
-   --libs                            print required linker flags to stdout
-   --libs-only-L                     print required LDPATH linker flags to stdout
-   --libs-only-l                     print required LIBNAME linker flags to stdout
-   --libs-only-other                 print required other linker flags to stdout
-   --print-requires                  print required dependency frameworks to stdout
-   --print-requires-private          print required dependency frameworks for static
-                                     linking to stdout
-   --print-provides                  print provided dependencies to stdout
-   --print-variables                 print all known variables in module to stdout
-   --digraph                         print entire dependency graph in graphviz 'dot' format
-   --keep-system-cflags              keep -I/usr/include entries in cflags output
-   --keep-system-libs                keep -L/lib:/lib/i386-linux-gnu:/lib/x86_64-linux-gnu:/lib/x86_64-linux-gnux32:/lib32:/libx32:/usr/lib:/usr/lib/i386-linux-gnu:/usr/lib/x86_64-linux-gnu:/usr/lib/x86_64-linux-gnux32:/usr/lib32:/usr/libx32 entries in libs output
-   --path                            show the exact filenames for any matching .pc files
-   --modversion                      print the specified module's version to stdout
-   --internal-cflags                 do not filter 'internal' cflags from output
- 
- filtering output:
- 
-   --msvc-syntax                     print translatable fragments in MSVC syntax
-   --fragment-filter=types           filter output fragments to the specified types
- 
- report bugs to <https://github.com/pkgconf/pkgconf/issues/new>.
-> compiled  conf-pkg-config.2
Processing 17/171: [cmdliner: make all]
Processing 18/171: [cmdliner: make all] [conf-pkg-config: mkdir]
-> retrieved csexp.1.5.1  (cached)
Processing 19/171: [cmdliner: make all] [conf-pkg-config: mkdir]
-> retrieved cstruct.6.1.1  (cached)
Processing 20/171: [cmdliner: make all] [conf-pkg-config: mkdir]
+ /home/opam/.opam/opam-init/hooks/sandbox.sh "build" "make" "all" "PREFIX=/home/opam/.opam/5.0+alpha-repo" (CWD=/home/opam/.opam/5.0+alpha-repo/.opam-switch/build/cmdliner.1.1.1)
- ocaml build.ml cma
- ocaml build.ml cmxa
- ocaml build.ml cmxs
-> compiled  cmdliner.1.1.1
Processing 20/171: [conf-pkg-config: mkdir]
-> retrieved digestif.1.1.3  (cached)
Processing 21/171: [conf-pkg-config: mkdir]
+ /home/opam/.opam/opam-init/hooks/sandbox.sh "install" "mkdir" "-p" "/home/opam/.opam/5.0+alpha-repo/lib/pkgconfig" (CWD=/home/opam/.opam/5.0+alpha-repo/.opam-switch/build/conf-pkg-config.2)
-> installed conf-pkg-config.2
Processing 21/171:
Processing 22/171: [conf-libpcre: pkg-config libpcre]
Processing 23/171: [conf-libpcre: pkg-config libpcre] [cmdliner: make install]
-> retrieved easy-format.1.3.4  (cached)
Processing 24/171: [conf-libpcre: pkg-config libpcre] [cmdliner: make install]
-> retrieved eqaf.0.9  (cached)
Processing 25/171: [conf-libpcre: pkg-config libpcre] [cmdliner: make install]
+ /home/opam/.opam/opam-init/hooks/sandbox.sh "build" "pkg-config" "libpcre" (CWD=/home/opam/.opam/5.0+alpha-repo/.opam-switch/build/conf-libpcre.1)
-> compiled  conf-libpcre.1
Processing 25/171: [cmdliner: make install]
-> retrieved ezxmlm.1.1.0  (cached)
Processing 26/171: [cmdliner: make install]
+ /home/opam/.opam/opam-init/hooks/sandbox.sh "install" "make" "install" "LIBDIR=/home/opam/.opam/5.0+alpha-repo/lib/cmdliner" "DOCDIR=/home/opam/.opam/5.0+alpha-repo/doc/cmdliner" (CWD=/home/opam/.opam/5.0+alpha-repo/.opam-switch/build/cmdliner.1.1.1)
- install -d /home/opam/.opam/5.0+alpha-repo/lib/cmdliner
- install pkg/META _build/cmdliner.mli _build/cmdliner.cmi _build/cmdliner.cmti /home/opam/.opam/5.0+alpha-repo/lib/cmdliner
- install cmdliner.opam /home/opam/.opam/5.0+alpha-repo/lib/cmdliner/opam
- install _build/cmdliner.cma /home/opam/.opam/5.0+alpha-repo/lib/cmdliner
- install _build/cmdliner.cmxa _build/cmdliner.a _build/cmdliner.cmx _build/cmdliner_arg.cmx _build/cmdliner_base.cmx _build/cmdliner_cline.cmx _build/cmdliner_cmd.cmx _build/cmdliner_docgen.cmx _build/cmdliner_eval.cmx _build/cmdliner_exit.cmx _build/cmdliner_info.cmx _build/cmdliner_manpage.cmx _build/cmdliner_msg.cmx _build/cmdliner_term.cmx _build/cmdliner_term_deprecated.cmx _build/cmdliner_trie.cmx \
-   /home/opam/.opam/5.0+alpha-repo/lib/cmdliner
- install _build/cmdliner.cmxs /home/opam/.opam/5.0+alpha-repo/lib/cmdliner
Processing 26/171: [cmdliner: make install-doc]
-> retrieved fmt.0.9.0  (cached)
Processing 27/171: [cmdliner: make install-doc]
-> retrieved jane-street-headers.v0.15.0  (cached)
Processing 28/171: [cmdliner: make install-doc]
-> retrieved jst-config.v0.15.1  (cached)
Processing 29/171: [cmdliner: make install-doc]
+ /home/opam/.opam/opam-init/hooks/sandbox.sh "install" "make" "install-doc" "LIBDIR=/home/opam/.opam/5.0+alpha-repo/lib/cmdliner" "DOCDIR=/home/opam/.opam/5.0+alpha-repo/doc/cmdliner" (CWD=/home/opam/.opam/5.0+alpha-repo/.opam-switch/build/cmdliner.1.1.1)
- install -d /home/opam/.opam/5.0+alpha-repo/doc/cmdliner/odoc-pages
- install CHANGES.md LICENSE.md README.md /home/opam/.opam/5.0+alpha-repo/doc/cmdliner
- install doc/index.mld doc/cli.mld doc/examples.mld doc/tutorial.mld \
-            doc/tool_man.mld /home/opam/.opam/5.0+alpha-repo/doc/cmdliner/odoc-pages
-> installed cmdliner.1.1.1
Processing 29/171:
-> installed conf-libpcre.1
Processing 30/171:
-> retrieved ocaml-compiler-libs.v0.12.4  (cached)
Processing 31/171:
-> retrieved ocaml-inifiles.1.2  (cached)
Processing 32/171:
-> retrieved ocaml-syntax-shims.1.0.0  (cached)
Processing 33/171:
-> retrieved ocamlbuild.0.14.2  (cached)
Processing 34/171:
Processing 35/171: [ocamlbuild: make configure.make]
-> retrieved dune.3.5.0, dune-configurator.3.5.0  (cached)
Processing 36/171: [ocamlbuild: make configure.make]
Processing 37/171: [dune: ocaml bootstrap.ml] [ocamlbuild: make configure.make]
-> retrieved ocamlfind.1.9.5  (cached)
Processing 38/171: [dune: ocaml bootstrap.ml] [ocamlbuild: make configure.make]
[ocamlfind: patch] applying 0001-Fix-bug-when-installing-with-a-system-compiler.patch
Processing 39/171: [dune: ocaml bootstrap.ml] [ocamlbuild: make configure.make] [ocamlfind: patch]
-> retrieved pcre.7.5.0  (cached)
Processing 40/171: [dune: ocaml bootstrap.ml] [ocamlbuild: make configure.make] [ocamlfind: patch]
+ /home/opam/.opam/opam-init/hooks/sandbox.sh "build" "make" "-f" "configure.make" "all" "OCAMLBUILD_PREFIX=/home/opam/.opam/5.0+alpha-repo" "OCAMLBUILD_BINDIR=/home/opam/.opam/5.0+alpha-repo/bin" "OCAMLBUILD_LIBDIR=/home/opam/.opam/5.0+alpha-repo/lib" "OCAMLBUILD_MANDIR=/home/opam/.opam/5.0+alpha-repo/man" "OCAML_NATIVE=true" "OCAML_NATIVE_TOOLS=true" (CWD=/home/opam/.opam/5.0+alpha-repo/.opam-switch/build/ocamlbuild.0.14.2)
- (echo "# This file was generated from configure.make"; \
- echo ;\
- echo "OCAML_PREFIX="; \
- echo "OCAML_BINDIR=/home/opam/.opam/5.0+alpha-repo/bin"; \
- echo "OCAML_LIBDIR=/home/opam/.opam/5.0+alpha-repo/lib/ocaml"; \
- echo "OCAML_MANDIR=/home/opam/.opam/5.0+alpha-repo/man"; \
- echo ;\
- echo "EXT_OBJ=.o"; \
- echo "EXT_ASM=.s"; \
- echo "EXT_LIB=.a"; \
- echo "EXT_DLL=.so"; \
- echo "EXE="; \
- echo ;\
- echo "OCAML_NATIVE=true"; \
- echo "OCAML_NATIVE_TOOLS=true"; \
- echo "NATDYNLINK=true"; \
- echo "SUPPORT_SHARED_LIBRARIES=true"; \
- echo ;\
- echo "PREFIX=/home/opam/.opam/5.0+alpha-repo"; \
- echo "BINDIR=/home/opam/.opam/5.0+alpha-repo/bin"; \
- echo "LIBDIR=/home/opam/.opam/5.0+alpha-repo/lib"; \
- echo "MANDIR=/home/opam/.opam/5.0+alpha-repo/man"; \
- ) > Makefile.config
- (echo "(* This file was generated from ../configure.make *)"; \
- echo ;\
- echo 'let bindir = "/home/opam/.opam/5.0+alpha-repo/bin"'; \
- echo 'let libdir = "/home/opam/.opam/5.0+alpha-repo/lib"'; \
- echo 'let ocaml_libdir = "/home/opam/.opam/5.0+alpha-repo/lib/ocaml"'; \
- echo 'let libdir_abs = "/home/opam/.opam/5.0+alpha-repo/lib"'; \
- echo 'let ocaml_native = true'; \
- echo 'let ocaml_native_tools = true'; \
- echo 'let supports_shared_libraries = true';\
- echo 'let a = "a"'; \
- echo 'let o = "o"'; \
- echo 'let so = "so"'; \
- echo 'let ext_dll = ".so"'; \
- echo 'let exe = ""'; \
- echo 'let version = "0.14.2"'; \
- ) > src/ocamlbuild_config.ml
Processing 40/171: [dune: ocaml bootstrap.ml] [ocamlbuild: make check-if-preinstalled] [ocamlfind: patch]
-> retrieved ppx_assert.v0.15.0  (cached)
Processing 41/171: [dune: ocaml bootstrap.ml] [ocamlbuild: make check-if-preinstalled] [ocamlfind: patch]
-> retrieved ppx_base.v0.15.0  (cached)
Processing 42/171: [dune: ocaml bootstrap.ml] [ocamlbuild: make check-if-preinstalled] [ocamlfind: patch]
Processing 42/171: [dune: ocaml bootstrap.ml] [ocamlbuild: make check-if-preinstalled] [ocamlfind: ./configure]
-> retrieved ppx_cold.v0.15.0  (cached)
Processing 43/171: [dune: ocaml bootstrap.ml] [ocamlbuild: make check-if-preinstalled] [ocamlfind: ./configure]
-> retrieved ppx_compare.v0.15.0  (cached)
Processing 44/171: [dune: ocaml bootstrap.ml] [ocamlbuild: make check-if-preinstalled] [ocamlfind: ./configure]
-> retrieved ppx_derivers.1.2.1  (cached)
Processing 45/171: [dune: ocaml bootstrap.ml] [ocamlbuild: make check-if-preinstalled] [ocamlfind: ./configure]
-> retrieved ppx_enumerate.v0.15.0  (cached)
Processing 46/171: [dune: ocaml bootstrap.ml] [ocamlbuild: make check-if-preinstalled] [ocamlfind: ./configure]
-> retrieved ppx_expect.v0.15.1  (cached)
Processing 47/171: [dune: ocaml bootstrap.ml] [ocamlbuild: make check-if-preinstalled] [ocamlfind: ./configure]
-> retrieved ppx_hash.v0.15.0  (cached)
Processing 48/171: [dune: ocaml bootstrap.ml] [ocamlbuild: make check-if-preinstalled] [ocamlfind: ./configure]
-> retrieved ppx_here.v0.15.0  (cached)
Processing 49/171: [dune: ocaml bootstrap.ml] [ocamlbuild: make check-if-preinstalled] [ocamlfind: ./configure]
-> retrieved ppx_inline_test.v0.15.0  (cached)
Processing 50/171: [dune: ocaml bootstrap.ml] [ocamlbuild: make check-if-preinstalled] [ocamlfind: ./configure]
-> retrieved ppx_optcomp.v0.15.0  (cached)
Processing 51/171: [dune: ocaml bootstrap.ml] [ocamlbuild: make check-if-preinstalled] [ocamlfind: ./configure]
+ /home/opam/.opam/opam-init/hooks/sandbox.sh "build" "./configure" "-bindir" "/home/opam/.opam/5.0+alpha-repo/bin" "-sitelib" "/home/opam/.opam/5.0+alpha-repo/lib" "-mandir" "/home/opam/.opam/5.0+alpha-repo/man" "-config" "/home/opam/.opam/5.0+alpha-repo/lib/findlib.conf" "-no-custom" "-no-camlp4" (CWD=/home/opam/.opam/5.0+alpha-repo/.opam-switch/build/ocamlfind.1.9.5)
- Welcome to findlib version 1.9.5
- Configuring core...
- Checking for #remove_directory...
- Testing threading model...
- systhread_supported: true
- Testing DLLs...
- Testing whether ppxopt can be supported...
- Checking for ocamlc -opaque...
- Querying installation: META list not found
- make install will double-check installed META files
- Configuring libraries...
- unix: found (in +unix)
- dynlink: found (in +dynlink)
- bigarray: not present (possible since 4.08)
- compiler-libs: found
- dbm: not present (normal since 4.00)
- graphics: not present (normal since 4.09)
- num: not present (normal since 4.06)
- ocamlbuild: not present (normal since 4.03)
- ocamldoc: found (in +ocamldoc)
- raw_spacetime: not present (normal since 4.12)
- threads: found (in +threads)
- runtime_events: found (in +runtime_events)
- str: found (in +str)
- labltk: not present (normal since 4.02)
- native dynlink: found
- camlp4: disabled
- bytes: found, installing fake library
- Configuration for stdlib written to site-lib-src/stdlib/META
- Configuration for unix written to site-lib-src/unix/META
- Configuration for dynlink written to site-lib-src/dynlink/META
- Configuration for compiler-libs written to site-lib-src/compiler-libs/META
- Configuration for ocamldoc written to site-lib-src/ocamldoc/META
- Configuration for threads written to site-lib-src/threads/META
- Configuration for runtime_events written to site-lib-src/runtime_events/META
- Configuration for str written to site-lib-src/str/META
- Configuration for bytes written to site-lib-src/bytes/META
- Detecting compiler arguments: (extractor built) ok
- 
- About the OCAML core installation:
-     Standard library:      /home/opam/.opam/5.0+alpha-repo/lib/ocaml
-     Binaries:              /home/opam/.opam/5.0+alpha-repo/bin
-     Manual pages:          /home/opam/.opam/5.0+alpha-repo/man
-     Multi-threading type:  posix
- The directory of site-specific packages will be
-     site-lib:              /home/opam/.opam/5.0+alpha-repo/lib
- The configuration file is written to:
-     findlib config file:   /home/opam/.opam/5.0+alpha-repo/lib/findlib.conf
- Software will be installed:
-     Libraries:             in <site-lib>/findlib
-     Binaries:              /home/opam/.opam/5.0+alpha-repo/bin
-     Manual pages:          /home/opam/.opam/5.0+alpha-repo/man
-     topfind script:        /home/opam/.opam/5.0+alpha-repo/lib/ocaml
- Topfind ppxopt support:    yes
- Toolbox:                   no
- Link custom runtime:       no
- Need bytes compatibility:  no
- 
- Configuration has been written to Makefile.config
- 
- You can now do 'make all', and optionally 'make opt', to build ocamlfind.
Processing 51/171: [dune: ocaml bootstrap.ml] [ocamlbuild: make check-if-preinstalled] [ocamlfind: make all]
-> retrieved ppx_protocol_conv.5.2.0, ppx_protocol_conv_json.5.2.0, ppx_protocol_conv_xmlm.5.2.0  (cached)
Processing 52/171: [dune: ocaml bootstrap.ml] [ocamlbuild: make check-if-preinstalled] [ocamlfind: make all]
-> retrieved ppx_sexp_conv.v0.15.1  (cached)
Processing 53/171: [dune: ocaml bootstrap.ml] [ocamlbuild: make check-if-preinstalled] [ocamlfind: make all]
-> retrieved ppxlib.0.28.0  (cached)
Processing 54/171: [dune: ocaml bootstrap.ml] [ocamlbuild: make check-if-preinstalled] [ocamlfind: make all]
-> retrieved ptime.1.0.0  (cached)
Processing 55/171: [dune: ocaml bootstrap.ml] [ocamlbuild: make check-if-preinstalled] [ocamlfind: make all]
Processing 56/171: [dune: ocaml bootstrap.ml] [ocamlbuild: make check-if-preinstalled] [ocamlfind: make all]
Processing 57/171: [dune: ocaml bootstrap.ml] [ocamlbuild: make check-if-preinstalled] [ocamlfind: make all]
-> installed seq.base
Processing 58/171: [dune: ocaml bootstrap.ml] [ocamlbuild: make check-if-preinstalled] [ocamlfind: make all]
-> retrieved re.1.10.4  (cached)
Processing 59/171: [dune: ocaml bootstrap.ml] [ocamlbuild: make check-if-preinstalled] [ocamlfind: make all]
+ /home/opam/.opam/opam-init/hooks/sandbox.sh "build" "make" "all" (CWD=/home/opam/.opam/5.0+alpha-repo/.opam-switch/build/ocamlfind.1.9.5)
- for p in findlib; do ( cd src/$p; make all ) || exit; done
- make[1]: Entering directory '/home/opam/.opam/5.0+alpha-repo/.opam-switch/build/ocamlfind.1.9.5/src/findlib'
- ocamllex fl_meta.mll
- 22 states, 392 transitions, table size 1700 bytes
- USE_CYGPATH="0"; \
- export USE_CYGPATH; \
- cat findlib_config.mlp | \
-          ../../tools/patch '@CONFIGFILE@' '/home/opam/.opam/5.0+alpha-repo/lib/findlib.conf' | \
-          ../../tools/patch '@STDLIB@' '/home/opam/.opam/5.0+alpha-repo/lib/ocaml' | \
- 	sed -e 's;@AUTOLINK@;true;g' \
- 	    -e 's;@SYSTEM@;linux;g' \
- 	     >findlib_config.ml
- if [ "true" = "true" ]; then                 \
- 	cp topfind.ml.in topfind.ml;                             \
- else                                                             \
- 	sed -e '/PPXOPT_BEGIN/,/PPXOPT_END/ d' topfind.ml.in     \
- 		> topfind.ml ;                                   \
- fi
- ocamldep *.ml *.mli >depend
- ocamlc -I +compiler-libs -opaque   -I +unix -I +dynlink -g -c findlib_config.ml
- ocamlc -I +compiler-libs -opaque   -I +unix -I +dynlink -g -c fl_split.ml
- ocamlc -I +compiler-libs -opaque   -I +unix -I +dynlink -g -c fl_metatoken.ml
- ocamlc -I +compiler-libs -opaque   -I +unix -I +dynlink -g -c fl_meta.ml
- ocamlc -I +compiler-libs -opaque   -I +unix -I +dynlink -c fl_metascanner.mli
- ocamlc -I +compiler-libs -opaque   -I +unix -I +dynlink -g -c fl_metascanner.ml
- ocamlc -I +compiler-libs -opaque   -I +unix -I +dynlink -c fl_topo.mli
- ocamlc -I +compiler-libs -opaque   -I +unix -I +dynlink -g -c fl_topo.ml
- ocamlc -I +compiler-libs -opaque   -I +unix -I +dynlink -c fl_package_base.mli
- ocamlc -I +compiler-libs -opaque   -I +unix -I +dynlink -g -c fl_package_base.ml
- File "fl_package_base.ml", line 304, characters 22-40:
- 304 | 	 let pkg_ancestors = query_requirements predlist pkg in
-       	                     ^^^^^^^^^^^^^^^^^^
- Warning 6 [labels-omitted]: label preds was omitted in the application of this function.
- File "fl_package_base.ml", line 350, characters 18-36:
- 350 |   let ancestors = query_requirements predlist package_name in
-                         ^^^^^^^^^^^^^^^^^^
- Warning 6 [labels-omitted]: label preds was omitted in the application of this function.
- File "fl_package_base.ml", line 375, characters 23-41:
- 375 | 	  let pkg_ancestors = query_requirements predlist pkg in
-       	                      ^^^^^^^^^^^^^^^^^^
- Warning 6 [labels-omitted]: label preds was omitted in the application of this function.
- File "fl_package_base.ml", line 510, characters 16-35:
- 510 | 	     ( let c = package_definitions search_path pkg.package_name in
-       	               ^^^^^^^^^^^^^^^^^^^
- Warning 6 [labels-omitted]: label search_path was omitted in the application of this function.
- ocamlc -I +compiler-libs -opaque   -I +unix -I +dynlink -c findlib.mli
- ocamlc -I +compiler-libs -opaque   -I +unix -I +dynlink -g -c findlib.ml
- File "findlib.ml", line 390, characters 2-26:
- 390 |   Fl_package_base.requires predlist pkg
-         ^^^^^^^^^^^^^^^^^^^^^^^^
- Warning 6 [labels-omitted]: label preds was omitted in the application of this function.
- File "findlib.ml", line 396, characters 2-33:
- 396 |   Fl_package_base.requires_deeply predlist pkglist
-         ^^^^^^^^^^^^^^^^^^^^^^^^^^^^^^^
- Warning 6 [labels-omitted]: label preds was omitted in the application of this function.
- ocamlc -I +compiler-libs -opaque   -I +unix -I +dynlink -g -c fl_args.ml
- ocamlc -I +compiler-libs -opaque   -I +unix -I +dynlink -g -c fl_lint.ml
- ocamlc -I +compiler-libs -a -o findlib.cma findlib_config.cmo fl_split.cmo fl_metatoken.cmo fl_meta.cmo fl_metascanner.cmo fl_topo.cmo fl_package_base.cmo findlib.cmo fl_args.cmo fl_lint.cmo
- ocamlc -I +compiler-libs -opaque   -I +unix -I +dynlink -g -c ocaml_args.ml
- ocamlc -I +compiler-libs -opaque   -I +unix -I +dynlink -g -c frontend.ml
- File "frontend.ml", line 859, characters 10-39:
- 859 |           Fl_package_base.package_users predicates1 packages1
-                 ^^^^^^^^^^^^^^^^^^^^^^^^^^^^^
- Warning 6 [labels-omitted]: label preds was omitted in the application of this function.
- ocamlc -I +compiler-libs  -o ocamlfind -g findlib.cma unix.cma \
-            -I +unix -I +dynlink ocaml_args.cmo frontend.cmo
- ocamlc -I +compiler-libs -opaque   -I +unix -I +dynlink -c topfind.mli
- ocamlc -I +compiler-libs -opaque   -I +unix -I +dynlink -g -c topfind.ml
- File "topfind.ml", line 126, characters 40-63:
- 126 |                      match Hashtbl.find Toploop.directive_table "ppx" with
-                                               ^^^^^^^^^^^^^^^^^^^^^^^
- Alert deprecated: Toploop.directive_table
- File "topfind.ml", line 256, characters 4-27:
- 256 |     Toploop.directive_table
-           ^^^^^^^^^^^^^^^^^^^^^^^
- Alert deprecated: Toploop.directive_table
- File "topfind.ml", line 266, characters 4-27:
- 266 |     Toploop.directive_table
-           ^^^^^^^^^^^^^^^^^^^^^^^
- Alert deprecated: Toploop.directive_table
- File "topfind.ml", line 278, characters 4-27:
- 278 |     Toploop.directive_table
-           ^^^^^^^^^^^^^^^^^^^^^^^
- Alert deprecated: Toploop.directive_table
- File "topfind.ml", line 291, characters 4-27:
- 291 |     Toploop.directive_table
-           ^^^^^^^^^^^^^^^^^^^^^^^
- Alert deprecated: Toploop.directive_table
- File "topfind.ml", line 305, characters 4-27:
- 305 |     Toploop.directive_table
-           ^^^^^^^^^^^^^^^^^^^^^^^
- Alert deprecated: Toploop.directive_table
- File "topfind.ml", line 317, characters 4-27:
- 317 |     Toploop.directive_table
-           ^^^^^^^^^^^^^^^^^^^^^^^
- Alert deprecated: Toploop.directive_table
- ocamlc -I +compiler-libs -a -o findlib_top.cma topfind.cmo
- USE_CYGPATH="0"; \
- export USE_CYGPATH; \
- cat topfind_rd1.p | \
-          ../../tools/patch '@SITELIB@' '/home/opam/.opam/5.0+alpha-repo/lib' \
-     	    >topfind
- ocamlc -I +compiler-libs -opaque   -I +unix -I +dynlink -c fl_dynload.mli
- ocamlc -I +compiler-libs -opaque   -I +unix -I +dynlink -g -c fl_dynload.ml
- ocamlc -I +compiler-libs -a -o findlib_dynload.cma fl_dynload.cmo
- make[1]: Leaving directory '/home/opam/.opam/5.0+alpha-repo/.opam-switch/build/ocamlfind.1.9.5/src/findlib'
- make all-config
- make[1]: Entering directory '/home/opam/.opam/5.0+alpha-repo/.opam-switch/build/ocamlfind.1.9.5'
- USE_CYGPATH="0"; \
- export USE_CYGPATH; \
- cat findlib.conf.in | \
-      tools/patch '@SITELIB@' '/home/opam/.opam/5.0+alpha-repo/lib' >findlib.conf
- if ./tools/cmd_from_same_dir ocamlc; then \
- 	echo 'ocamlc="ocamlc.opt"' >>findlib.conf; \
- fi
- if ./tools/cmd_from_same_dir ocamlopt; then \
- 	echo 'ocamlopt="ocamlopt.opt"' >>findlib.conf; \
- fi
- if ./tools/cmd_from_same_dir ocamldep; then \
- 	echo 'ocamldep="ocamldep.opt"' >>findlib.conf; \
- fi
- if ./tools/cmd_from_same_dir ocamldoc; then \
- 	echo 'ocamldoc="ocamldoc.opt"' >>findlib.conf; \
- fi
- make[1]: Leaving directory '/home/opam/.opam/5.0+alpha-repo/.opam-switch/build/ocamlfind.1.9.5'
Processing 59/171: [dune: ocaml bootstrap.ml] [ocamlbuild: make check-if-preinstalled] [ocamlfind: make opt]
-> retrieved result.1.5  (cached)
Processing 60/171: [dune: ocaml bootstrap.ml] [ocamlbuild: make check-if-preinstalled] [ocamlfind: make opt]
-> retrieved sexplib0.v0.15.1  (cached)
Processing 61/171: [dune: ocaml bootstrap.ml] [ocamlbuild: make check-if-preinstalled] [ocamlfind: make opt]
-> retrieved stdio.v0.15.0  (cached)
Processing 62/171: [dune: ocaml bootstrap.ml] [ocamlbuild: make check-if-preinstalled] [ocamlfind: make opt]
-> retrieved stdlib-shims.0.3.0  (cached)
Processing 63/171: [dune: ocaml bootstrap.ml] [ocamlbuild: make check-if-preinstalled] [ocamlfind: make opt]
-> retrieved stringext.1.6.0  (cached)
Processing 64/171: [dune: ocaml bootstrap.ml] [ocamlbuild: make check-if-preinstalled] [ocamlfind: make opt]
-> retrieved time_now.v0.15.0  (cached)
Processing 65/171: [dune: ocaml bootstrap.ml] [ocamlbuild: make check-if-preinstalled] [ocamlfind: make opt]
-> retrieved topkg.1.0.6  (cached)
Processing 66/171: [dune: ocaml bootstrap.ml] [ocamlbuild: make check-if-preinstalled] [ocamlfind: make opt]
-> retrieved uri.4.2.0  (cached)
-> retrieved xmlm.1.4.0  (cached)
-> retrieved yojson.1.7.0  (cached)
+ /home/opam/.opam/opam-init/hooks/sandbox.sh "build" "make" "opt" (CWD=/home/opam/.opam/5.0+alpha-repo/.opam-switch/build/ocamlfind.1.9.5)
- for p in findlib; do ( cd src/$p; make opt ) || exit; done
- make[1]: Entering directory '/home/opam/.opam/5.0+alpha-repo/.opam-switch/build/ocamlfind.1.9.5/src/findlib'
- ocamlopt -I +compiler-libs -g -opaque  -I +unix -I +dynlink -c findlib_config.ml
- ocamlopt -I +compiler-libs -g -opaque  -I +unix -I +dynlink -c fl_split.ml
- ocamlopt -I +compiler-libs -g -opaque  -I +unix -I +dynlink -c fl_metatoken.ml
- ocamlopt -I +compiler-libs -g -opaque  -I +unix -I +dynlink -c fl_meta.ml
- ocamlopt -I +compiler-libs -g -opaque  -I +unix -I +dynlink -c fl_metascanner.ml
- ocamlopt -I +compiler-libs -g -opaque  -I +unix -I +dynlink -c fl_topo.ml
- ocamlopt -I +compiler-libs -g -opaque  -I +unix -I +dynlink -c fl_package_base.ml
- File "fl_package_base.ml", line 304, characters 22-40:
- 304 | 	 let pkg_ancestors = query_requirements predlist pkg in
-       	                     ^^^^^^^^^^^^^^^^^^
- Warning 6 [labels-omitted]: label preds was omitted in the application of this function.
- File "fl_package_base.ml", line 350, characters 18-36:
- 350 |   let ancestors = query_requirements predlist package_name in
-                         ^^^^^^^^^^^^^^^^^^
- Warning 6 [labels-omitted]: label preds was omitted in the application of this function.
- File "fl_package_base.ml", line 375, characters 23-41:
- 375 | 	  let pkg_ancestors = query_requirements predlist pkg in
-       	                      ^^^^^^^^^^^^^^^^^^
- Warning 6 [labels-omitted]: label preds was omitted in the application of this function.
- File "fl_package_base.ml", line 510, characters 16-35:
- 510 | 	     ( let c = package_definitions search_path pkg.package_name in
-       	               ^^^^^^^^^^^^^^^^^^^
- Warning 6 [labels-omitted]: label search_path was omitted in the application of this function.
- ocamlopt -I +compiler-libs -g -opaque  -I +unix -I +dynlink -c findlib.ml
- File "findlib.ml", line 390, characters 2-26:
- 390 |   Fl_package_base.requires predlist pkg
-         ^^^^^^^^^^^^^^^^^^^^^^^^
- Warning 6 [labels-omitted]: label preds was omitted in the application of this function.
- File "findlib.ml", line 396, characters 2-33:
- 396 |   Fl_package_base.requires_deeply predlist pkglist
-         ^^^^^^^^^^^^^^^^^^^^^^^^^^^^^^^
- Warning 6 [labels-omitted]: label preds was omitted in the application of this function.
- ocamlopt -I +compiler-libs -g -opaque  -I +unix -I +dynlink -c fl_args.ml
- ocamlopt -I +compiler-libs -g -opaque  -I +unix -I +dynlink -c fl_lint.ml
- ocamlopt -I +compiler-libs -g -a -o findlib.cmxa findlib_config.cmx fl_split.cmx fl_metatoken.cmx fl_meta.cmx fl_metascanner.cmx fl_topo.cmx fl_package_base.cmx findlib.cmx fl_args.cmx fl_lint.cmx
- if [ 1 -gt 0 ]; then \
-     ocamlopt -I +compiler-libs -g -shared -o findlib.cmxs findlib_config.cmx fl_split.cmx fl_metatoken.cmx fl_meta.cmx fl_metascanner.cmx fl_topo.cmx fl_package_base.cmx findlib.cmx fl_args.cmx fl_lint.cmx; \
- fi
- ocamlopt -I +compiler-libs -g -opaque  -I +unix -I +dynlink -c ocaml_args.ml
- ocamlopt -I +compiler-libs -g -opaque  -I +unix -I +dynlink -c frontend.ml
- File "frontend.ml", line 859, characters 10-39:
- 859 |           Fl_package_base.package_users predicates1 packages1
-                 ^^^^^^^^^^^^^^^^^^^^^^^^^^^^^
- Warning 6 [labels-omitted]: label preds was omitted in the application of this function.
- ocamlopt -I +compiler-libs -g -o ocamlfind_opt findlib.cmxa unix.cmxa \
- 	   -I +unix -I +dynlink ocaml_args.cmx frontend.cmx
- ocamlopt -I +compiler-libs -g -opaque  -I +unix -I +dynlink -c topfind.ml
- File "topfind.ml", line 126, characters 40-63:
- 126 |                      match Hashtbl.find Toploop.directive_table "ppx" with
-                                               ^^^^^^^^^^^^^^^^^^^^^^^
- Alert deprecated: Toploop.directive_table
- File "topfind.ml", line 256, characters 4-27:
- 256 |     Toploop.directive_table
-           ^^^^^^^^^^^^^^^^^^^^^^^
- Alert deprecated: Toploop.directive_table
- File "topfind.ml", line 266, characters 4-27:
- 266 |     Toploop.directive_table
-           ^^^^^^^^^^^^^^^^^^^^^^^
- Alert deprecated: Toploop.directive_table
- File "topfind.ml", line 278, characters 4-27:
- 278 |     Toploop.directive_table
-           ^^^^^^^^^^^^^^^^^^^^^^^
- Alert deprecated: Toploop.directive_table
- File "topfind.ml", line 291, characters 4-27:
- 291 |     Toploop.directive_table
-           ^^^^^^^^^^^^^^^^^^^^^^^
- Alert deprecated: Toploop.directive_table
- File "topfind.ml", line 305, characters 4-27:
- 305 |     Toploop.directive_table
-           ^^^^^^^^^^^^^^^^^^^^^^^
- Alert deprecated: Toploop.directive_table
- File "topfind.ml", line 317, characters 4-27:
- 317 |     Toploop.directive_table
-           ^^^^^^^^^^^^^^^^^^^^^^^
- Alert deprecated: Toploop.directive_table
- ocamlopt -I +compiler-libs -g -a -o findlib_top.cmxa topfind.cmx
- if [ 1 -gt 0 ]; then \
-     ocamlopt -I +compiler-libs -g -shared -o findlib_top.cmxs topfind.cmx; \
- fi
- ocamlopt -I +compiler-libs -g -opaque  -I +unix -I +dynlink -c fl_dynload.ml
- ocamlopt -I +compiler-libs -g -a -o findlib_dynload.cmxa fl_dynload.cmx
- if [ 1 -gt 0 ]; then \
-     ocamlopt -I +compiler-libs -g -shared -o findlib_dynload.cmxs fl_dynload.cmx; \
- fi
- make[1]: Leaving directory '/home/opam/.opam/5.0+alpha-repo/.opam-switch/build/ocamlfind.1.9.5/src/findlib'
-> compiled  ocamlfind.1.9.5
Processing 66/171: [dune: ocaml bootstrap.ml] [ocamlbuild: make check-if-preinstalled]
Processing 67/171: [dune: ocaml bootstrap.ml] [ocamlbuild: make check-if-preinstalled] [ocamlfind: make install]
+ /home/opam/.opam/opam-init/hooks/sandbox.sh "install" "make" "install" (CWD=/home/opam/.opam/5.0+alpha-repo/.opam-switch/build/ocamlfind.1.9.5)
- if [ "1" -eq 1 ]; then \
-     for x in camlp4 dbm graphics labltk num ocamlbuild; do \
-       if [ -f "/home/opam/.opam/5.0+alpha-repo/lib/$x/META" ]; then \
-         if ! grep -Fq '[distributed with Ocaml]' "//home/opam/.opam/5.0+alpha-repo/lib/$x/META"; then \
-           rm -f site-lib-src/$x/META; \
-         fi; \
-       fi; \
-     done; \
-     test -f "site-lib-src/num/META" || rm -f "site-lib-src/num-top/META"; \
-   fi
- echo 'SITELIB_META =' > Makefile.packages.in
- for x in `ls site-lib-src`; do test ! -f "site-lib-src/$x/META" || echo $x >> Makefile.packages.in; done
- tr '\n' ' ' < Makefile.packages.in > Makefile.packages
- rm Makefile.packages.in
- install -d "/home/opam/.opam/5.0+alpha-repo/bin"
- install -d "/home/opam/.opam/5.0+alpha-repo/man"
- make install-config
- make[1]: Entering directory '/home/opam/.opam/5.0+alpha-repo/.opam-switch/build/ocamlfind.1.9.5'
- install -d "`dirname \"/home/opam/.opam/5.0+alpha-repo/lib/findlib.conf\"`"
- test -f "/home/opam/.opam/5.0+alpha-repo/lib/findlib.conf" || install -c findlib.conf "/home/opam/.opam/5.0+alpha-repo/lib/findlib.conf"
- make[1]: Leaving directory '/home/opam/.opam/5.0+alpha-repo/.opam-switch/build/ocamlfind.1.9.5'
- for p in findlib; do ( cd src/$p; make install ); done
- make[1]: Entering directory '/home/opam/.opam/5.0+alpha-repo/.opam-switch/build/ocamlfind.1.9.5/src/findlib'
- install -d "/home/opam/.opam/5.0+alpha-repo/lib/findlib"
- install -d "/home/opam/.opam/5.0+alpha-repo/bin"
- test 1 -eq 0 || install -d "/home/opam/.opam/5.0+alpha-repo/lib/ocaml"
- test 1 -eq 0 || install -c topfind "/home/opam/.opam/5.0+alpha-repo/lib/ocaml/"
- files=` ../../tools/collect_files ../../Makefile.config \
- findlib.cmi findlib.mli findlib.cma findlib.cmxa findlib.a findlib.cmxs \
- findlib_config.cmi findlib_config.ml topfind.cmi topfind.mli \
- fl_args.cmi fl_lint.cmi fl_meta.cmi fl_split.cmi fl_topo.cmi ocaml_args.cmi \
- fl_package_base.mli fl_package_base.cmi fl_metascanner.mli fl_metascanner.cmi \
- fl_metatoken.cmi findlib_top.cma findlib_top.cmxa findlib_top.a findlib_top.cmxs \
- findlib_dynload.cma findlib_dynload.cmxa findlib_dynload.a findlib_dynload.cmxs fl_dynload.mli fl_dynload.cmi \
- META` && \
- install -c $files "/home/opam/.opam/5.0+alpha-repo/lib/findlib/"
- f="ocamlfind"; { test -f ocamlfind_opt && f="ocamlfind_opt"; }; \
- install -c $f "/home/opam/.opam/5.0+alpha-repo/bin/ocamlfind"
- # the following "if" block is only needed for 4.00beta2
- if [ 1 -eq 0 -a -f "/home/opam/.opam/5.0+alpha-repo/lib/ocaml/compiler-libs/topdirs.cmi" ]; then \
-     cd "/home/opam/.opam/5.0+alpha-repo/lib/ocaml/compiler-libs/"; \
-     install -c topdirs.cmi toploop.cmi "/home/opam/.opam/5.0+alpha-repo/lib/findlib/"; \
- fi
- make[1]: Leaving directory '/home/opam/.opam/5.0+alpha-repo/.opam-switch/build/ocamlfind.1.9.5/src/findlib'
- make install-meta
- make[1]: Entering directory '/home/opam/.opam/5.0+alpha-repo/.opam-switch/build/ocamlfind.1.9.5'
- for x in bytes compiler-libs dynlink ocamldoc runtime_events stdlib str threads unix ; do install -d "/home/opam/.opam/5.0+alpha-repo/lib/$x"; install -c site-lib-src/$x/META "/home/opam/.opam/5.0+alpha-repo/lib/$x/META.tmp" && mv "/home/opam/.opam/5.0+alpha-repo/lib/$x/META.tmp" "/home/opam/.opam/5.0+alpha-repo/lib/$x/META"; done
- install -d "/home/opam/.opam/5.0+alpha-repo/lib/findlib"; install -c Makefile.packages "/home/opam/.opam/5.0+alpha-repo/lib/findlib/Makefile.packages"
- make[1]: Leaving directory '/home/opam/.opam/5.0+alpha-repo/.opam-switch/build/ocamlfind.1.9.5'
- test ! -f 'site-lib-src/num-top/META' || { cd src/findlib; make install-num-top; }
- test ! -f 'site-lib-src/camlp4/META' ||	install -c tools/safe_camlp4 "/home/opam/.opam/5.0+alpha-repo/bin"
- make install-doc
- make[1]: Entering directory '/home/opam/.opam/5.0+alpha-repo/.opam-switch/build/ocamlfind.1.9.5'
- install -d "/home/opam/.opam/5.0+alpha-repo/man/man1" "/home/opam/.opam/5.0+alpha-repo/man/man3" "/home/opam/.opam/5.0+alpha-repo/man/man5"
- install -c doc/ref-man/ocamlfind.1 "/home/opam/.opam/5.0+alpha-repo/man/man1"
- install -c doc/ref-man/META.5 doc/ref-man/site-lib.5 doc/ref-man/findlib.conf.5 "/home/opam/.opam/5.0+alpha-repo/man/man5"
- make[1]: Leaving directory '/home/opam/.opam/5.0+alpha-repo/.opam-switch/build/ocamlfind.1.9.5'
-> installed ocamlfind.1.9.5
Processing 67/171: [dune: ocaml bootstrap.ml] [ocamlbuild: make check-if-preinstalled]
Processing 68/171: [dune: ocaml bootstrap.ml] [ocamlbuild: make check-if-preinstalled]
-> installed base-bytes.base
Processing 69/171: [dune: ocaml bootstrap.ml] [ocamlbuild: make check-if-preinstalled]
+ /home/opam/.opam/opam-init/hooks/sandbox.sh "build" "make" "check-if-preinstalled" "all" "opam-install" (CWD=/home/opam/.opam/5.0+alpha-repo/.opam-switch/build/ocamlbuild.0.14.2)
- if test -d /home/opam/.opam/5.0+alpha-repo/lib/ocaml/ocamlbuild; then\
-   >&2 echo "ERROR: Preinstalled ocamlbuild detected at"\
-        "/home/opam/.opam/5.0+alpha-repo/lib/ocaml/ocamlbuild";\
-   >&2 echo "Installation aborted; if you want to bypass this"\
-         "safety check, pass CHECK_IF_PREINSTALLED=false to make";\
-   exit 2;\
- fi
- ocamlc.opt -w +L -w +R -w +Z -I src -I plugin-lib -I bin -I +unix -safe-string -bin-annot -strict-sequence -c src/const.ml
- ocamlc.opt -w +L -w +R -w +Z -I src -I plugin-lib -I bin -I +unix -safe-string -bin-annot -strict-sequence -c src/loc.mli
- ocamlc.opt -w +L -w +R -w +Z -I src -I plugin-lib -I bin -I +unix -safe-string -bin-annot -strict-sequence -c src/loc.ml
- ocamlc.opt -w +L -w +R -w +Z -I src -I plugin-lib -I bin -I +unix -safe-string -bin-annot -strict-sequence -c src/discard_printf.mli
- ocamlc.opt -w +L -w +R -w +Z -I src -I plugin-lib -I bin -I +unix -safe-string -bin-annot -strict-sequence -c src/discard_printf.ml
- ocamlc.opt -w +L -w +R -w +Z -I src -I plugin-lib -I bin -I +unix -safe-string -bin-annot -strict-sequence -c src/signatures.mli
- ocamlc.opt -w +L -w +R -w +Z -I src -I plugin-lib -I bin -I +unix -safe-string -bin-annot -strict-sequence -c src/my_std.mli
- ocamlc.opt -w +L -w +R -w +Z -I src -I plugin-lib -I bin -I +unix -safe-string -bin-annot -strict-sequence -c src/my_std.ml
- ocamlc.opt -w +L -w +R -w +Z -I src -I plugin-lib -I bin -I +unix -safe-string -bin-annot -strict-sequence -c src/my_unix.mli
- ocamlc.opt -w +L -w +R -w +Z -I src -I plugin-lib -I bin -I +unix -safe-string -bin-annot -strict-sequence -c src/my_unix.ml
- ocamlc.opt -w +L -w +R -w +Z -I src -I plugin-lib -I bin -I +unix -safe-string -bin-annot -strict-sequence -c src/tags.mli
- ocamlc.opt -w +L -w +R -w +Z -I src -I plugin-lib -I bin -I +unix -safe-string -bin-annot -strict-sequence -c src/tags.ml
- ocamlc.opt -w +L -w +R -w +Z -I src -I plugin-lib -I bin -I +unix -safe-string -bin-annot -strict-sequence -c src/display.mli
- ocamlc.opt -w +L -w +R -w +Z -I src -I plugin-lib -I bin -I +unix -safe-string -bin-annot -strict-sequence -c src/display.ml
- ocamlc.opt -w +L -w +R -w +Z -I src -I plugin-lib -I bin -I +unix -safe-string -bin-annot -strict-sequence -c src/log.mli
- ocamlc.opt -w +L -w +R -w +Z -I src -I plugin-lib -I bin -I +unix -safe-string -bin-annot -strict-sequence -c src/log.ml
- ocamlc.opt -w +L -w +R -w +Z -I src -I plugin-lib -I bin -I +unix -safe-string -bin-annot -strict-sequence -c src/shell.mli
- ocamlc.opt -w +L -w +R -w +Z -I src -I plugin-lib -I bin -I +unix -safe-string -bin-annot -strict-sequence -c src/shell.ml
- ocamlc.opt -w +L -w +R -w +Z -I src -I plugin-lib -I bin -I +unix -safe-string -bin-annot -strict-sequence -c src/bool.mli
- ocamlc.opt -w +L -w +R -w +Z -I src -I plugin-lib -I bin -I +unix -safe-string -bin-annot -strict-sequence -c src/bool.ml
- ocamlc.opt -w +L -w +R -w +Z -I src -I plugin-lib -I bin -I +unix -safe-string -bin-annot -strict-sequence -c src/glob_ast.mli
- ocamlc.opt -w +L -w +R -w +Z -I src -I plugin-lib -I bin -I +unix -safe-string -bin-annot -strict-sequence -c src/glob_ast.ml
- ocamllex.opt src/glob_lexer.mll
- 55 states, 419 transitions, table size 2006 bytes
- ocamlc.opt -w +L -w +R -w +Z -I src -I plugin-lib -I bin -I +unix -safe-string -bin-annot -strict-sequence -c src/glob_lexer.mli
- ocamlc.opt -w +L -w +R -w +Z -I src -I plugin-lib -I bin -I +unix -safe-string -bin-annot -strict-sequence -c src/glob_lexer.ml
- ocamlc.opt -w +L -w +R -w +Z -I src -I plugin-lib -I bin -I +unix -safe-string -bin-annot -strict-sequence -c src/glob.mli
- ocamlc.opt -w +L -w +R -w +Z -I src -I plugin-lib -I bin -I +unix -safe-string -bin-annot -strict-sequence -c src/glob.ml
- ocamllex.opt src/lexers.mll
- 251 states, 1051 transitions, table size 5710 bytes
- 4334 additional bytes used for bindings
- ocamlc.opt -w +L -w +R -w +Z -I src -I plugin-lib -I bin -I +unix -safe-string -bin-annot -strict-sequence -c src/lexers.mli
- ocamlc.opt -w +L -w +R -w +Z -I src -I plugin-lib -I bin -I +unix -safe-string -bin-annot -strict-sequence -c src/lexers.ml
- ocamlc.opt -w +L -w +R -w +Z -I src -I plugin-lib -I bin -I +unix -safe-string -bin-annot -strict-sequence -c src/param_tags.mli
- ocamlc.opt -w +L -w +R -w +Z -I src -I plugin-lib -I bin -I +unix -safe-string -bin-annot -strict-sequence -c src/param_tags.ml
- ocamlc.opt -w +L -w +R -w +Z -I src -I plugin-lib -I bin -I +unix -safe-string -bin-annot -strict-sequence -c src/command.mli
- ocamlc.opt -w +L -w +R -w +Z -I src -I plugin-lib -I bin -I +unix -safe-string -bin-annot -strict-sequence -c src/command.ml
- ocamlc.opt -w +L -w +R -w +Z -I src -I plugin-lib -I bin -I +unix -safe-string -bin-annot -strict-sequence -c src/ocamlbuild_config.ml
- ocamlc.opt -w +L -w +R -w +Z -I src -I plugin-lib -I bin -I +unix -safe-string -bin-annot -strict-sequence -c src/ocamlbuild_where.mli
- ocamlc.opt -w +L -w +R -w +Z -I src -I plugin-lib -I bin -I +unix -safe-string -bin-annot -strict-sequence -c src/ocamlbuild_where.ml
- ocamlc.opt -w +L -w +R -w +Z -I src -I plugin-lib -I bin -I +unix -safe-string -bin-annot -strict-sequence -c src/slurp.mli
- ocamlc.opt -w +L -w +R -w +Z -I src -I plugin-lib -I bin -I +unix -safe-string -bin-annot -strict-sequence -c src/slurp.ml
- ocamlc.opt -w +L -w +R -w +Z -I src -I plugin-lib -I bin -I +unix -safe-string -bin-annot -strict-sequence -c src/options.mli
- ocamlc.opt -w +L -w +R -w +Z -I src -I plugin-lib -I bin -I +unix -safe-string -bin-annot -strict-sequence -c src/options.ml
- ocamlc.opt -w +L -w +R -w +Z -I src -I plugin-lib -I bin -I +unix -safe-string -bin-annot -strict-sequence -c src/pathname.mli
- ocamlc.opt -w +L -w +R -w +Z -I src -I plugin-lib -I bin -I +unix -safe-string -bin-annot -strict-sequence -c src/pathname.ml
- ocamlc.opt -w +L -w +R -w +Z -I src -I plugin-lib -I bin -I +unix -safe-string -bin-annot -strict-sequence -c src/configuration.mli
- ocamlc.opt -w +L -w +R -w +Z -I src -I plugin-lib -I bin -I +unix -safe-string -bin-annot -strict-sequence -c src/configuration.ml
- ocamlc.opt -w +L -w +R -w +Z -I src -I plugin-lib -I bin -I +unix -safe-string -bin-annot -strict-sequence -c src/flags.mli
- ocamlc.opt -w +L -w +R -w +Z -I src -I plugin-lib -I bin -I +unix -safe-string -bin-annot -strict-sequence -c src/flags.ml
- ocamlc.opt -w +L -w +R -w +Z -I src -I plugin-lib -I bin -I +unix -safe-string -bin-annot -strict-sequence -c src/hygiene.mli
- ocamlc.opt -w +L -w +R -w +Z -I src -I plugin-lib -I bin -I +unix -safe-string -bin-annot -strict-sequence -c src/hygiene.ml
- ocamlc.opt -w +L -w +R -w +Z -I src -I plugin-lib -I bin -I +unix -safe-string -bin-annot -strict-sequence -c src/digest_cache.mli
- ocamlc.opt -w +L -w +R -w +Z -I src -I plugin-lib -I bin -I +unix -safe-string -bin-annot -strict-sequence -c src/digest_cache.ml
- ocamlc.opt -w +L -w +R -w +Z -I src -I plugin-lib -I bin -I +unix -safe-string -bin-annot -strict-sequence -c src/resource.mli
- ocamlc.opt -w +L -w +R -w +Z -I src -I plugin-lib -I bin -I +unix -safe-string -bin-annot -strict-sequence -c src/resource.ml
- ocamlc.opt -w +L -w +R -w +Z -I src -I plugin-lib -I bin -I +unix -safe-string -bin-annot -strict-sequence -c src/rule.mli
- ocamlc.opt -w +L -w +R -w +Z -I src -I plugin-lib -I bin -I +unix -safe-string -bin-annot -strict-sequence -c src/rule.ml
- ocamlc.opt -w +L -w +R -w +Z -I src -I plugin-lib -I bin -I +unix -safe-string -bin-annot -strict-sequence -c src/solver.mli
- ocamlc.opt -w +L -w +R -w +Z -I src -I plugin-lib -I bin -I +unix -safe-string -bin-annot -strict-sequence -c src/solver.ml
- ocamlc.opt -w +L -w +R -w +Z -I src -I plugin-lib -I bin -I +unix -safe-string -bin-annot -strict-sequence -c src/report.mli
- ocamlc.opt -w +L -w +R -w +Z -I src -I plugin-lib -I bin -I +unix -safe-string -bin-annot -strict-sequence -c src/report.ml
- ocamlc.opt -w +L -w +R -w +Z -I src -I plugin-lib -I bin -I +unix -safe-string -bin-annot -strict-sequence -c src/tools.mli
- ocamlc.opt -w +L -w +R -w +Z -I src -I plugin-lib -I bin -I +unix -safe-string -bin-annot -strict-sequence -c src/tools.ml
- ocamlc.opt -w +L -w +R -w +Z -I src -I plugin-lib -I bin -I +unix -safe-string -bin-annot -strict-sequence -c src/fda.mli
- ocamlc.opt -w +L -w +R -w +Z -I src -I plugin-lib -I bin -I +unix -safe-string -bin-annot -strict-sequence -c src/fda.ml
- ocamlc.opt -w +L -w +R -w +Z -I src -I plugin-lib -I bin -I +unix -safe-string -bin-annot -strict-sequence -c src/findlib.mli
- ocamlc.opt -w +L -w +R -w +Z -I src -I plugin-lib -I bin -I +unix -safe-string -bin-annot -strict-sequence -c src/findlib.ml
- ocamlc.opt -w +L -w +R -w +Z -I src -I plugin-lib -I bin -I +unix -safe-string -bin-annot -strict-sequence -c src/ocaml_arch.mli
- ocamlc.opt -w +L -w +R -w +Z -I src -I plugin-lib -I bin -I +unix -safe-string -bin-annot -strict-sequence -c src/ocaml_arch.ml
- ocamlc.opt -w +L -w +R -w +Z -I src -I plugin-lib -I bin -I +unix -safe-string -bin-annot -strict-sequence -c src/ocaml_utils.mli
- ocamlc.opt -w +L -w +R -w +Z -I src -I plugin-lib -I bin -I +unix -safe-string -bin-annot -strict-sequence -c src/ocaml_utils.ml
- ocamlc.opt -w +L -w +R -w +Z -I src -I plugin-lib -I bin -I +unix -safe-string -bin-annot -strict-sequence -c src/ocaml_dependencies.mli
- ocamlc.opt -w +L -w +R -w +Z -I src -I plugin-lib -I bin -I +unix -safe-string -bin-annot -strict-sequence -c src/ocaml_dependencies.ml
- ocamlc.opt -w +L -w +R -w +Z -I src -I plugin-lib -I bin -I +unix -safe-string -bin-annot -strict-sequence -c src/ocaml_compiler.mli
- ocamlc.opt -w +L -w +R -w +Z -I src -I plugin-lib -I bin -I +unix -safe-string -bin-annot -strict-sequence -c src/ocaml_compiler.ml
- ocamlc.opt -w +L -w +R -w +Z -I src -I plugin-lib -I bin -I +unix -safe-string -bin-annot -strict-sequence -c src/ocaml_tools.mli
- ocamlc.opt -w +L -w +R -w +Z -I src -I plugin-lib -I bin -I +unix -safe-string -bin-annot -strict-sequence -c src/ocaml_tools.ml
- ocamlc.opt -w +L -w +R -w +Z -I src -I plugin-lib -I bin -I +unix -safe-string -bin-annot -strict-sequence -c src/ocaml_specific.mli
- ocamlc.opt -w +L -w +R -w +Z -I src -I plugin-lib -I bin -I +unix -safe-string -bin-annot -strict-sequence -c src/ocaml_specific.ml
- ocamlc.opt -w +L -w +R -w +Z -I src -I plugin-lib -I bin -I +unix -safe-string -bin-annot -strict-sequence -c src/exit_codes.mli
- ocamlc.opt -w +L -w +R -w +Z -I src -I plugin-lib -I bin -I +unix -safe-string -bin-annot -strict-sequence -c src/exit_codes.ml
- ocamlc.opt -w +L -w +R -w +Z -I src -I plugin-lib -I bin -I +unix -safe-string -bin-annot -strict-sequence -c src/plugin.mli
- ocamlc.opt -w +L -w +R -w +Z -I src -I plugin-lib -I bin -I +unix -safe-string -bin-annot -strict-sequence -c src/plugin.ml
- ocamlc.opt -w +L -w +R -w +Z -I src -I plugin-lib -I bin -I +unix -safe-string -bin-annot -strict-sequence -c src/hooks.mli
- ocamlc.opt -w +L -w +R -w +Z -I src -I plugin-lib -I bin -I +unix -safe-string -bin-annot -strict-sequence -c src/hooks.ml
- ocamlc.opt -w +L -w +R -w +Z -I src -I plugin-lib -I bin -I +unix -safe-string -bin-annot -strict-sequence -c src/main.mli
- ocamlc.opt -w +L -w +R -w +Z -I src -I plugin-lib -I bin -I +unix -safe-string -bin-annot -strict-sequence -c src/main.ml
- mkdir -p tmp
- ocamlc.opt -pack src/const.cmo src/loc.cmo src/discard_printf.cmo src/signatures.cmi src/my_std.cmo src/my_unix.cmo src/tags.cmo src/display.cmo src/log.cmo src/shell.cmo src/bool.cmo src/glob_ast.cmo src/glob_lexer.cmo src/glob.cmo src/lexers.cmo src/param_tags.cmo src/command.cmo src/ocamlbuild_config.cmo src/ocamlbuild_where.cmo src/slurp.cmo src/options.cmo src/pathname.cmo src/configuration.cmo src/flags.cmo src/hygiene.cmo src/digest_cache.cmo src/resource.cmo src/rule.cmo src/solver.cmo src/report.cmo src/tools.cmo src/fda.cmo src/findlib.cmo src/ocaml_arch.cmo src/ocaml_utils.cmo src/ocaml_dependencies.cmo src/ocaml_compiler.cmo src/ocaml_tools.cmo src/ocaml_specific.cmo src/exit_codes.cmo src/plugin.cmo src/hooks.cmo src/main.cmo -o tmp/ocamlbuild_pack.cmo
- mv tmp/ocamlbuild_pack.cmi src/ocamlbuild_pack.cmi
- mv tmp/ocamlbuild_pack.cmo src/ocamlbuild_pack.cmo
- ocamlc.opt -w +L -w +R -w +Z -I src -I plugin-lib -I bin -I +unix -safe-string -bin-annot -strict-sequence -c plugin-lib/ocamlbuild_plugin.mli
- ocamlc.opt -w +L -w +R -w +Z -I src -I plugin-lib -I bin -I +unix -safe-string -bin-annot -strict-sequence -c plugin-lib/ocamlbuild_plugin.ml
- ocamlc.opt -w +L -w +R -w +Z -I src -I plugin-lib -I bin -I +unix -safe-string -bin-annot -strict-sequence -c plugin-lib/ocamlbuild_executor.mli
- ocamlc.opt -w +L -w +R -w +Z -I src -I plugin-lib -I bin -I +unix -safe-string -bin-annot -strict-sequence -c plugin-lib/ocamlbuild_executor.ml
- ocamlc.opt -w +L -w +R -w +Z -I src -I plugin-lib -I bin -I +unix -safe-string -bin-annot -strict-sequence -c plugin-lib/ocamlbuild_unix_plugin.mli
- ocamlc.opt -w +L -w +R -w +Z -I src -I plugin-lib -I bin -I +unix -safe-string -bin-annot -strict-sequence -c plugin-lib/ocamlbuild_unix_plugin.ml
- ocamlc.opt -w +L -w +R -w +Z -I src -I plugin-lib -I bin -I +unix -safe-string -bin-annot -strict-sequence -c bin/ocamlbuild.mli
- ocamlc.opt -w +L -w +R -w +Z -I src -I plugin-lib -I bin -I +unix -safe-string -bin-annot -strict-sequence -c bin/ocamlbuild.ml
- ocamlc.opt -I +unix -I src -o ocamlbuild.byte unix.cma src/ocamlbuild_pack.cmo plugin-lib/ocamlbuild_plugin.cmo plugin-lib/ocamlbuild_executor.cmo plugin-lib/ocamlbuild_unix_plugin.cmo bin/ocamlbuild.cmo
- ocamlc.opt -a -o plugin-lib/ocamlbuildlib.cma src/ocamlbuild_pack.cmo plugin-lib/ocamlbuild_plugin.cmo plugin-lib/ocamlbuild_executor.cmo plugin-lib/ocamlbuild_unix_plugin.cmo
- ocamlopt.opt -for-pack Ocamlbuild_pack -w +L -w +R -w +Z -I src -I plugin-lib -I bin -I +unix -safe-string -bin-annot -strict-sequence -c src/const.ml
- ocamlopt.opt -for-pack Ocamlbuild_pack -w +L -w +R -w +Z -I src -I plugin-lib -I bin -I +unix -safe-string -bin-annot -strict-sequence -c src/loc.ml
- ocamlopt.opt -for-pack Ocamlbuild_pack -w +L -w +R -w +Z -I src -I plugin-lib -I bin -I +unix -safe-string -bin-annot -strict-sequence -c src/discard_printf.ml
- ocamlopt.opt -for-pack Ocamlbuild_pack -w +L -w +R -w +Z -I src -I plugin-lib -I bin -I +unix -safe-string -bin-annot -strict-sequence -c src/my_std.ml
- ocamlopt.opt -for-pack Ocamlbuild_pack -w +L -w +R -w +Z -I src -I plugin-lib -I bin -I +unix -safe-string -bin-annot -strict-sequence -c src/my_unix.ml
- ocamlopt.opt -for-pack Ocamlbuild_pack -w +L -w +R -w +Z -I src -I plugin-lib -I bin -I +unix -safe-string -bin-annot -strict-sequence -c src/tags.ml
- ocamlopt.opt -for-pack Ocamlbuild_pack -w +L -w +R -w +Z -I src -I plugin-lib -I bin -I +unix -safe-string -bin-annot -strict-sequence -c src/display.ml
- ocamlopt.opt -for-pack Ocamlbuild_pack -w +L -w +R -w +Z -I src -I plugin-lib -I bin -I +unix -safe-string -bin-annot -strict-sequence -c src/log.ml
- ocamlopt.opt -for-pack Ocamlbuild_pack -w +L -w +R -w +Z -I src -I plugin-lib -I bin -I +unix -safe-string -bin-annot -strict-sequence -c src/shell.ml
- ocamlopt.opt -for-pack Ocamlbuild_pack -w +L -w +R -w +Z -I src -I plugin-lib -I bin -I +unix -safe-string -bin-annot -strict-sequence -c src/bool.ml
- ocamlopt.opt -for-pack Ocamlbuild_pack -w +L -w +R -w +Z -I src -I plugin-lib -I bin -I +unix -safe-string -bin-annot -strict-sequence -c src/glob_ast.ml
- ocamlopt.opt -for-pack Ocamlbuild_pack -w +L -w +R -w +Z -I src -I plugin-lib -I bin -I +unix -safe-string -bin-annot -strict-sequence -c src/glob_lexer.ml
- ocamlopt.opt -for-pack Ocamlbuild_pack -w +L -w +R -w +Z -I src -I plugin-lib -I bin -I +unix -safe-string -bin-annot -strict-sequence -c src/glob.ml
- ocamlopt.opt -for-pack Ocamlbuild_pack -w +L -w +R -w +Z -I src -I plugin-lib -I bin -I +unix -safe-string -bin-annot -strict-sequence -c src/lexers.ml
- ocamlopt.opt -for-pack Ocamlbuild_pack -w +L -w +R -w +Z -I src -I plugin-lib -I bin -I +unix -safe-string -bin-annot -strict-sequence -c src/param_tags.ml
- ocamlopt.opt -for-pack Ocamlbuild_pack -w +L -w +R -w +Z -I src -I plugin-lib -I bin -I +unix -safe-string -bin-annot -strict-sequence -c src/command.ml
- ocamlopt.opt -for-pack Ocamlbuild_pack -w +L -w +R -w +Z -I src -I plugin-lib -I bin -I +unix -safe-string -bin-annot -strict-sequence -c src/ocamlbuild_config.ml
- ocamlopt.opt -for-pack Ocamlbuild_pack -w +L -w +R -w +Z -I src -I plugin-lib -I bin -I +unix -safe-string -bin-annot -strict-sequence -c src/ocamlbuild_where.ml
- ocamlopt.opt -for-pack Ocamlbuild_pack -w +L -w +R -w +Z -I src -I plugin-lib -I bin -I +unix -safe-string -bin-annot -strict-sequence -c src/slurp.ml
- ocamlopt.opt -for-pack Ocamlbuild_pack -w +L -w +R -w +Z -I src -I plugin-lib -I bin -I +unix -safe-string -bin-annot -strict-sequence -c src/options.ml
- ocamlopt.opt -for-pack Ocamlbuild_pack -w +L -w +R -w +Z -I src -I plugin-lib -I bin -I +unix -safe-string -bin-annot -strict-sequence -c src/pathname.ml
- ocamlopt.opt -for-pack Ocamlbuild_pack -w +L -w +R -w +Z -I src -I plugin-lib -I bin -I +unix -safe-string -bin-annot -strict-sequence -c src/configuration.ml
- ocamlopt.opt -for-pack Ocamlbuild_pack -w +L -w +R -w +Z -I src -I plugin-lib -I bin -I +unix -safe-string -bin-annot -strict-sequence -c src/flags.ml
- ocamlopt.opt -for-pack Ocamlbuild_pack -w +L -w +R -w +Z -I src -I plugin-lib -I bin -I +unix -safe-string -bin-annot -strict-sequence -c src/hygiene.ml
- ocamlopt.opt -for-pack Ocamlbuild_pack -w +L -w +R -w +Z -I src -I plugin-lib -I bin -I +unix -safe-string -bin-annot -strict-sequence -c src/digest_cache.ml
- ocamlopt.opt -for-pack Ocamlbuild_pack -w +L -w +R -w +Z -I src -I plugin-lib -I bin -I +unix -safe-string -bin-annot -strict-sequence -c src/resource.ml
- ocamlopt.opt -for-pack Ocamlbuild_pack -w +L -w +R -w +Z -I src -I plugin-lib -I bin -I +unix -safe-string -bin-annot -strict-sequence -c src/rule.ml
- ocamlopt.opt -for-pack Ocamlbuild_pack -w +L -w +R -w +Z -I src -I plugin-lib -I bin -I +unix -safe-string -bin-annot -strict-sequence -c src/solver.ml
- ocamlopt.opt -for-pack Ocamlbuild_pack -w +L -w +R -w +Z -I src -I plugin-lib -I bin -I +unix -safe-string -bin-annot -strict-sequence -c src/report.ml
- ocamlopt.opt -for-pack Ocamlbuild_pack -w +L -w +R -w +Z -I src -I plugin-lib -I bin -I +unix -safe-string -bin-annot -strict-sequence -c src/tools.ml
- ocamlopt.opt -for-pack Ocamlbuild_pack -w +L -w +R -w +Z -I src -I plugin-lib -I bin -I +unix -safe-string -bin-annot -strict-sequence -c src/fda.ml
- ocamlopt.opt -for-pack Ocamlbuild_pack -w +L -w +R -w +Z -I src -I plugin-lib -I bin -I +unix -safe-string -bin-annot -strict-sequence -c src/findlib.ml
- ocamlopt.opt -for-pack Ocamlbuild_pack -w +L -w +R -w +Z -I src -I plugin-lib -I bin -I +unix -safe-string -bin-annot -strict-sequence -c src/ocaml_arch.ml
- ocamlopt.opt -for-pack Ocamlbuild_pack -w +L -w +R -w +Z -I src -I plugin-lib -I bin -I +unix -safe-string -bin-annot -strict-sequence -c src/ocaml_utils.ml
- ocamlopt.opt -for-pack Ocamlbuild_pack -w +L -w +R -w +Z -I src -I plugin-lib -I bin -I +unix -safe-string -bin-annot -strict-sequence -c src/ocaml_dependencies.ml
- ocamlopt.opt -for-pack Ocamlbuild_pack -w +L -w +R -w +Z -I src -I plugin-lib -I bin -I +unix -safe-string -bin-annot -strict-sequence -c src/ocaml_compiler.ml
- ocamlopt.opt -for-pack Ocamlbuild_pack -w +L -w +R -w +Z -I src -I plugin-lib -I bin -I +unix -safe-string -bin-annot -strict-sequence -c src/ocaml_tools.ml
- ocamlopt.opt -for-pack Ocamlbuild_pack -w +L -w +R -w +Z -I src -I plugin-lib -I bin -I +unix -safe-string -bin-annot -strict-sequence -c src/ocaml_specific.ml
- ocamlopt.opt -for-pack Ocamlbuild_pack -w +L -w +R -w +Z -I src -I plugin-lib -I bin -I +unix -safe-string -bin-annot -strict-sequence -c src/exit_codes.ml
- ocamlopt.opt -for-pack Ocamlbuild_pack -w +L -w +R -w +Z -I src -I plugin-lib -I bin -I +unix -safe-string -bin-annot -strict-sequence -c src/plugin.ml
- ocamlopt.opt -for-pack Ocamlbuild_pack -w +L -w +R -w +Z -I src -I plugin-lib -I bin -I +unix -safe-string -bin-annot -strict-sequence -c src/hooks.ml
- ocamlopt.opt -for-pack Ocamlbuild_pack -w +L -w +R -w +Z -I src -I plugin-lib -I bin -I +unix -safe-string -bin-annot -strict-sequence -c src/main.ml
- mkdir -p tmp
- ocamlopt.opt -pack src/const.cmx src/loc.cmx src/discard_printf.cmx src/signatures.cmi src/my_std.cmx src/my_unix.cmx src/tags.cmx src/display.cmx src/log.cmx src/shell.cmx src/bool.cmx src/glob_ast.cmx src/glob_lexer.cmx src/glob.cmx src/lexers.cmx src/param_tags.cmx src/command.cmx src/ocamlbuild_config.cmx src/ocamlbuild_where.cmx src/slurp.cmx src/options.cmx src/pathname.cmx src/configuration.cmx src/flags.cmx src/hygiene.cmx src/digest_cache.cmx src/resource.cmx src/rule.cmx src/solver.cmx src/report.cmx src/tools.cmx src/fda.cmx src/findlib.cmx src/ocaml_arch.cmx src/ocaml_utils.cmx src/ocaml_dependencies.cmx src/ocaml_compiler.cmx src/ocaml_tools.cmx src/ocaml_specific.cmx src/exit_codes.cmx src/plugin.cmx src/hooks.cmx src/main.cmx -o tmp/ocamlbuild_pack.cmx
- mv tmp/ocamlbuild_pack.cmx src/ocamlbuild_pack.cmx
- mv tmp/ocamlbuild_pack.o src/ocamlbuild_pack.o
- ocamlopt.opt -w +L -w +R -w +Z -I src -I plugin-lib -I bin -I +unix -safe-string -bin-annot -strict-sequence -c plugin-lib/ocamlbuild_plugin.ml
- ocamlopt.opt -w +L -w +R -w +Z -I src -I plugin-lib -I bin -I +unix -safe-string -bin-annot -strict-sequence -c plugin-lib/ocamlbuild_executor.ml
- ocamlopt.opt -w +L -w +R -w +Z -I src -I plugin-lib -I bin -I +unix -safe-string -bin-annot -strict-sequence -c plugin-lib/ocamlbuild_unix_plugin.ml
- ocamlopt.opt -w +L -w +R -w +Z -I src -I plugin-lib -I bin -I +unix -safe-string -bin-annot -strict-sequence -c bin/ocamlbuild.ml
- ocamlopt.opt -I +unix -I src -o ocamlbuild.native unix.cmxa src/ocamlbuild_pack.cmx plugin-lib/ocamlbuild_plugin.cmx plugin-lib/ocamlbuild_executor.cmx plugin-lib/ocamlbuild_unix_plugin.cmx bin/ocamlbuild.cmx
- ocamlopt.opt -a -o plugin-lib/ocamlbuildlib.cmxa src/ocamlbuild_pack.cmx plugin-lib/ocamlbuild_plugin.cmx plugin-lib/ocamlbuild_executor.cmx plugin-lib/ocamlbuild_unix_plugin.cmx
- ocamlc.opt src/ocamlbuild_pack.cmo -I src man/options_man.ml -o man/options_man.byte
- ./man/options_man.byte > man/ocamlbuild.options.1
- cat man/ocamlbuild.header.1 man/ocamlbuild.options.1 man/ocamlbuild.footer.1 > man/ocamlbuild.1
- make ocamlbuild.install
- make[1]: Entering directory '/home/opam/.opam/5.0+alpha-repo/.opam-switch/build/ocamlbuild.0.14.2'
- rm -f ocamlbuild.install
- touch ocamlbuild.install
- make install-bin-opam
- make[2]: Entering directory '/home/opam/.opam/5.0+alpha-repo/.opam-switch/build/ocamlbuild.0.14.2'
- echo 'bin: [' >> ocamlbuild.install
- echo '  "ocamlbuild.byte" {"ocamlbuild.byte"}' >> ocamlbuild.install
- echo '  "ocamlbuild.native" {"ocamlbuild.native"}' >> ocamlbuild.install
- echo '  "ocamlbuild.native" {"ocamlbuild"}' >> ocamlbuild.install
- echo ']' >> ocamlbuild.install
- echo >> ocamlbuild.install
- make[2]: Leaving directory '/home/opam/.opam/5.0+alpha-repo/.opam-switch/build/ocamlbuild.0.14.2'
- make install-lib-opam
- make[2]: Entering directory '/home/opam/.opam/5.0+alpha-repo/.opam-switch/build/ocamlbuild.0.14.2'
- echo 'lib: [' >> ocamlbuild.install
- make install-lib-basics-opam
- make[3]: Entering directory '/home/opam/.opam/5.0+alpha-repo/.opam-switch/build/ocamlbuild.0.14.2'
- echo '  "ocamlbuild.opam" {"opam"}' >> ocamlbuild.install
- echo '  "META"' >> ocamlbuild.install
- for lib in src/signatures.mli src/signatures.cmi src/signatures.cmti; do \
-   echo "  \"$lib\" {\"$(basename $lib)\"}" >> ocamlbuild.install; \
- done
- make[3]: Leaving directory '/home/opam/.opam/5.0+alpha-repo/.opam-switch/build/ocamlbuild.0.14.2'
- make install-lib-byte-opam
- make[3]: Entering directory '/home/opam/.opam/5.0+alpha-repo/.opam-switch/build/ocamlbuild.0.14.2'
- for lib in plugin-lib/ocamlbuildlib.cma bin/ocamlbuild.cmo src/ocamlbuild_pack.cmi plugin-lib/ocamlbuild_plugin.cmi plugin-lib/ocamlbuild_executor.cmi plugin-lib/ocamlbuild_unix_plugin.cmi; do \
-   echo "  \"$lib\" {\"$(basename $lib)\"}" >> ocamlbuild.install; \
- done
- make[3]: Leaving directory '/home/opam/.opam/5.0+alpha-repo/.opam-switch/build/ocamlbuild.0.14.2'
- make install-lib-native-opam
- make[3]: Entering directory '/home/opam/.opam/5.0+alpha-repo/.opam-switch/build/ocamlbuild.0.14.2'
- for lib in plugin-lib/ocamlbuildlib.cmxa plugin-lib/ocamlbuildlib.a bin/ocamlbuild.cmx bin/ocamlbuild.o src/ocamlbuild_pack.cmx plugin-lib/ocamlbuild_plugin.cmx plugin-lib/ocamlbuild_executor.cmx plugin-lib/ocamlbuild_unix_plugin.cmx plugin-lib/ocamlbuild_plugin.o plugin-lib/ocamlbuild_executor.o plugin-lib/ocamlbuild_unix_plugin.o; do \
-   echo "  \"$lib\" {\"$(basename $lib)\"}" >> ocamlbuild.install; \
- done
- make[3]: Leaving directory '/home/opam/.opam/5.0+alpha-repo/.opam-switch/build/ocamlbuild.0.14.2'
- echo ']' >> ocamlbuild.install
- echo >> ocamlbuild.install
- make[2]: Leaving directory '/home/opam/.opam/5.0+alpha-repo/.opam-switch/build/ocamlbuild.0.14.2'
- make install-man-opam
- make[2]: Entering directory '/home/opam/.opam/5.0+alpha-repo/.opam-switch/build/ocamlbuild.0.14.2'
- echo 'man: [' >> ocamlbuild.install
- echo '  "man/ocamlbuild.1" {"man1/ocamlbuild.1"}' >> ocamlbuild.install
- echo ']' >> ocamlbuild.install
- echo >> ocamlbuild.install
- make[2]: Leaving directory '/home/opam/.opam/5.0+alpha-repo/.opam-switch/build/ocamlbuild.0.14.2'
- make install-doc-opam
- make[2]: Entering directory '/home/opam/.opam/5.0+alpha-repo/.opam-switch/build/ocamlbuild.0.14.2'
- echo 'doc: [' >> ocamlbuild.install
- echo '  "LICENSE"' >> ocamlbuild.install
- echo '  "Changes"' >> ocamlbuild.install
- echo '  "Readme.md"' >> ocamlbuild.install
- echo ']' >> ocamlbuild.install
- make[2]: Leaving directory '/home/opam/.opam/5.0+alpha-repo/.opam-switch/build/ocamlbuild.0.14.2'
- make[1]: Leaving directory '/home/opam/.opam/5.0+alpha-repo/.opam-switch/build/ocamlbuild.0.14.2'
-> compiled  ocamlbuild.0.14.2
Processing 69/171: [dune: ocaml bootstrap.ml]
-> installed ocamlbuild.0.14.2
Processing 70/171: [dune: ocaml bootstrap.ml]
Processing 71/171: [dune: ocaml bootstrap.ml] [topkg: ocaml build]
+ /home/opam/.opam/opam-init/hooks/sandbox.sh "build" "ocaml" "pkg/pkg.ml" "build" "--pkg-name" "topkg" "--dev-pkg" "false" (CWD=/home/opam/.opam/5.0+alpha-repo/.opam-switch/build/topkg.1.0.6)
- ocamlfind ocamldep -modules src/topkg.ml > src/topkg.ml.depends
- ocamlfind ocamldep -modules src/topkg.mli > src/topkg.mli.depends
- ocamlfind ocamlc -c -g -bin-annot -safe-string -I src -I test -I src-care -I src-bin -o src/topkg.cmi src/topkg.mli
- ocamlfind ocamldep -modules src/topkg_build.ml > src/topkg_build.ml.depends
- ocamlfind ocamldep -modules src/topkg_build.mli > src/topkg_build.mli.depends
- ocamlfind ocamldep -modules src/topkg_cmd.mli > src/topkg_cmd.mli.depends
- ocamlfind ocamldep -modules src/topkg_fpath.mli > src/topkg_fpath.mli.depends
- ocamlfind ocamlc -c -g -bin-annot -safe-string -I src -I test -I src-care -I src-bin -o src/topkg_fpath.cmi src/topkg_fpath.mli
- ocamlfind ocamldep -modules src/topkg_codec.mli > src/topkg_codec.mli.depends
- ocamlfind ocamlc -c -g -bin-annot -safe-string -I src -I test -I src-care -I src-bin -o src/topkg_cmd.cmi src/topkg_cmd.mli
- ocamlfind ocamldep -modules src/topkg_result.mli > src/topkg_result.mli.depends
- ocamlfind ocamlc -c -g -bin-annot -safe-string -I src -I test -I src-care -I src-bin -o src/topkg_result.cmi src/topkg_result.mli
- ocamlfind ocamldep -modules src/topkg_conf.mli > src/topkg_conf.mli.depends
- ocamlfind ocamlc -c -g -bin-annot -safe-string -I src -I test -I src-care -I src-bin -o src/topkg_codec.cmi src/topkg_codec.mli
- ocamlfind ocamlc -c -g -bin-annot -safe-string -I src -I test -I src-care -I src-bin -o src/topkg_conf.cmi src/topkg_conf.mli
- ocamlfind ocamlc -c -g -bin-annot -safe-string -I src -I test -I src-care -I src-bin -o src/topkg_build.cmi src/topkg_build.mli
- ocamlfind ocamldep -modules src/topkg_cmd.ml > src/topkg_cmd.ml.depends
- ocamlfind ocamldep -modules src/topkg_fpath.ml > src/topkg_fpath.ml.depends
- ocamlfind ocamldep -modules src/topkg_string.ml > src/topkg_string.ml.depends
- ocamlfind ocamldep -modules src/topkg_string.mli > src/topkg_string.mli.depends
- ocamlfind ocamlc -c -g -bin-annot -safe-string -I src -I test -I src-care -I src-bin -o src/topkg_string.cmi src/topkg_string.mli
- ocamlfind ocamlopt -c -g -bin-annot -safe-string -I src -I test -I src-care -I src-bin -o src/topkg_string.cmx src/topkg_string.ml
- ocamlfind ocamlopt -c -g -bin-annot -safe-string -I src -I test -I src-care -I src-bin -o src/topkg_fpath.cmx src/topkg_fpath.ml
- ocamlfind ocamldep -modules src/topkg_codec.ml > src/topkg_codec.ml.depends
- ocamlfind ocamlopt -c -g -bin-annot -safe-string -I src -I test -I src-care -I src-bin -o src/topkg_cmd.cmx src/topkg_cmd.ml
- ocamlfind ocamldep -modules src/topkg_os.ml > src/topkg_os.ml.depends
- ocamlfind ocamldep -modules src/topkg_os.mli > src/topkg_os.mli.depends
- ocamlfind ocamlc -c -g -bin-annot -safe-string -I src -I test -I src-care -I src-bin -o src/topkg_os.cmi src/topkg_os.mli
- ocamlfind ocamldep -modules src/topkg_log.ml > src/topkg_log.ml.depends
- ocamlfind ocamldep -modules src/topkg_log.mli > src/topkg_log.mli.depends
- ocamlfind ocamlc -c -g -bin-annot -safe-string -I src -I test -I src-care -I src-bin -o src/topkg_log.cmi src/topkg_log.mli
- ocamlfind ocamldep -modules src/topkg_result.ml > src/topkg_result.ml.depends
- ocamlfind ocamlopt -c -g -bin-annot -safe-string -I src -I test -I src-care -I src-bin -o src/topkg_result.cmx src/topkg_result.ml
- ocamlfind ocamlopt -c -g -bin-annot -safe-string -I src -I test -I src-care -I src-bin -o src/topkg_log.cmx src/topkg_log.ml
- ocamlfind ocamlopt -c -g -bin-annot -safe-string -I src -I test -I src-care -I src-bin -o src/topkg_os.cmx src/topkg_os.ml
- ocamlfind ocamldep -modules src/topkg_conf.ml > src/topkg_conf.ml.depends
- ocamlfind ocamlopt -c -g -bin-annot -safe-string -I src -I test -I src-care -I src-bin -o src/topkg_codec.cmx src/topkg_codec.ml
- ocamlfind ocamldep -modules src/topkg_vcs.ml > src/topkg_vcs.ml.depends
- ocamlfind ocamldep -modules src/topkg_vcs.mli > src/topkg_vcs.mli.depends
- ocamlfind ocamlc -c -g -bin-annot -safe-string -I src -I test -I src-care -I src-bin -o src/topkg_vcs.cmi src/topkg_vcs.mli
- ocamlfind ocamlopt -c -g -bin-annot -safe-string -I src -I test -I src-care -I src-bin -o src/topkg_vcs.cmx src/topkg_vcs.ml
- ocamlfind ocamlopt -c -g -bin-annot -safe-string -I src -I test -I src-care -I src-bin -o src/topkg_conf.cmx src/topkg_conf.ml
- ocamlfind ocamldep -modules src/topkg_distrib.ml > src/topkg_distrib.ml.depends
- ocamlfind ocamldep -modules src/topkg_distrib.mli > src/topkg_distrib.mli.depends
- ocamlfind ocamlc -c -g -bin-annot -safe-string -I src -I test -I src-care -I src-bin -o src/topkg_distrib.cmi src/topkg_distrib.mli
- ocamlfind ocamldep -modules src/topkg_opam.ml > src/topkg_opam.ml.depends
- ocamlfind ocamldep -modules src/topkg_opam.mli > src/topkg_opam.mli.depends
- ocamlfind ocamlc -c -g -bin-annot -safe-string -I src -I test -I src-care -I src-bin -o src/topkg_opam.cmi src/topkg_opam.mli
- ocamlfind ocamlopt -c -g -bin-annot -safe-string -I src -I test -I src-care -I src-bin -o src/topkg_opam.cmx src/topkg_opam.ml
- ocamlfind ocamldep -modules src/topkg_fexts.ml > src/topkg_fexts.ml.depends
- ocamlfind ocamldep -modules src/topkg_fexts.mli > src/topkg_fexts.mli.depends
- ocamlfind ocamlc -c -g -bin-annot -safe-string -I src -I test -I src-care -I src-bin -o src/topkg_fexts.cmi src/topkg_fexts.mli
- ocamlfind ocamldep -modules src/topkg_install.ml > src/topkg_install.ml.depends
- ocamlfind ocamldep -modules src/topkg_install.mli > src/topkg_install.mli.depends
- ocamlfind ocamldep -modules src/topkg_test.mli > src/topkg_test.mli.depends
- ocamlfind ocamlc -c -g -bin-annot -safe-string -I src -I test -I src-care -I src-bin -o src/topkg_test.cmi src/topkg_test.mli
- ocamlfind ocamlc -c -g -bin-annot -safe-string -I src -I test -I src-care -I src-bin -o src/topkg_install.cmi src/topkg_install.mli
- ocamlfind ocamlopt -c -g -bin-annot -safe-string -I src -I test -I src-care -I src-bin -o src/topkg_fexts.cmx src/topkg_fexts.ml
- ocamlfind ocamldep -modules src/topkg_test.ml > src/topkg_test.ml.depends
- ocamlfind ocamlopt -c -g -bin-annot -safe-string -I src -I test -I src-care -I src-bin -o src/topkg_test.cmx src/topkg_test.ml
- ocamlfind ocamldep -modules src/topkg_ipc.ml > src/topkg_ipc.ml.depends
- ocamlfind ocamldep -modules src/topkg_ipc.mli > src/topkg_ipc.mli.depends
- ocamlfind ocamldep -modules src/topkg_pkg.mli > src/topkg_pkg.mli.depends
- ocamlfind ocamldep -modules src/topkg_publish.mli > src/topkg_publish.mli.depends
- ocamlfind ocamlc -c -g -bin-annot -safe-string -I src -I test -I src-care -I src-bin -o src/topkg_publish.cmi src/topkg_publish.mli
- ocamlfind ocamlc -c -g -bin-annot -safe-string -I src -I test -I src-care -I src-bin -o src/topkg_pkg.cmi src/topkg_pkg.mli
- ocamlfind ocamlc -c -g -bin-annot -safe-string -I src -I test -I src-care -I src-bin -o src/topkg_ipc.cmi src/topkg_ipc.mli
- ocamlfind ocamldep -modules src/topkg_pkg.ml > src/topkg_pkg.ml.depends
- ocamlfind ocamlopt -c -g -bin-annot -safe-string -I src -I test -I src-care -I src-bin -o src/topkg_build.cmx src/topkg_build.ml
- ocamlfind ocamlopt -c -g -bin-annot -safe-string -I src -I test -I src-care -I src-bin -o src/topkg_distrib.cmx src/topkg_distrib.ml
- ocamlfind ocamlopt -c -g -bin-annot -safe-string -I src -I test -I src-care -I src-bin -o src/topkg_install.cmx src/topkg_install.ml
- ocamlfind ocamldep -modules src/topkg_publish.ml > src/topkg_publish.ml.depends
- ocamlfind ocamlopt -c -g -bin-annot -safe-string -I src -I test -I src-care -I src-bin -o src/topkg_publish.cmx src/topkg_publish.ml
- ocamlfind ocamlopt -c -g -bin-annot -safe-string -I src -I test -I src-care -I src-bin -o src/topkg_pkg.cmx src/topkg_pkg.ml
- ocamlfind ocamldep -modules src/topkg_main.ml > src/topkg_main.ml.depends
- ocamlfind ocamldep -modules src/topkg_main.mli > src/topkg_main.mli.depends
- ocamlfind ocamlc -c -g -bin-annot -safe-string -I src -I test -I src-care -I src-bin -o src/topkg_main.cmi src/topkg_main.mli
- ocamlfind ocamlopt -c -g -bin-annot -safe-string -I src -I test -I src-care -I src-bin -o src/topkg_ipc.cmx src/topkg_ipc.ml
- ocamlfind ocamlopt -c -g -bin-annot -safe-string -I src -I test -I src-care -I src-bin -o src/topkg_main.cmx src/topkg_main.ml
- ocamlfind ocamlopt -c -g -bin-annot -safe-string -I src -I test -I src-care -I src-bin -o src/topkg.cmx src/topkg.ml
- ocamlfind ocamlopt -a -I src src/topkg_string.cmx src/topkg_fpath.cmx src/topkg_cmd.cmx src/topkg_result.cmx src/topkg_log.cmx src/topkg_os.cmx src/topkg_codec.cmx src/topkg_vcs.cmx src/topkg_conf.cmx src/topkg_build.cmx src/topkg_opam.cmx src/topkg_distrib.cmx src/topkg_fexts.cmx src/topkg_test.cmx src/topkg_install.cmx src/topkg_publish.cmx src/topkg_pkg.cmx src/topkg_ipc.cmx src/topkg_main.cmx src/topkg.cmx -o src/topkg.cmxa
- ocamlfind ocamlopt -shared -linkall -I src src/topkg.cmxa -o src/topkg.cmxs
- ocamlfind ocamlc -c -g -bin-annot -safe-string -I src -I test -I src-care -I src-bin -o src/topkg.cmo src/topkg.ml
- ocamlfind ocamlc -c -g -bin-annot -safe-string -I src -I test -I src-care -I src-bin -o src/topkg_build.cmo src/topkg_build.ml
- ocamlfind ocamlc -c -g -bin-annot -safe-string -I src -I test -I src-care -I src-bin -o src/topkg_cmd.cmo src/topkg_cmd.ml
- ocamlfind ocamlc -c -g -bin-annot -safe-string -I src -I test -I src-care -I src-bin -o src/topkg_codec.cmo src/topkg_codec.ml
- ocamlfind ocamlc -c -g -bin-annot -safe-string -I src -I test -I src-care -I src-bin -o src/topkg_conf.cmo src/topkg_conf.ml
- ocamlfind ocamlc -c -g -bin-annot -safe-string -I src -I test -I src-care -I src-bin -o src/topkg_distrib.cmo src/topkg_distrib.ml
- ocamlfind ocamlc -c -g -bin-annot -safe-string -I src -I test -I src-care -I src-bin -o src/topkg_fexts.cmo src/topkg_fexts.ml
- ocamlfind ocamlc -c -g -bin-annot -safe-string -I src -I test -I src-care -I src-bin -o src/topkg_fpath.cmo src/topkg_fpath.ml
- ocamlfind ocamlc -c -g -bin-annot -safe-string -I src -I test -I src-care -I src-bin -o src/topkg_install.cmo src/topkg_install.ml
- ocamlfind ocamlc -c -g -bin-annot -safe-string -I src -I test -I src-care -I src-bin -o src/topkg_ipc.cmo src/topkg_ipc.ml
- ocamlfind ocamlc -c -g -bin-annot -safe-string -I src -I test -I src-care -I src-bin -o src/topkg_log.cmo src/topkg_log.ml
- ocamlfind ocamlc -c -g -bin-annot -safe-string -I src -I test -I src-care -I src-bin -o src/topkg_main.cmo src/topkg_main.ml
- ocamlfind ocamlc -c -g -bin-annot -safe-string -I src -I test -I src-care -I src-bin -o src/topkg_opam.cmo src/topkg_opam.ml
- ocamlfind ocamlc -c -g -bin-annot -safe-string -I src -I test -I src-care -I src-bin -o src/topkg_os.cmo src/topkg_os.ml
- ocamlfind ocamlc -c -g -bin-annot -safe-string -I src -I test -I src-care -I src-bin -o src/topkg_pkg.cmo src/topkg_pkg.ml
- ocamlfind ocamlc -c -g -bin-annot -safe-string -I src -I test -I src-care -I src-bin -o src/topkg_publish.cmo src/topkg_publish.ml
- ocamlfind ocamlc -c -g -bin-annot -safe-string -I src -I test -I src-care -I src-bin -o src/topkg_result.cmo src/topkg_result.ml
- ocamlfind ocamlc -c -g -bin-annot -safe-string -I src -I test -I src-care -I src-bin -o src/topkg_string.cmo src/topkg_string.ml
- ocamlfind ocamlc -c -g -bin-annot -safe-string -I src -I test -I src-care -I src-bin -o src/topkg_test.cmo src/topkg_test.ml
- ocamlfind ocamlc -c -g -bin-annot -safe-string -I src -I test -I src-care -I src-bin -o src/topkg_vcs.cmo src/topkg_vcs.ml
- ocamlfind ocamlc -a -I src src/topkg_string.cmo src/topkg_fpath.cmo src/topkg_cmd.cmo src/topkg_result.cmo src/topkg_log.cmo src/topkg_os.cmo src/topkg_codec.cmo src/topkg_vcs.cmo src/topkg_conf.cmo src/topkg_build.cmo src/topkg_opam.cmo src/topkg_distrib.cmo src/topkg_fexts.cmo src/topkg_test.cmo src/topkg_install.cmo src/topkg_publish.cmo src/topkg_pkg.cmo src/topkg_ipc.cmo src/topkg_main.cmo src/topkg.cmo -o src/topkg.cma
- # Parallel statistics: { count(total): 2(84), max: 20, min: 2, average(total): 11.000(1.238) }
-> compiled  topkg.1.0.6
Processing 71/171: [dune: ocaml bootstrap.ml]
-> installed topkg.1.0.6
Processing 72/171: [dune: ocaml bootstrap.ml]
Processing 73/171: [dune: ocaml bootstrap.ml] [fmt: ocaml build]
Processing 74/171: [dune: ocaml bootstrap.ml] [fmt: ocaml build] [ptime: ocaml build]
Processing 75/171: [dune: ocaml bootstrap.ml] [fmt: ocaml build] [ptime: ocaml build] [xmlm: ocaml build]
+ /home/opam/.opam/opam-init/hooks/sandbox.sh "build" "ocaml" "pkg/pkg.ml" "build" "--dev-pkg" "false" (CWD=/home/opam/.opam/5.0+alpha-repo/.opam-switch/build/xmlm.1.4.0)
- ocamlfind ocamldep -modules src/xmlm.ml > src/xmlm.ml.depends
- ocamlfind ocamldep -modules src/xmlm.mli > src/xmlm.mli.depends
- ocamlfind ocamlc -c -g -bin-annot -safe-string -I src -I test -o src/xmlm.cmi src/xmlm.mli
- ocamlfind ocamlopt -c -g -bin-annot -safe-string -I src -I test -o src/xmlm.cmx src/xmlm.ml
- ocamlfind ocamlopt -a -I src src/xmlm.cmx -o src/xmlm.cmxa
- ocamlfind ocamlopt -shared -linkall -I src src/xmlm.cmxa -o src/xmlm.cmxs
- ocamlfind ocamlc -c -g -bin-annot -safe-string -I src -I test -o src/xmlm.cmo src/xmlm.ml
- ocamlfind ocamlc -a -I src src/xmlm.cmo -o src/xmlm.cma
- ocamlfind ocamldep -modules test/xmltrip.ml > test/xmltrip.ml.depends
- ocamlfind ocamldep -modules test/xhtml.ml > test/xhtml.ml.depends
- ocamlfind ocamlc -c -g -bin-annot -safe-string -I test -I src -o test/xhtml.cmo test/xhtml.ml
- ocamlfind ocamlc -c -g -bin-annot -safe-string -I test -I src -o test/xmltrip.cmo test/xmltrip.ml
- ocamlfind ocamlopt -c -g -bin-annot -safe-string -I test -I src -o test/xhtml.cmx test/xhtml.ml
- ocamlfind ocamlopt -c -g -bin-annot -safe-string -I test -I src -o test/xmltrip.cmx test/xmltrip.ml
- ocamlfind ocamlopt -linkpkg -g -I src -I test src/xmlm.cmx test/xhtml.cmx test/xmltrip.cmx -o test/xmltrip.native
- # No parallelism done
-> compiled  xmlm.1.4.0
Processing 75/171: [dune: ocaml bootstrap.ml] [fmt: ocaml build] [ptime: ocaml build]
-> installed xmlm.1.4.0
Processing 76/171: [dune: ocaml bootstrap.ml] [fmt: ocaml build] [ptime: ocaml build]
+ /home/opam/.opam/opam-init/hooks/sandbox.sh "build" "ocaml" "pkg/pkg.ml" "build" "--dev-pkg" "false" "--with-base-unix" "true" "--with-cmdliner" "true" (CWD=/home/opam/.opam/5.0+alpha-repo/.opam-switch/build/fmt.0.9.0)
- ocamlfind ocamldep -modules src/fmt.ml > src/fmt.ml.depends
- ocamlfind ocamldep -modules src/fmt.mli > src/fmt.mli.depends
- ocamlfind ocamlc -c -g -bin-annot -safe-string -I src -I test -o src/fmt.cmi src/fmt.mli
- ocamlfind ocamlopt -c -g -bin-annot -safe-string -I src -I test -o src/fmt.cmx src/fmt.ml
- ocamlfind ocamlopt -a -I src src/fmt.cmx -o src/fmt.cmxa
- ocamlfind ocamlopt -shared -linkall -I src src/fmt.cmxa -o src/fmt.cmxs
- ocamlfind ocamlc -c -g -bin-annot -safe-string -I src -I test -o src/fmt.cmo src/fmt.ml
- ocamlfind ocamlc -a -I src src/fmt.cmo -o src/fmt.cma
- ocamlfind ocamldep -package unix -modules src/fmt_tty.ml > src/fmt_tty.ml.depends
- ocamlfind ocamldep -package unix -modules src/fmt_tty.mli > src/fmt_tty.mli.depends
- ocamlfind ocamlc -c -g -bin-annot -safe-string -package unix -I src -I test -o src/fmt_tty.cmi src/fmt_tty.mli
- ocamlfind ocamlopt -c -g -bin-annot -safe-string -package unix -I src -I test -o src/fmt_tty.cmx src/fmt_tty.ml
- + ocamlfind ocamlopt -c -g -bin-annot -safe-string -package unix -I src -I test -o src/fmt_tty.cmx src/fmt_tty.ml
- File "src/fmt_tty.ml", line 49, characters 12-20:
- 49 |         try is_infix "UTF-8" (String.uppercase_ascii (Sys.getenv var))
-                  ^^^^^^^^
- Warning 6 [labels-omitted]: label affix was omitted in the application of this function.
- ocamlfind ocamlopt -a -package unix -I src src/fmt_tty.cmx -o src/fmt_tty.cmxa
- ocamlfind ocamlopt -shared -linkall -package unix -I src src/fmt_tty.cmxa -o src/fmt_tty.cmxs
- ocamlfind ocamlc -c -g -bin-annot -safe-string -package unix -I src -I test -o src/fmt_tty.cmo src/fmt_tty.ml
- + ocamlfind ocamlc -c -g -bin-annot -safe-string -package unix -I src -I test -o src/fmt_tty.cmo src/fmt_tty.ml
- File "src/fmt_tty.ml", line 49, characters 12-20:
- 49 |         try is_infix "UTF-8" (String.uppercase_ascii (Sys.getenv var))
-                  ^^^^^^^^
- Warning 6 [labels-omitted]: label affix was omitted in the application of this function.
- ocamlfind ocamlc -a -package unix -I src src/fmt_tty.cmo -o src/fmt_tty.cma
- ocamlfind ocamldep -package cmdliner -modules src/fmt_cli.ml > src/fmt_cli.ml.depends
- ocamlfind ocamldep -package cmdliner -modules src/fmt_cli.mli > src/fmt_cli.mli.depends
- ocamlfind ocamlc -c -g -bin-annot -safe-string -package cmdliner -I src -I test -o src/fmt_cli.cmi src/fmt_cli.mli
- + ocamlfind ocamlc -c -g -bin-annot -safe-string -package cmdliner -I src -I test -o src/fmt_cli.cmi src/fmt_cli.mli
- File "src/fmt_cli.mli", line 10, characters 26-42:
- 10 | val style_renderer : ?env:Cmdliner.Arg.env -> ?docs:string -> unit ->
-                                ^^^^^^^^^^^^^^^^
- Alert deprecated: Cmdliner.Arg.env
- Use Cmd.Env.info instead.
- ocamlfind ocamlopt -c -g -bin-annot -safe-string -package cmdliner -I src -I test -o src/fmt_cli.cmx src/fmt_cli.ml
- ocamlfind ocamlopt -a -package cmdliner -I src src/fmt_cli.cmx -o src/fmt_cli.cmxa
- ocamlfind ocamlopt -shared -linkall -package cmdliner -I src src/fmt_cli.cmxa -o src/fmt_cli.cmxs
- ocamlfind ocamlc -c -g -bin-annot -safe-string -package cmdliner -I src -I test -o src/fmt_cli.cmo src/fmt_cli.ml
- ocamlfind ocamlc -a -package cmdliner -I src src/fmt_cli.cmo -o src/fmt_cli.cma
- ocamlfind ocamldep -package compiler-libs.toplevel -modules src/fmt_top.ml > src/fmt_top.ml.depends
- ocamlfind ocamlc -c -g -bin-annot -safe-string -package compiler-libs.toplevel -I src -I test -o src/fmt_top.cmo src/fmt_top.ml
- ocamlfind ocamlopt -c -g -bin-annot -safe-string -package compiler-libs.toplevel -I src -I test -o src/fmt_top.cmx src/fmt_top.ml
- ocamlfind ocamlopt -a -package compiler-libs.toplevel -I src src/fmt_top.cmx -o src/fmt_top.cmxa
- ocamlfind ocamlopt -shared -linkall -package compiler-libs.toplevel -I src src/fmt_top.cmxa -o src/fmt_top.cmxs
- ocamlfind ocamlc -a -package compiler-libs.toplevel -I src src/fmt_top.cmo -o src/fmt_top.cma
- # No parallelism done
-> compiled  fmt.0.9.0
Processing 76/171: [dune: ocaml bootstrap.ml] [ptime: ocaml build]
-> installed fmt.0.9.0
Processing 77/171: [dune: ocaml bootstrap.ml] [ptime: ocaml build]
+ /home/opam/.opam/opam-init/hooks/sandbox.sh "build" "ocaml" "pkg/pkg.ml" "build" "--dev-pkg" "false" (CWD=/home/opam/.opam/5.0+alpha-repo/.opam-switch/build/ptime.1.0.0)
- ocamlfind ocamlopt unix.cmxa -I /home/opam/.opam/5.0+alpha-repo/lib/ocamlbuild /home/opam/.opam/5.0+alpha-repo/lib/ocamlbuild/ocamlbuildlib.cmxa -linkpkg myocamlbuild.ml /home/opam/.opam/5.0+alpha-repo/lib/ocamlbuild/ocamlbuild.cmx -o myocamlbuild
- ocamlfind ocamldep -modules src/ptime.ml > src/ptime.ml.depends
- ocamlfind ocamldep -modules src/ptime.mli > src/ptime.mli.depends
- ocamlfind ocamlc -c -g -bin-annot -safe-string -I src -I src-clock -o src/ptime.cmi src/ptime.mli
- ocamlfind ocamlopt -c -g -bin-annot -safe-string -I src -I src-clock -o src/ptime.cmx src/ptime.ml
- ocamlfind ocamlopt -a -I src src/ptime.cmx -o src/ptime.cmxa
- ocamlfind ocamlopt -shared -linkall -I src src/ptime.cmxa -o src/ptime.cmxs
- ocamlfind ocamlc -c -g -bin-annot -safe-string -I src -I src-clock -o src/ptime.cmo src/ptime.ml
- ocamlfind ocamlc -a -I src src/ptime.cmo -o src/ptime.cma
- ocamlfind ocamldep -package compiler-libs.toplevel -modules src/ptime_top.ml > src/ptime_top.ml.depends
- ocamlfind ocamlc -c -g -bin-annot -safe-string -package compiler-libs.toplevel -I src -I src-clock -o src/ptime_top.cmo src/ptime_top.ml
- ocamlfind ocamlopt -c -g -bin-annot -safe-string -package compiler-libs.toplevel -I src -I src-clock -o src/ptime_top.cmx src/ptime_top.ml
- ocamlfind ocamlopt -a -package compiler-libs.toplevel -I src src/ptime_top.cmx -o src/ptime_top.cmxa
- ocamlfind ocamlopt -shared -linkall -package compiler-libs.toplevel -I src src/ptime_top.cmxa -o src/ptime_top.cmxs
- ocamlfind ocamlc -a -package compiler-libs.toplevel -I src src/ptime_top.cmo -o src/ptime_top.cma
- ocamlfind ocamldep -modules src/ptime_clock.mli > src/ptime_clock.mli.depends
- ocamlfind ocamlc -c -g -bin-annot -safe-string -I src -I src-clock -o src/ptime_clock.cmi src/ptime_clock.mli
- ocamlfind ocamlc -g -c src-clock/ptime_clock_stubs.c
- mv ptime_clock_stubs.o src-clock/ptime_clock_stubs.o
- ocamlfind ocamlmklib -o src-clock/ptime_clock_stubs -g src-clock/ptime_clock_stubs.o
- ocamlfind ocamldep -modules src-clock/ptime_clock.ml > src-clock/ptime_clock.ml.depends
- ocamlfind ocamldep -modules src-clock/ptime_clock.mli > src-clock/ptime_clock.mli.depends
- ocamlfind ocamlc -c -g -bin-annot -safe-string -I src-clock -I src -o src-clock/ptime_clock.cmi src-clock/ptime_clock.mli
- ocamlfind ocamlopt -c -g -bin-annot -safe-string -I src-clock -I src -o src-clock/ptime_clock.cmx src-clock/ptime_clock.ml
- + ocamlfind ocamlopt -c -g -bin-annot -safe-string -I src-clock -I src -o src-clock/ptime_clock.cmx src-clock/ptime_clock.ml
- findlib: [WARNING] Interface ptime_clock.cmi occurs in several directories: src, src-clock
- ocamlfind ocamlopt -a -cclib -lptime_clock_stubs -cclib -lrt -I src-clock src-clock/ptime_clock.cmx -o src-clock/ptime_clock.cmxa
- ocamlfind ocamlopt -shared -linkall src-clock/libptime_clock_stubs.a -I src-clock src-clock/ptime_clock.cmxa -o src-clock/ptime_clock.cmxs
- ocamlfind ocamlc -c -g -bin-annot -safe-string -I src-clock -I src -o src-clock/ptime_clock.cmo src-clock/ptime_clock.ml
- + ocamlfind ocamlc -c -g -bin-annot -safe-string -I src-clock -I src -o src-clock/ptime_clock.cmo src-clock/ptime_clock.ml
- findlib: [WARNING] Interface ptime_clock.cmi occurs in several directories: src, src-clock
- ocamlfind ocamlc -a -dllib -lptime_clock_stubs -cclib -lrt -cclib -lptime_clock_stubs -cclib -lrt -I src-clock src-clock/ptime_clock.cmo -o src-clock/ptime_clock.cma
- # No parallelism done
- + ocamlfind ocamlopt unix.cmxa -I /home/opam/.opam/5.0+alpha-repo/lib/ocamlbuild /home/opam/.opam/5.0+alpha-repo/lib/ocamlbuild/ocamlbuildlib.cmxa -linkpkg myocamlbuild.ml /home/opam/.opam/5.0+alpha-repo/lib/ocamlbuild/ocamlbuild.cmx -o myocamlbuild
- File "_none_", line 1:
- Alert ocaml_deprecated_auto_include: 
- OCaml's lib directory layout changed in 5.0. The unix subdirectory has been
- automatically added to the search path, but you should add -I +unix to the
- command-line to silence this alert (e.g. by adding unix to the list of
- libraries in your dune file, or adding use_unix to your _tags file for
- ocamlbuild, or using -package unix for ocamlfind).
-> compiled  ptime.1.0.0
Processing 77/171: [dune: ocaml bootstrap.ml]
-> installed ptime.1.0.0
Processing 78/171: [dune: ocaml bootstrap.ml]
+ /home/opam/.opam/opam-init/hooks/sandbox.sh "build" "ocaml" "bootstrap.ml" "-j" "31" (CWD=/home/opam/.opam/5.0+alpha-repo/.opam-switch/build/dune.3.5.0)
- ocamlc -output-complete-exe -w -24 -g -o .duneboot.exe -I boot -I +unix unix.cma boot/libs.ml boot/duneboot.ml
- ./.duneboot.exe -j 31
- cd _boot && /home/opam/.opam/5.0+alpha-repo/bin/ocamlopt.opt -c -g -no-alias-deps -w -49-6 -alert -unstable -I +unix -I +threads build_path_prefix_map.ml
- File "vendor/build_path_prefix_map/src/build_path_prefix_map.ml", line 5, characters 17-31:
- Alert deprecated: Stdlib.Printf.kprintf
- Use Printf.ksprintf instead.
- cd _boot && /home/opam/.opam/5.0+alpha-repo/bin/ocamlopt.opt -c -g -no-alias-deps -w -49-6 -alert -unstable -I +unix -I +threads opamLexer.ml
- File "vendor/opam-file-format/src/opamLexer.mll", line 21, characters 2-16:
- Alert deprecated: Stdlib.Printf.kprintf
- Use Printf.ksprintf instead.
- 

Processing 78/171: [dune: ./dune.exe build]
+ /home/opam/.opam/opam-init/hooks/sandbox.sh "build" "./dune.exe" "build" "dune.install" "--release" "--profile" "dune-bootstrap" "-j" "31" (CWD=/home/opam/.opam/5.0+alpha-repo/.opam-switch/build/dune.3.5.0)
-> compiled  dune.3.5.0
-> installed dune.3.5.0
Processing 80/171: [base64: dune build]
Processing 81/171: [base64: dune build] [bigstringaf: dune build]
Processing 82/171: [base64: dune build] [bigstringaf: dune build] [camlp-streams: dune build]
Processing 83/171: [base64: dune build] [bigstringaf: dune build] [camlp-streams: dune build] [cppo: dune build]
Processing 84/171: [base64: dune build] [bigstringaf: dune build] [camlp-streams: dune build] [cppo: dune build] [csexp: dune build]
Processing 85/171: [base64: dune build] [bigstringaf: dune build] [camlp-streams: dune build] [cppo: dune build] [csexp: dune build] [cstruct: dune build]
Processing 86/171: [base64: dune build] [bigstringaf: dune build] [camlp-streams: dune build] [cppo: dune build] [csexp: dune build] [cstruct: dune build] [easy-format: dune build]
Processing 87/171: [base64: dune build] [bigstringaf: dune build] [camlp-streams: dune build] [cppo: dune build] [csexp: dune build] [cstruct: dune build] [easy-format: dune build] [ezxmlm: dune build]
Processing 88/171: [base64: dune build] [bigstringaf: dune build] [camlp-streams: dune build] [cppo: dune build] [csexp: dune build] [cstruct: dune build] [easy-format: dune build] [ezxmlm: dune build] [jane-street-headers: dune build]
Processing 89/171: [base64: dune build] [bigstringaf: dune build] [camlp-streams: dune build] [cppo: dune build] [csexp: dune build] [cstruct: dune build] [easy-format: dune build] [ezxmlm: dune build] [jane-street-headers: dune build] [ocaml-compiler-libs: dune build]
Processing 90/171: [base64: dune build] [bigstringaf: dune build] [camlp-streams: dune build] [cppo: dune build] [csexp: dune build] [cstruct: dune build] [easy-format: dune build] [ezxmlm: dune build] [jane-street-headers: dune build] [ocaml-compiler-libs: dune build] [ocaml-syntax-shims: dune build]
Processing 91/171: [base64: dune build] [bigstringaf: dune build] [camlp-streams: dune build] [cppo: dune build] [csexp: dune build] [cstruct: dune build] [easy-format: dune build] [ezxmlm: dune build] [jane-street-headers: dune build] [ocaml-compiler-libs: dune build] [ocaml-syntax-shims: dune build] [ppx_derivers: dune build]
Processing 92/171: [base64: dune build] [bigstringaf: dune build] [camlp-streams: dune build] [cppo: dune build] [csexp: dune build] [cstruct: dune build] [easy-format: dune build] [ezxmlm: dune build] [jane-street-headers: dune build] [ocaml-compiler-libs: dune build] [ocaml-syntax-shims: dune build] [ppx_derivers: dune build] [re: dune build]
Processing 93/171: [base64: dune build] [bigstringaf: dune build] [camlp-streams: dune build] [cppo: dune build] [csexp: dune build] [cstruct: dune build] [easy-format: dune build] [ezxmlm: dune build] [jane-street-headers: dune build] [ocaml-compiler-libs: dune build] [ocaml-syntax-shims: dune build] [ppx_derivers: dune build] [re: dune build] [result: dune build]
Processing 94/171: [base64: dune build] [bigstringaf: dune build] [camlp-streams: dune build] [cppo: dune build] [csexp: dune build] [cstruct: dune build] [easy-format: dune build] [ezxmlm: dune build] [jane-street-headers: dune build] [ocaml-compiler-libs: dune build] [ocaml-syntax-shims: dune build] [ppx_derivers: dune build] [re: dune build] [result: dune build] [sexplib0: dune build]
Processing 95/171: [base64: dune build] [bigstringaf: dune build] [camlp-streams: dune build] [cppo: dune build] [csexp: dune build] [cstruct: dune build] [easy-format: dune build] [ezxmlm: dune build] [jane-street-headers: dune build] [ocaml-compiler-libs: dune build] [ocaml-syntax-shims: dune build] [ppx_derivers: dune build] [re: dune build] [result: dune build] [sexplib0: dune build] [stdlib-shims: dune build]
Processing 96/171: [base64: dune build] [bigstringaf: dune build] [camlp-streams: dune build] [cppo: dune build] [csexp: dune build] [cstruct: dune build] [easy-format: dune build] [ezxmlm: dune build] [jane-street-headers: dune build] [ocaml-compiler-libs: dune build] [ocaml-syntax-shims: dune build] [ppx_derivers: dune build] [re: dune build] [result: dune build] [sexplib0: dune build] [stdlib-shims: dune build] [stringext: dune build]
+ /home/opam/.opam/opam-init/hooks/sandbox.sh "build" "dune" "build" "-p" "bigstringaf" "-j" "31" (CWD=/home/opam/.opam/5.0+alpha-repo/.opam-switch/build/bigstringaf.0.9.0)
- (cd _build/default/lib/freestanding && /usr/bin/gmake)
- touch libbigstringaf_freestanding_stubs.a
-> compiled  bigstringaf.0.9.0
Processing 96/171: [base64: dune build] [camlp-streams: dune build] [cppo: dune build] [csexp: dune build] [cstruct: dune build] [easy-format: dune build] [ezxmlm: dune build] [jane-street-headers: dune build] [ocaml-compiler-libs: dune build] [ocaml-syntax-shims: dune build] [ppx_derivers: dune build] [re: dune build] [result: dune build] [sexplib0: dune build] [stdlib-shims: dune build] [stringext: dune build]
-> installed bigstringaf.0.9.0
Processing 97/171: [base64: dune build] [camlp-streams: dune build] [cppo: dune build] [csexp: dune build] [cstruct: dune build] [easy-format: dune build] [ezxmlm: dune build] [jane-street-headers: dune build] [ocaml-compiler-libs: dune build] [ocaml-syntax-shims: dune build] [ppx_derivers: dune build] [re: dune build] [result: dune build] [sexplib0: dune build] [stdlib-shims: dune build] [stringext: dune build]
+ /home/opam/.opam/opam-init/hooks/sandbox.sh "build" "dune" "build" "-p" "csexp" "-j" "31" "@install" (CWD=/home/opam/.opam/5.0+alpha-repo/.opam-switch/build/csexp.1.5.1)
-> compiled  csexp.1.5.1
Processing 97/171: [base64: dune build] [camlp-streams: dune build] [cppo: dune build] [cstruct: dune build] [easy-format: dune build] [ezxmlm: dune build] [jane-street-headers: dune build] [ocaml-compiler-libs: dune build] [ocaml-syntax-shims: dune build] [ppx_derivers: dune build] [re: dune build] [result: dune build] [sexplib0: dune build] [stdlib-shims: dune build] [stringext: dune build]
-> installed csexp.1.5.1
Processing 98/171: [base64: dune build] [camlp-streams: dune build] [cppo: dune build] [cstruct: dune build] [easy-format: dune build] [ezxmlm: dune build] [jane-street-headers: dune build] [ocaml-compiler-libs: dune build] [ocaml-syntax-shims: dune build] [ppx_derivers: dune build] [re: dune build] [result: dune build] [sexplib0: dune build] [stdlib-shims: dune build] [stringext: dune build]
Processing 99/171: [base64: dune build] [camlp-streams: dune build] [cppo: dune build] [cstruct: dune build] [dune-configurator: rm] [easy-format: dune build] [ezxmlm: dune build] [jane-street-headers: dune build] [ocaml-compiler-libs: dune build] [ocaml-syntax-shims: dune build] [ppx_derivers: dune build] [re: dune build] [result: dune build] [sexplib0: dune build] [stdlib-shims: dune build] [stringext: dune build]
+ /home/opam/.opam/opam-init/hooks/sandbox.sh "build" "dune" "build" "-p" "base64" "-j" "31" (CWD=/home/opam/.opam/5.0+alpha-repo/.opam-switch/build/base64.3.5.0)
-> compiled  base64.3.5.0
Processing 99/171: [camlp-streams: dune build] [cppo: dune build] [cstruct: dune build] [dune-configurator: rm] [easy-format: dune build] [ezxmlm: dune build] [jane-street-headers: dune build] [ocaml-compiler-libs: dune build] [ocaml-syntax-shims: dune build] [ppx_derivers: dune build] [re: dune build] [result: dune build] [sexplib0: dune build] [stdlib-shims: dune build] [stringext: dune build]
-> installed base64.3.5.0
Processing 100/171: [camlp-streams: dune build] [cppo: dune build] [cstruct: dune build] [dune-configurator: rm] [easy-format: dune build] [ezxmlm: dune build] [jane-street-headers: dune build] [ocaml-compiler-libs: dune build] [ocaml-syntax-shims: dune build] [ppx_derivers: dune build] [re: dune build] [result: dune build] [sexplib0: dune build] [stdlib-shims: dune build] [stringext: dune build]
+ /home/opam/.opam/opam-init/hooks/sandbox.sh "build" "dune" "build" "-p" "camlp-streams" "-j" "31" "@install" (CWD=/home/opam/.opam/5.0+alpha-repo/.opam-switch/build/camlp-streams.5.0.1)
-> compiled  camlp-streams.5.0.1
Processing 100/171: [cppo: dune build] [cstruct: dune build] [dune-configurator: rm] [easy-format: dune build] [ezxmlm: dune build] [jane-street-headers: dune build] [ocaml-compiler-libs: dune build] [ocaml-syntax-shims: dune build] [ppx_derivers: dune build] [re: dune build] [result: dune build] [sexplib0: dune build] [stdlib-shims: dune build] [stringext: dune build]
-> installed camlp-streams.5.0.1
Processing 101/171: [cppo: dune build] [cstruct: dune build] [dune-configurator: rm] [easy-format: dune build] [ezxmlm: dune build] [jane-street-headers: dune build] [ocaml-compiler-libs: dune build] [ocaml-syntax-shims: dune build] [ppx_derivers: dune build] [re: dune build] [result: dune build] [sexplib0: dune build] [stdlib-shims: dune build] [stringext: dune build]
+ /home/opam/.opam/opam-init/hooks/sandbox.sh "build" "dune" "build" "-p" "cstruct" "-j" "31" (CWD=/home/opam/.opam/5.0+alpha-repo/.opam-switch/build/cstruct.6.1.1)
-> compiled  cstruct.6.1.1
Processing 101/171: [cppo: dune build] [dune-configurator: rm] [easy-format: dune build] [ezxmlm: dune build] [jane-street-headers: dune build] [ocaml-compiler-libs: dune build] [ocaml-syntax-shims: dune build] [ppx_derivers: dune build] [re: dune build] [result: dune build] [sexplib0: dune build] [stdlib-shims: dune build] [stringext: dune build]
-> installed cstruct.6.1.1
Processing 102/171: [cppo: dune build] [dune-configurator: rm] [easy-format: dune build] [ezxmlm: dune build] [jane-street-headers: dune build] [ocaml-compiler-libs: dune build] [ocaml-syntax-shims: dune build] [ppx_derivers: dune build] [re: dune build] [result: dune build] [sexplib0: dune build] [stdlib-shims: dune build] [stringext: dune build]
Processing 103/171: [cppo: dune build] [dune-configurator: rm] [easy-format: dune build] [eqaf: dune build] [ezxmlm: dune build] [jane-street-headers: dune build] [ocaml-compiler-libs: dune build] [ocaml-syntax-shims: dune build] [ppx_derivers: dune build] [re: dune build] [result: dune build] [sexplib0: dune build] [stdlib-shims: dune build] [stringext: dune build]
+ /home/opam/.opam/opam-init/hooks/sandbox.sh "build" "dune" "build" "-p" "easy-format" "-j" "31" "@install" (CWD=/home/opam/.opam/5.0+alpha-repo/.opam-switch/build/easy-format.1.3.4)
-> compiled  easy-format.1.3.4
Processing 103/171: [cppo: dune build] [dune-configurator: rm] [eqaf: dune build] [ezxmlm: dune build] [jane-street-headers: dune build] [ocaml-compiler-libs: dune build] [ocaml-syntax-shims: dune build] [ppx_derivers: dune build] [re: dune build] [result: dune build] [sexplib0: dune build] [stdlib-shims: dune build] [stringext: dune build]
-> installed easy-format.1.3.4
Processing 104/171: [cppo: dune build] [dune-configurator: rm] [eqaf: dune build] [ezxmlm: dune build] [jane-street-headers: dune build] [ocaml-compiler-libs: dune build] [ocaml-syntax-shims: dune build] [ppx_derivers: dune build] [re: dune build] [result: dune build] [sexplib0: dune build] [stdlib-shims: dune build] [stringext: dune build]
Processing 105/171: [biniou: dune build] [cppo: dune build] [dune-configurator: rm] [eqaf: dune build] [ezxmlm: dune build] [jane-street-headers: dune build] [ocaml-compiler-libs: dune build] [ocaml-syntax-shims: dune build] [ppx_derivers: dune build] [re: dune build] [result: dune build] [sexplib0: dune build] [stdlib-shims: dune build] [stringext: dune build]
+ /home/opam/.opam/opam-init/hooks/sandbox.sh "build" "dune" "build" "-p" "ezxmlm" "-j" "31" (CWD=/home/opam/.opam/5.0+alpha-repo/.opam-switch/build/ezxmlm.1.1.0)
-> compiled  ezxmlm.1.1.0
Processing 105/171: [biniou: dune build] [cppo: dune build] [dune-configurator: rm] [eqaf: dune build] [jane-street-headers: dune build] [ocaml-compiler-libs: dune build] [ocaml-syntax-shims: dune build] [ppx_derivers: dune build] [re: dune build] [result: dune build] [sexplib0: dune build] [stdlib-shims: dune build] [stringext: dune build]
-> installed ezxmlm.1.1.0
Processing 106/171: [biniou: dune build] [cppo: dune build] [dune-configurator: rm] [eqaf: dune build] [jane-street-headers: dune build] [ocaml-compiler-libs: dune build] [ocaml-syntax-shims: dune build] [ppx_derivers: dune build] [re: dune build] [result: dune build] [sexplib0: dune build] [stdlib-shims: dune build] [stringext: dune build]
+ /home/opam/.opam/opam-init/hooks/sandbox.sh "build" "dune" "build" "-p" "jane-street-headers" "-j" "31" (CWD=/home/opam/.opam/5.0+alpha-repo/.opam-switch/build/jane-street-headers.v0.15.0)
-> compiled  jane-street-headers.v0.15.0
Processing 106/171: [biniou: dune build] [cppo: dune build] [dune-configurator: rm] [eqaf: dune build] [ocaml-compiler-libs: dune build] [ocaml-syntax-shims: dune build] [ppx_derivers: dune build] [re: dune build] [result: dune build] [sexplib0: dune build] [stdlib-shims: dune build] [stringext: dune build]
-> installed jane-street-headers.v0.15.0
Processing 107/171: [biniou: dune build] [cppo: dune build] [dune-configurator: rm] [eqaf: dune build] [ocaml-compiler-libs: dune build] [ocaml-syntax-shims: dune build] [ppx_derivers: dune build] [re: dune build] [result: dune build] [sexplib0: dune build] [stdlib-shims: dune build] [stringext: dune build]
+ /home/opam/.opam/opam-init/hooks/sandbox.sh "build" "dune" "build" "-p" "ppx_derivers" "-j" "31" (CWD=/home/opam/.opam/5.0+alpha-repo/.opam-switch/build/ppx_derivers.1.2.1)
-> compiled  ppx_derivers.1.2.1
Processing 107/171: [biniou: dune build] [cppo: dune build] [dune-configurator: rm] [eqaf: dune build] [ocaml-compiler-libs: dune build] [ocaml-syntax-shims: dune build] [re: dune build] [result: dune build] [sexplib0: dune build] [stdlib-shims: dune build] [stringext: dune build]
-> installed ppx_derivers.1.2.1
Processing 108/171: [biniou: dune build] [cppo: dune build] [dune-configurator: rm] [eqaf: dune build] [ocaml-compiler-libs: dune build] [ocaml-syntax-shims: dune build] [re: dune build] [result: dune build] [sexplib0: dune build] [stdlib-shims: dune build] [stringext: dune build]
+ /home/opam/.opam/opam-init/hooks/sandbox.sh "build" "dune" "build" "-p" "result" "-j" "31" (CWD=/home/opam/.opam/5.0+alpha-repo/.opam-switch/build/result.1.5)
-> compiled  result.1.5
Processing 108/171: [biniou: dune build] [cppo: dune build] [dune-configurator: rm] [eqaf: dune build] [ocaml-compiler-libs: dune build] [ocaml-syntax-shims: dune build] [re: dune build] [sexplib0: dune build] [stdlib-shims: dune build] [stringext: dune build]
-> installed result.1.5
Processing 109/171: [biniou: dune build] [cppo: dune build] [dune-configurator: rm] [eqaf: dune build] [ocaml-compiler-libs: dune build] [ocaml-syntax-shims: dune build] [re: dune build] [sexplib0: dune build] [stdlib-shims: dune build] [stringext: dune build]
+ /home/opam/.opam/opam-init/hooks/sandbox.sh "build" "dune" "build" "-p" "sexplib0" "-j" "31" (CWD=/home/opam/.opam/5.0+alpha-repo/.opam-switch/build/sexplib0.v0.15.1)
-> compiled  sexplib0.v0.15.1
Processing 109/171: [biniou: dune build] [cppo: dune build] [dune-configurator: rm] [eqaf: dune build] [ocaml-compiler-libs: dune build] [ocaml-syntax-shims: dune build] [re: dune build] [stdlib-shims: dune build] [stringext: dune build]
-> installed sexplib0.v0.15.1
Processing 110/171: [biniou: dune build] [cppo: dune build] [dune-configurator: rm] [eqaf: dune build] [ocaml-compiler-libs: dune build] [ocaml-syntax-shims: dune build] [re: dune build] [stdlib-shims: dune build] [stringext: dune build]
+ /home/opam/.opam/opam-init/hooks/sandbox.sh "build" "dune" "build" "-p" "stdlib-shims" "-j" "31" (CWD=/home/opam/.opam/5.0+alpha-repo/.opam-switch/build/stdlib-shims.0.3.0)
-> compiled  stdlib-shims.0.3.0
Processing 110/171: [biniou: dune build] [cppo: dune build] [dune-configurator: rm] [eqaf: dune build] [ocaml-compiler-libs: dune build] [ocaml-syntax-shims: dune build] [re: dune build] [stringext: dune build]
-> installed stdlib-shims.0.3.0
Processing 111/171: [biniou: dune build] [cppo: dune build] [dune-configurator: rm] [eqaf: dune build] [ocaml-compiler-libs: dune build] [ocaml-syntax-shims: dune build] [re: dune build] [stringext: dune build]
+ /home/opam/.opam/opam-init/hooks/sandbox.sh "build" "dune" "build" "-p" "stringext" "-j" "31" (CWD=/home/opam/.opam/5.0+alpha-repo/.opam-switch/build/stringext.1.6.0)
-> compiled  stringext.1.6.0
Processing 111/171: [biniou: dune build] [cppo: dune build] [dune-configurator: rm] [eqaf: dune build] [ocaml-compiler-libs: dune build] [ocaml-syntax-shims: dune build] [re: dune build]
-> installed stringext.1.6.0
Processing 112/171: [biniou: dune build] [cppo: dune build] [dune-configurator: rm] [eqaf: dune build] [ocaml-compiler-libs: dune build] [ocaml-syntax-shims: dune build] [re: dune build]
+ /home/opam/.opam/opam-init/hooks/sandbox.sh "build" "rm" "-rf" "vendor/csexp" (CWD=/home/opam/.opam/5.0+alpha-repo/.opam-switch/build/dune-configurator.3.5.0)
+ /home/opam/.opam/opam-init/hooks/sandbox.sh "build" "dune" "build" "-p" "cppo" "-j" "31" (CWD=/home/opam/.opam/5.0+alpha-repo/.opam-switch/build/cppo.1.6.9)
-> compiled  cppo.1.6.9
Processing 112/171: [biniou: dune build] [dune-configurator: rm] [eqaf: dune build] [ocaml-compiler-libs: dune build] [ocaml-syntax-shims: dune build] [re: dune build]
-> installed cppo.1.6.9
Processing 113/171: [biniou: dune build] [dune-configurator: rm] [eqaf: dune build] [ocaml-compiler-libs: dune build] [ocaml-syntax-shims: dune build] [re: dune build]
+ /home/opam/.opam/opam-init/hooks/sandbox.sh "build" "rm" "-rf" "vendor/pp" (CWD=/home/opam/.opam/5.0+alpha-repo/.opam-switch/build/dune-configurator.3.5.0)
Processing 113/171: [biniou: dune build] [dune-configurator: dune build] [eqaf: dune build] [ocaml-compiler-libs: dune build] [ocaml-syntax-shims: dune build] [re: dune build]
+ /home/opam/.opam/opam-init/hooks/sandbox.sh "build" "dune" "build" "-p" "ocaml-syntax-shims" "-j" "31" "@install" (CWD=/home/opam/.opam/5.0+alpha-repo/.opam-switch/build/ocaml-syntax-shims.1.0.0)
- (cd _build/default/src && /home/opam/.opam/5.0+alpha-repo/bin/ocaml select-impl 5.0.0+dev8-2022-10-12) > _build/default/src/impl
- File "_none_", line 1:
- Alert ocaml_deprecated_cli: 
- Running ocaml where the first argument is an implicit basename with no
- extension (e.g. ocaml script-file) is deprecated. Either rename the script
- (ocaml script-file.ml) or qualify the basename (ocaml ./script-file)
-> compiled  ocaml-syntax-shims.1.0.0
Processing 113/171: [biniou: dune build] [dune-configurator: dune build] [eqaf: dune build] [ocaml-compiler-libs: dune build] [re: dune build]
-> installed ocaml-syntax-shims.1.0.0
Processing 114/171: [biniou: dune build] [dune-configurator: dune build] [eqaf: dune build] [ocaml-compiler-libs: dune build] [re: dune build]
Processing 115/171: [angstrom: dune build] [biniou: dune build] [dune-configurator: dune build] [eqaf: dune build] [ocaml-compiler-libs: dune build] [re: dune build]
+ /home/opam/.opam/opam-init/hooks/sandbox.sh "build" "dune" "build" "-p" "ocaml-compiler-libs" "-j" "31" "@install" (CWD=/home/opam/.opam/5.0+alpha-repo/.opam-switch/build/ocaml-compiler-libs.v0.12.4)
-> compiled  ocaml-compiler-libs.v0.12.4
Processing 115/171: [angstrom: dune build] [biniou: dune build] [dune-configurator: dune build] [eqaf: dune build] [re: dune build]
-> installed ocaml-compiler-libs.v0.12.4
Processing 116/171: [angstrom: dune build] [biniou: dune build] [dune-configurator: dune build] [eqaf: dune build] [re: dune build]
Processing 117/171: [angstrom: dune build] [biniou: dune build] [dune-configurator: dune build] [eqaf: dune build] [ppxlib: dune build] [re: dune build]
+ /home/opam/.opam/opam-init/hooks/sandbox.sh "build" "dune" "build" "-p" "re" "-j" "31" (CWD=/home/opam/.opam/5.0+alpha-repo/.opam-switch/build/re.1.10.4)
-> compiled  re.1.10.4
Processing 117/171: [angstrom: dune build] [biniou: dune build] [dune-configurator: dune build] [eqaf: dune build] [ppxlib: dune build]
-> installed re.1.10.4
Processing 118/171: [angstrom: dune build] [biniou: dune build] [dune-configurator: dune build] [eqaf: dune build] [ppxlib: dune build]
+ /home/opam/.opam/opam-init/hooks/sandbox.sh "build" "dune" "build" "-p" "eqaf" "-j" "31" (CWD=/home/opam/.opam/5.0+alpha-repo/.opam-switch/build/eqaf.0.9)
-> compiled  eqaf.0.9
Processing 118/171: [angstrom: dune build] [biniou: dune build] [dune-configurator: dune build] [ppxlib: dune build]
-> installed eqaf.0.9
Processing 119/171: [angstrom: dune build] [biniou: dune build] [dune-configurator: dune build] [ppxlib: dune build]
Processing 120/171: [angstrom: dune build] [biniou: dune build] [digestif: dune build] [dune-configurator: dune build] [ppxlib: dune build]
+ /home/opam/.opam/opam-init/hooks/sandbox.sh "build" "dune" "build" "-p" "angstrom" "-j" "31" (CWD=/home/opam/.opam/5.0+alpha-repo/.opam-switch/build/angstrom.0.15.0)
-> compiled  angstrom.0.15.0
Processing 120/171: [biniou: dune build] [digestif: dune build] [dune-configurator: dune build] [ppxlib: dune build]
-> installed angstrom.0.15.0
Processing 121/171: [biniou: dune build] [digestif: dune build] [dune-configurator: dune build] [ppxlib: dune build]
Processing 122/171: [biniou: dune build] [digestif: dune build] [dune-configurator: dune build] [ppxlib: dune build] [uri: dune build]
+ /home/opam/.opam/opam-init/hooks/sandbox.sh "build" "dune" "build" "-p" "biniou" "-j" "31" (CWD=/home/opam/.opam/5.0+alpha-repo/.opam-switch/build/biniou.1.2.2)
-> compiled  biniou.1.2.2
Processing 122/171: [digestif: dune build] [dune-configurator: dune build] [ppxlib: dune build] [uri: dune build]
-> installed biniou.1.2.2
Processing 123/171: [digestif: dune build] [dune-configurator: dune build] [ppxlib: dune build] [uri: dune build]
Processing 124/171: [digestif: dune build] [dune-configurator: dune build] [ppxlib: dune build] [uri: dune build] [yojson: dune build]
+ /home/opam/.opam/opam-init/hooks/sandbox.sh "build" "dune" "build" "-p" "dune-configurator" "-j" "31" "@install" (CWD=/home/opam/.opam/5.0+alpha-repo/.opam-switch/build/dune-configurator.3.5.0)
-> compiled  dune-configurator.3.5.0
Processing 124/171: [digestif: dune build] [ppxlib: dune build] [uri: dune build] [yojson: dune build]
-> installed dune-configurator.3.5.0
Processing 125/171: [digestif: dune build] [ppxlib: dune build] [uri: dune build] [yojson: dune build]
Processing 126/171: [base: dune build] [digestif: dune build] [ppxlib: dune build] [uri: dune build] [yojson: dune build]
Processing 127/171: [base: dune build] [digestif: dune build] [pcre: dune build] [ppxlib: dune build] [uri: dune build] [yojson: dune build]
+ /home/opam/.opam/opam-init/hooks/sandbox.sh "build" "dune" "build" "-p" "digestif" "-j" "31" (CWD=/home/opam/.opam/5.0+alpha-repo/.opam-switch/build/digestif.1.1.3)
-> compiled  digestif.1.1.3
Processing 127/171: [base: dune build] [pcre: dune build] [ppxlib: dune build] [uri: dune build] [yojson: dune build]
-> installed digestif.1.1.3
Processing 128/171: [base: dune build] [pcre: dune build] [ppxlib: dune build] [uri: dune build] [yojson: dune build]
+ /home/opam/.opam/opam-init/hooks/sandbox.sh "build" "dune" "build" "-p" "uri" "-j" "31" (CWD=/home/opam/.opam/5.0+alpha-repo/.opam-switch/build/uri.4.2.0)
-> compiled  uri.4.2.0
Processing 128/171: [base: dune build] [pcre: dune build] [ppxlib: dune build] [yojson: dune build]
-> installed uri.4.2.0
Processing 129/171: [base: dune build] [pcre: dune build] [ppxlib: dune build] [yojson: dune build]
+ /home/opam/.opam/opam-init/hooks/sandbox.sh "build" "dune" "build" "-p" "pcre" "-j" "31" "@install" (CWD=/home/opam/.opam/5.0+alpha-repo/.opam-switch/build/pcre.7.5.0)
- (cd _build/default/src && /usr/bin/gcc -O2 -fno-strict-aliasing -fwrapv -pthread -fPIC -D_FILE_OFFSET_BITS=64 -O2 -fno-strict-aliasing -fwrapv -pthread -fPIC -O2 -fPIC -DPIC -g -I /home/opam/.opam/5.0+alpha-repo/lib/ocaml -o pcre_stubs.o -c pcre_stubs.c)
- pcre_stubs.c: In function 'pcre_callout_handler':
- pcre_stubs.c:158:29: warning: initialization discards 'volatile' qualifier from pointer target type [-Wdiscarded-qualifiers]
-   158 |     caml_int_ptr ovec_dst = &Field(Field(v_substrings, 1), 0) + subgroups2_1;
-       |                             ^
-> compiled  pcre.7.5.0
Processing 129/171: [base: dune build] [ppxlib: dune build] [yojson: dune build]
-> installed pcre.7.5.0
Processing 130/171: [base: dune build] [ppxlib: dune build] [yojson: dune build]
[ocaml-inifiles: patch] applying ocaml-inifiles.diff
Processing 131/171: [base: dune build] [ocaml-inifiles: patch] [ppxlib: dune build] [yojson: dune build]
Processing 131/171: [base: dune build] [ocaml-inifiles: make all] [ppxlib: dune build] [yojson: dune build]
+ /home/opam/.opam/opam-init/hooks/sandbox.sh "build" "dune" "build" "-p" "yojson" "-j" "31" (CWD=/home/opam/.opam/5.0+alpha-repo/.opam-switch/build/yojson.1.7.0)
-> compiled  yojson.1.7.0
Processing 131/171: [base: dune build] [ocaml-inifiles: make all] [ppxlib: dune build]
-> installed yojson.1.7.0
Processing 132/171: [base: dune build] [ocaml-inifiles: make all] [ppxlib: dune build]
+ /home/opam/.opam/opam-init/hooks/sandbox.sh "build" "make" "all" (CWD=/home/opam/.opam/5.0+alpha-repo/.opam-switch/build/ocaml-inifiles.1.2)
- ocamllex inilexer.mll
- 27 states, 1999 transitions, table size 8158 bytes
- 7979 additional bytes used for bindings
- ocamlyacc  parseini.mly
- make[1]: Entering directory '/home/opam/.opam/5.0+alpha-repo/.opam-switch/build/ocaml-inifiles.1.2'
- making ._bcdi/parseini.di from parseini.mli
- making ._bcdi/inifiles.di from inifiles.mli
- making ._d/parseini.d from parseini.ml
- making ._d/inilexer.d from inilexer.ml
- making ._d/inifiles.d from inifiles.ml
- ocamlfind ocamlc -package pcre -c -g parseini.mli
- ocamlfind ocamlc -package pcre -c -g parseini.ml
- ocamlfind ocamlc -package pcre -c -g inilexer.ml
- ocamlfind ocamlc -package pcre -c -g inifiles.mli
- ocamlfind ocamlc -package pcre -c -g inifiles.ml
- File "inifiles.ml", line 53, characters 20-36:
- 53 |     String.compare (String.lowercase x) (String.lowercase y)
-                          ^^^^^^^^^^^^^^^^
- Error: Unbound value String.lowercase
- make[1]: *** [OCamlMakefile:935: inifiles.cmo] Error 2
- make[1]: Leaving directory '/home/opam/.opam/5.0+alpha-repo/.opam-switch/build/ocaml-inifiles.1.2'
- make: *** [OCamlMakefile:753: debug-code-library] Error 2
[ERROR] The compilation of ocaml-inifiles.1.2 failed at "make all".
Processing 132/171: [base: dune build] [ppxlib: dune build]
Processing 133/171: [base: dune build] [ppxlib: dune build]
+ /home/opam/.opam/opam-init/hooks/sandbox.sh "build" "dune" "build" "-p" "base" "-j" "31" (CWD=/home/opam/.opam/5.0+alpha-repo/.opam-switch/build/base.v0.15.1)
-> compiled  base.v0.15.1
Processing 133/171: [ppxlib: dune build]
-> installed base.v0.15.1
Processing 134/171: [ppxlib: dune build]
Processing 135/171: [ppxlib: dune build] [stdio: dune build]
+ /home/opam/.opam/opam-init/hooks/sandbox.sh "build" "dune" "build" "-p" "stdio" "-j" "31" (CWD=/home/opam/.opam/5.0+alpha-repo/.opam-switch/build/stdio.v0.15.0)
-> compiled  stdio.v0.15.0
Processing 135/171: [ppxlib: dune build]
-> installed stdio.v0.15.0
Processing 136/171: [ppxlib: dune build]
+ /home/opam/.opam/opam-init/hooks/sandbox.sh "build" "dune" "build" "-p" "ppxlib" "-j" "31" "@install" (CWD=/home/opam/.opam/5.0+alpha-repo/.opam-switch/build/ppxlib.0.28.0)
-> compiled  ppxlib.0.28.0
-> installed ppxlib.0.28.0
Processing 138/171: [ppx_cold: dune build]
Processing 139/171: [ppx_cold: dune build] [ppx_compare: dune build]
Processing 140/171: [ppx_cold: dune build] [ppx_compare: dune build] [ppx_enumerate: dune build]
Processing 141/171: [ppx_cold: dune build] [ppx_compare: dune build] [ppx_enumerate: dune build] [ppx_here: dune build]
Processing 142/171: [ppx_cold: dune build] [ppx_compare: dune build] [ppx_enumerate: dune build] [ppx_here: dune build] [ppx_optcomp: dune build]
Processing 143/171: [ppx_cold: dune build] [ppx_compare: dune build] [ppx_enumerate: dune build] [ppx_here: dune build] [ppx_optcomp: dune build] [ppx_protocol_conv: dune build]
Processing 144/171: [ppx_cold: dune build] [ppx_compare: dune build] [ppx_enumerate: dune build] [ppx_here: dune build] [ppx_optcomp: dune build] [ppx_protocol_conv: dune build] [ppx_sexp_conv: dune build]
+ /home/opam/.opam/opam-init/hooks/sandbox.sh "build" "dune" "build" "-p" "ppx_here" "-j" "31" (CWD=/home/opam/.opam/5.0+alpha-repo/.opam-switch/build/ppx_here.v0.15.0)
-> compiled  ppx_here.v0.15.0
Processing 144/171: [ppx_cold: dune build] [ppx_compare: dune build] [ppx_enumerate: dune build] [ppx_optcomp: dune build] [ppx_protocol_conv: dune build] [ppx_sexp_conv: dune build]
-> installed ppx_here.v0.15.0
Processing 145/171: [ppx_cold: dune build] [ppx_compare: dune build] [ppx_enumerate: dune build] [ppx_optcomp: dune build] [ppx_protocol_conv: dune build] [ppx_sexp_conv: dune build]
+ /home/opam/.opam/opam-init/hooks/sandbox.sh "build" "dune" "build" "-p" "ppx_optcomp" "-j" "31" (CWD=/home/opam/.opam/5.0+alpha-repo/.opam-switch/build/ppx_optcomp.v0.15.0)
-> compiled  ppx_optcomp.v0.15.0
Processing 145/171: [ppx_cold: dune build] [ppx_compare: dune build] [ppx_enumerate: dune build] [ppx_protocol_conv: dune build] [ppx_sexp_conv: dune build]
-> installed ppx_optcomp.v0.15.0
Processing 146/171: [ppx_cold: dune build] [ppx_compare: dune build] [ppx_enumerate: dune build] [ppx_protocol_conv: dune build] [ppx_sexp_conv: dune build]
+ /home/opam/.opam/opam-init/hooks/sandbox.sh "build" "dune" "build" "-p" "ppx_cold" "-j" "31" (CWD=/home/opam/.opam/5.0+alpha-repo/.opam-switch/build/ppx_cold.v0.15.0)
-> compiled  ppx_cold.v0.15.0
Processing 146/171: [ppx_compare: dune build] [ppx_enumerate: dune build] [ppx_protocol_conv: dune build] [ppx_sexp_conv: dune build]
-> installed ppx_cold.v0.15.0
Processing 147/171: [ppx_compare: dune build] [ppx_enumerate: dune build] [ppx_protocol_conv: dune build] [ppx_sexp_conv: dune build]
+ /home/opam/.opam/opam-init/hooks/sandbox.sh "build" "dune" "build" "-p" "ppx_compare" "-j" "31" (CWD=/home/opam/.opam/5.0+alpha-repo/.opam-switch/build/ppx_compare.v0.15.0)
-> compiled  ppx_compare.v0.15.0
Processing 147/171: [ppx_enumerate: dune build] [ppx_protocol_conv: dune build] [ppx_sexp_conv: dune build]
-> installed ppx_compare.v0.15.0
Processing 148/171: [ppx_enumerate: dune build] [ppx_protocol_conv: dune build] [ppx_sexp_conv: dune build]
+ /home/opam/.opam/opam-init/hooks/sandbox.sh "build" "dune" "build" "-p" "ppx_protocol_conv" "-j" "31" (CWD=/home/opam/.opam/5.0+alpha-repo/.opam-switch/build/ppx_protocol_conv.5.2.0)
-> compiled  ppx_protocol_conv.5.2.0
Processing 148/171: [ppx_enumerate: dune build] [ppx_sexp_conv: dune build]
-> installed ppx_protocol_conv.5.2.0
Processing 149/171: [ppx_enumerate: dune build] [ppx_sexp_conv: dune build]
Processing 150/171: [ppx_enumerate: dune build] [ppx_protocol_conv_xmlm: dune build] [ppx_sexp_conv: dune build]
+ /home/opam/.opam/opam-init/hooks/sandbox.sh "build" "dune" "build" "-p" "ppx_enumerate" "-j" "31" (CWD=/home/opam/.opam/5.0+alpha-repo/.opam-switch/build/ppx_enumerate.v0.15.0)
-> compiled  ppx_enumerate.v0.15.0
Processing 150/171: [ppx_protocol_conv_xmlm: dune build] [ppx_sexp_conv: dune build]
-> installed ppx_enumerate.v0.15.0
Processing 151/171: [ppx_protocol_conv_xmlm: dune build] [ppx_sexp_conv: dune build]
+ /home/opam/.opam/opam-init/hooks/sandbox.sh "build" "dune" "build" "-p" "ppx_protocol_conv_xmlm" "-j" "31" (CWD=/home/opam/.opam/5.0+alpha-repo/.opam-switch/build/ppx_protocol_conv_xmlm.5.2.0)
-> compiled  ppx_protocol_conv_xmlm.5.2.0
Processing 151/171: [ppx_sexp_conv: dune build]
-> installed ppx_protocol_conv_xmlm.5.2.0
Processing 152/171: [ppx_sexp_conv: dune build]
+ /home/opam/.opam/opam-init/hooks/sandbox.sh "build" "dune" "build" "-p" "ppx_sexp_conv" "-j" "31" (CWD=/home/opam/.opam/5.0+alpha-repo/.opam-switch/build/ppx_sexp_conv.v0.15.1)
-> compiled  ppx_sexp_conv.v0.15.1
-> installed ppx_sexp_conv.v0.15.1
Processing 154/171: [ppx_assert: dune build]
Processing 155/171: [ppx_assert: dune build] [ppx_hash: dune build]
+ /home/opam/.opam/opam-init/hooks/sandbox.sh "build" "dune" "build" "-p" "ppx_hash" "-j" "31" (CWD=/home/opam/.opam/5.0+alpha-repo/.opam-switch/build/ppx_hash.v0.15.0)
-> compiled  ppx_hash.v0.15.0
Processing 155/171: [ppx_assert: dune build]
-> installed ppx_hash.v0.15.0
Processing 156/171: [ppx_assert: dune build]
Processing 157/171: [ppx_assert: dune build] [ppx_base: dune build]
+ /home/opam/.opam/opam-init/hooks/sandbox.sh "build" "dune" "build" "-p" "ppx_assert" "-j" "31" (CWD=/home/opam/.opam/5.0+alpha-repo/.opam-switch/build/ppx_assert.v0.15.0)
-> compiled  ppx_assert.v0.15.0
Processing 157/171: [ppx_base: dune build]
-> installed ppx_assert.v0.15.0
Processing 158/171: [ppx_base: dune build]
Processing 159/171: [jst-config: dune build] [ppx_base: dune build]
+ /home/opam/.opam/opam-init/hooks/sandbox.sh "build" "dune" "build" "-p" "ppx_base" "-j" "31" (CWD=/home/opam/.opam/5.0+alpha-repo/.opam-switch/build/ppx_base.v0.15.0)
-> compiled  ppx_base.v0.15.0
Processing 159/171: [jst-config: dune build]
-> installed ppx_base.v0.15.0
Processing 160/171: [jst-config: dune build]
+ /home/opam/.opam/opam-init/hooks/sandbox.sh "build" "dune" "build" "-p" "jst-config" "-j" "31" (CWD=/home/opam/.opam/5.0+alpha-repo/.opam-switch/build/jst-config.v0.15.1)
-> compiled  jst-config.v0.15.1
-> installed jst-config.v0.15.1
Processing 162/171: [time_now: dune build]
+ /home/opam/.opam/opam-init/hooks/sandbox.sh "build" "dune" "build" "-p" "time_now" "-j" "31" (CWD=/home/opam/.opam/5.0+alpha-repo/.opam-switch/build/time_now.v0.15.0)
-> compiled  time_now.v0.15.0
-> installed time_now.v0.15.0
Processing 164/171: [ppx_inline_test: dune build]
+ /home/opam/.opam/opam-init/hooks/sandbox.sh "build" "dune" "build" "-p" "ppx_inline_test" "-j" "31" (CWD=/home/opam/.opam/5.0+alpha-repo/.opam-switch/build/ppx_inline_test.v0.15.0)
-> compiled  ppx_inline_test.v0.15.0
-> installed ppx_inline_test.v0.15.0
Processing 166/171: [ppx_expect: dune build]
+ /home/opam/.opam/opam-init/hooks/sandbox.sh "build" "dune" "build" "-p" "ppx_expect" "-j" "31" (CWD=/home/opam/.opam/5.0+alpha-repo/.opam-switch/build/ppx_expect.v0.15.1)
-> compiled  ppx_expect.v0.15.1
-> installed ppx_expect.v0.15.1
Processing 168/171: [ppx_protocol_conv_json: dune build]
+ /home/opam/.opam/opam-init/hooks/sandbox.sh "build" "dune" "build" "-p" "ppx_protocol_conv_json" "-j" "31" (CWD=/home/opam/.opam/5.0+alpha-repo/.opam-switch/build/ppx_protocol_conv_json.5.2.0)
-> compiled  ppx_protocol_conv_json.5.2.0
-> installed ppx_protocol_conv_json.5.2.0

#=== ERROR while compiling ocaml-inifiles.1.2 =================================#
# context              2.2.0~alpha~dev | linux/x86_64 | ocaml-variants.5.0.0+trunk | file:///home/opam/opam-repository
# path                 ~/.opam/5.0+alpha-repo/.opam-switch/build/ocaml-inifiles.1.2
# command              ~/.opam/opam-init/hooks/sandbox.sh build make all
# exit-code            2
# env-file             ~/.opam/log/ocaml-inifiles-8-b959bc.env
# output-file          ~/.opam/log/ocaml-inifiles-8-b959bc.out
### output ###
# ocamllex inilexer.mll
# 27 states, 1999 transitions, table size 8158 bytes
# 7979 additional bytes used for bindings
# ocamlyacc  parseini.mly
# make[1]: Entering directory '/home/opam/.opam/5.0+alpha-repo/.opam-switch/build/ocaml-inifiles.1.2'
# making ._bcdi/parseini.di from parseini.mli
# making ._bcdi/inifiles.di from inifiles.mli
# making ._d/parseini.d from parseini.ml
# making ._d/inilexer.d from inilexer.ml
# making ._d/inifiles.d from inifiles.ml
# ocamlfind ocamlc -package pcre -c -g parseini.mli
# ocamlfind ocamlc -package pcre -c -g parseini.ml
# ocamlfind ocamlc -package pcre -c -g inilexer.ml
# ocamlfind ocamlc -package pcre -c -g inifiles.mli
# ocamlfind ocamlc -package pcre -c -g inifiles.ml
# File "inifiles.ml", line 53, characters 20-36:
# 53 |     String.compare (String.lowercase x) (String.lowercase y)
#                          ^^^^^^^^^^^^^^^^
# Error: Unbound value String.lowercase
# make[1]: *** [OCamlMakefile:935: inifiles.cmo] Error 2
# make[1]: Leaving directory '/home/opam/.opam/5.0+alpha-repo/.opam-switch/build/ocaml-inifiles.1.2'
# make: *** [OCamlMakefile:753: debug-code-library] Error 2



<><> Error report <><><><><><><><><><><><><><><><><><><><><><><><><><><><><><><>
+- The following actions were aborted
| - install aws-s3 4.8.0
+- 
+- The following actions failed
| - build ocaml-inifiles 1.2
+- 
+- The following changes have been performed (the rest was aborted)
| - install angstrom               0.15.0
| - install base                   v0.15.1
| - install base-bytes             base
| - install base64                 3.5.0
| - install bigstringaf            0.9.0
| - install biniou                 1.2.2
| - install camlp-streams          5.0.1
| - install cmdliner               1.1.1
| - install conf-libpcre           1
| - install conf-pkg-config        2
| - install cppo                   1.6.9
| - install csexp                  1.5.1
| - install cstruct                6.1.1
| - install digestif               1.1.3
| - install dune                   3.5.0
| - install dune-configurator      3.5.0
| - install easy-format            1.3.4
| - install eqaf                   0.9
| - install ezxmlm                 1.1.0
| - install fmt                    0.9.0
| - install jane-street-headers    v0.15.0
| - install jst-config             v0.15.1
| - install ocaml-compiler-libs    v0.12.4
| - install ocaml-syntax-shims     1.0.0
| - install ocamlbuild             0.14.2
| - install ocamlfind              1.9.5
| - install pcre                   7.5.0
| - install ppx_assert             v0.15.0
| - install ppx_base               v0.15.0
| - install ppx_cold               v0.15.0
| - install ppx_compare            v0.15.0
| - install ppx_derivers           1.2.1
| - install ppx_enumerate          v0.15.0
| - install ppx_expect             v0.15.1
| - install ppx_hash               v0.15.0
| - install ppx_here               v0.15.0
| - install ppx_inline_test        v0.15.0
| - install ppx_optcomp            v0.15.0
| - install ppx_protocol_conv      5.2.0
| - install ppx_protocol_conv_json 5.2.0
| - install ppx_protocol_conv_xmlm 5.2.0
| - install ppx_sexp_conv          v0.15.1
| - install ppxlib                 0.28.0
| - install ptime                  1.0.0
| - install re                     1.10.4
| - install result                 1.5
| - install seq                    base
| - install sexplib0               v0.15.1
| - install stdio                  v0.15.0
| - install stdlib-shims           0.3.0
| - install stringext              1.6.0
| - install time_now               v0.15.0
| - install topkg                  1.0.6
| - install uri                    4.2.0
| - install xmlm                   1.4.0
| - install yojson                 1.7.0
+- 
# Run eval $(opam env) to update the current shell environment

The former state can be restored with:
    /usr/bin/opam switch import "/home/opam/.opam/5.0+alpha-repo/.opam-switch/backup/state-20221115091013.export"
'opam install -vy aws-s3.4.8.0' failed.
"/bin/bash" "-c"
"
opam remove -y "aws-s3.4.8.0"
opam install -vy "aws-s3.4.8.0"
res=$?
if [ $res = 31 ]; then
    if opam show -f x-ci-accept-failures: "aws-s3.4.8.0" | grep -q '"debian-unstable"'; then
        echo "This package failed and has been disabled for CI using the 'x-ci-accept-failures' field."
        exit 69
    fi
fi


exit $res
" failed with exit status 31
Failed: Build failed