OCamllabs icon Home|Differences with the last checks|Previous runs


Building on c2-4.ocamllabs.io

(from ocaml/opam:debian-unstable@sha256:5d9d58dd88e8e3a7a3c180578c753118efcfd5a451781452c6731c99fc9e27dd)
2022-11-15 08:55.01 ---> using "32efe2878d8713cc073fbcba05b477fab5020dac81ac1f841ea37ae67b4d70a6" from cache

/: (user (uid 1000) (gid 1000))

/: (env OPAMPRECISETRACKING 1)

/: (env OPAMUTF8 never)

/: (env OPAMEXTERNALSOLVER builtin-0install)

/: (env OPAMCRITERIA +removed)

/: (run (shell "sudo ln -f /usr/bin/opam-dev /usr/bin/opam"))
2022-11-15 08:55.01 ---> using "c06b21e9e23147ff65065b0caeb2932b761f6e4408d2fb429e6eafaede540fdc" from cache

/: (run (network host)
        (shell "rm -rf ~/opam-repository && git clone -q 'https://github.com/ocaml/opam-repository' ~/opam-repository && git -C ~/opam-repository checkout -q 88d0c6b952c255f868635fbb4c8bc650f1fa4fd8"))
2022-11-15 08:55.01 ---> using "f5ff03689bfa4493e0d56b41d99787e727484001ba6ca3d348cc9bb14b0a105c" from cache

/: (run (shell "rm -rf ~/.opam && opam init -ya --bare --config ~/.opamrc-sandbox ~/opam-repository"))
Configuring from /home/opam/.opamrc-sandbox, then /home/opam/.opamrc, and finally from built-in defaults.
Checking for available remotes: rsync and local, git.
  - you won't be able to use mercurial repositories unless you install the hg command on your system.
  - you won't be able to use darcs repositories unless you install the darcs command on your system.


<><> Fetching repository information ><><><><><><><><><><><><><><><><><><><><><>
[default] Initialised

User configuration:
  ~/.profile is already up-to-date.
[NOTE] Make sure that ~/.profile is well sourced in your ~/.bashrc.

2022-11-15 08:55.01 ---> using "c8ce34507d61810fd57bc948c6ee6daad97dafa9d9e05febabf80edf14a81a6c" from cache

/: (run (network host)
        (shell "git clone -q 'https://github.com/kit-ty-kate/opam-alpha-repository' ~/'alpha' && git -C ~/'alpha' checkout -q 0a81964b3d1e27a6aaf699e3a2153059b77435e2"))
2022-11-15 08:55.01 ---> using "42a878a316e3a0bdfc012c44a01fbdae39c9a8a1709ec3f4b13e9594f6c04d0b" from cache

/: (run (shell "opam repository add --dont-select 'alpha' ~/'alpha'"))
[alpha] Initialised
2022-11-15 08:55.01 ---> using "218e9a1d188e4b1d99339b688cdbf348f059cdef81a58d331d526ae6b37a3ac2" from cache

/: (run (cache (opam-archives (target /home/opam/.opam/download-cache)))
        (network host)
        (shell "opam switch create --repositories=alpha,default '5.0+alpha-repo' '5.0.0+trunk'"))

<><> Installing new switch packages <><><><><><><><><><><><><><><><><><><><><><>
Switch invariant: ["ocaml-variants" {= "5.0.0+trunk"}]

<><> Processing actions <><><><><><><><><><><><><><><><><><><><><><><><><><><><>
-> installed base-bigarray.base
-> installed base-threads.base
-> installed base-unix.base
-> retrieved ocaml-variants.5.0.0+trunk  (https://github.com/ocaml/ocaml/archive/5.0.tar.gz)
-> installed ocaml-variants.5.0.0+trunk
-> installed ocaml-config.3
-> installed ocaml.5.0.0
-> installed base-domains.base
-> installed base-nnp.base
Done.
# Run eval $(opam env --switch=5.0+alpha-repo) to update the current shell environment
2022-11-15 08:55.01 ---> using "85f2729387a48ad8cb84ce419e91dee7cf3000cd97181cb39ea68b3cffaee436" from cache

/: (run (network host)
        (shell "opam update --depexts"))
+ /usr/bin/sudo "apt-get" "update"
- Get:1 http://deb.debian.org/debian unstable InRelease [161 kB]
- Get:2 http://deb.debian.org/debian unstable/main amd64 Packages.diff/Index [63.6 kB]
- Get:3 http://deb.debian.org/debian unstable/main amd64 Packages T-2022-11-15-0207.35-F-2022-11-08-2013.29.pdiff [530 kB]
- Get:3 http://deb.debian.org/debian unstable/main amd64 Packages T-2022-11-15-0207.35-F-2022-11-08-2013.29.pdiff [530 kB]
- Fetched 755 kB in 2s (441 kB/s)
- Reading package lists...
2022-11-15 08:55.01 ---> using "e188bd22dc139d4b52e3a827c2d66777fbc0a88bcd3d75a8d7ec21e782ee3ef2" from cache

/: (run (cache (opam-archives (target /home/opam/.opam/download-cache)))
        (network host)
        (shell  "\
               \nopam remove -y \"atd2cconv.0.0.0\"\
               \nopam install -vy \"atd2cconv.0.0.0\"\
               \nres=$?\
               \nif [ $res = 31 ]; then\
               \n    if opam show -f x-ci-accept-failures: \"atd2cconv.0.0.0\" | grep -q '\"debian-unstable\"'; then\
               \n        echo \"This package failed and has been disabled for CI using the 'x-ci-accept-failures' field.\"\
               \n        exit 69\
               \n    fi\
               \nfi\
               \n\
               \n\
               \nexit $res\
               \n"))
[NOTE] atd2cconv.0.0.0 is not installed.

Nothing to do.
The following actions will be performed:
=== install 11 packages
  - install atd         1.2.0    [required by atd2cconv]
  - install atd2cconv   0.0.0
  - install dune        3.5.0    [required by smart-print]
  - install easy-format 1.3.4    [required by atd]
  - install menhir      20211012 [required by atd]
  - install menhirLib   20211012 [required by menhir]
  - install menhirSdk   20211012 [required by menhir]
  - install nonstd      0.0.2    [required by atd2cconv]
  - install ocamlbuild  0.14.2   [required by atd2cconv]
  - install ocamlfind   1.9.5    [required by atd2cconv]
  - install smart-print 0.3.0    [required by atd2cconv]

<><> Processing actions <><><><><><><><><><><><><><><><><><><><><><><><><><><><>
Processing  1/31: [atd.1.2.0: http]
Processing  2/31: [atd.1.2.0: http] [atd2cconv.0.0.0: http]
Processing  3/31: [atd.1.2.0: http] [atd2cconv.0.0.0: http]
Processing  3/31: [atd.1.2.0: http]
-> retrieved atd2cconv.0.0.0  (https://github.com/smondet/atd2cconv/archive/atd2cconv.0.0.0.tar.gz)
Processing  4/31: [atd.1.2.0: http]
-> retrieved easy-format.1.3.4  (cached)
Processing  5/31: [atd.1.2.0: http] [menhir.20211012, menhirLib.20211012, menhirSdk.20211012: http]
-> retrieved dune.3.5.0  (cached)
Processing  6/31: [atd.1.2.0: http] [menhir.20211012, menhirLib.20211012, menhirSdk.20211012: http] [nonstd.0.0.2: http]
Processing  7/31: [atd.1.2.0: http] [menhir.20211012, menhirLib.20211012, menhirSdk.20211012: http] [nonstd.0.0.2: http] [dune: ocaml bootstrap.ml]
Processing  7/31: [menhir.20211012, menhirLib.20211012, menhirSdk.20211012: http] [nonstd.0.0.2: http] [dune: ocaml bootstrap.ml]
Processing  7/31: [nonstd.0.0.2: http] [dune: ocaml bootstrap.ml]
-> retrieved atd.1.2.0  (https://github.com/mjambon/atd/archive/v1.2.0.tar.gz)
Processing  8/31: [nonstd.0.0.2: http] [dune: ocaml bootstrap.ml]
-> retrieved menhir.20211012, menhirLib.20211012, menhirSdk.20211012  (https://gitlab.inria.fr/fpottier/menhir/-/archive/20211012/archive.tar.gz)
Processing  9/31: [nonstd.0.0.2: http] [dune: ocaml bootstrap.ml]
-> retrieved ocamlbuild.0.14.2  (cached)
Processing 10/31: [nonstd.0.0.2: http] [smart-print.0.3.0: http] [dune: ocaml bootstrap.ml]
Processing 11/31: [nonstd.0.0.2: http] [smart-print.0.3.0: http] [dune: ocaml bootstrap.ml] [ocamlbuild: make configure.make]
-> retrieved ocamlfind.1.9.5  (cached)
[ocamlfind: patch] applying 0001-Fix-bug-when-installing-with-a-system-compiler.patch
Processing 12/31: [nonstd.0.0.2: http] [smart-print.0.3.0: http] [dune: ocaml bootstrap.ml] [ocamlbuild: make configure.make] [ocamlfind: patch]
Processing 12/31: [smart-print.0.3.0: http] [dune: ocaml bootstrap.ml] [ocamlbuild: make configure.make] [ocamlfind: patch]
Processing 12/31: [smart-print.0.3.0: http] [dune: ocaml bootstrap.ml] [ocamlbuild: make configure.make] [ocamlfind: ./configure]
-> retrieved nonstd.0.0.2  (https://bitbucket.org/smondet/nonstd/get/nonstd.0.0.2.tar.gz)
+ /home/opam/.opam/opam-init/hooks/sandbox.sh "build" "make" "-f" "configure.make" "all" "OCAMLBUILD_PREFIX=/home/opam/.opam/5.0+alpha-repo" "OCAMLBUILD_BINDIR=/home/opam/.opam/5.0+alpha-repo/bin" "OCAMLBUILD_LIBDIR=/home/opam/.opam/5.0+alpha-repo/lib" "OCAMLBUILD_MANDIR=/home/opam/.opam/5.0+alpha-repo/man" "OCAML_NATIVE=true" "OCAML_NATIVE_TOOLS=true" (CWD=/home/opam/.opam/5.0+alpha-repo/.opam-switch/build/ocamlbuild.0.14.2)
- (echo "# This file was generated from configure.make"; \
- echo ;\
- echo "OCAML_PREFIX="; \
- echo "OCAML_BINDIR=/home/opam/.opam/5.0+alpha-repo/bin"; \
- echo "OCAML_LIBDIR=/home/opam/.opam/5.0+alpha-repo/lib/ocaml"; \
- echo "OCAML_MANDIR=/home/opam/.opam/5.0+alpha-repo/man"; \
- echo ;\
- echo "EXT_OBJ=.o"; \
- echo "EXT_ASM=.s"; \
- echo "EXT_LIB=.a"; \
- echo "EXT_DLL=.so"; \
- echo "EXE="; \
- echo ;\
- echo "OCAML_NATIVE=true"; \
- echo "OCAML_NATIVE_TOOLS=true"; \
- echo "NATDYNLINK=true"; \
- echo "SUPPORT_SHARED_LIBRARIES=true"; \
- echo ;\
- echo "PREFIX=/home/opam/.opam/5.0+alpha-repo"; \
- echo "BINDIR=/home/opam/.opam/5.0+alpha-repo/bin"; \
- echo "LIBDIR=/home/opam/.opam/5.0+alpha-repo/lib"; \
- echo "MANDIR=/home/opam/.opam/5.0+alpha-repo/man"; \
- ) > Makefile.config
- (echo "(* This file was generated from ../configure.make *)"; \
- echo ;\
- echo 'let bindir = "/home/opam/.opam/5.0+alpha-repo/bin"'; \
- echo 'let libdir = "/home/opam/.opam/5.0+alpha-repo/lib"'; \
- echo 'let ocaml_libdir = "/home/opam/.opam/5.0+alpha-repo/lib/ocaml"'; \
- echo 'let libdir_abs = "/home/opam/.opam/5.0+alpha-repo/lib"'; \
- echo 'let ocaml_native = true'; \
- echo 'let ocaml_native_tools = true'; \
- echo 'let supports_shared_libraries = true';\
- echo 'let a = "a"'; \
- echo 'let o = "o"'; \
- echo 'let so = "so"'; \
- echo 'let ext_dll = ".so"'; \
- echo 'let exe = ""'; \
- echo 'let version = "0.14.2"'; \
- ) > src/ocamlbuild_config.ml
Processing 12/31: [smart-print.0.3.0: http] [dune: ocaml bootstrap.ml] [ocamlbuild: make check-if-preinstalled] [ocamlfind: ./configure]
Processing 12/31: [dune: ocaml bootstrap.ml] [ocamlbuild: make check-if-preinstalled] [ocamlfind: ./configure]
-> retrieved smart-print.0.3.0  (https://github.com/clarus/smart-print/archive/v0.3.0.tar.gz)
+ /home/opam/.opam/opam-init/hooks/sandbox.sh "build" "./configure" "-bindir" "/home/opam/.opam/5.0+alpha-repo/bin" "-sitelib" "/home/opam/.opam/5.0+alpha-repo/lib" "-mandir" "/home/opam/.opam/5.0+alpha-repo/man" "-config" "/home/opam/.opam/5.0+alpha-repo/lib/findlib.conf" "-no-custom" "-no-camlp4" (CWD=/home/opam/.opam/5.0+alpha-repo/.opam-switch/build/ocamlfind.1.9.5)
- Welcome to findlib version 1.9.5
- Configuring core...
- Checking for #remove_directory...
- Testing threading model...
- systhread_supported: true
- Testing DLLs...
- Testing whether ppxopt can be supported...
- Checking for ocamlc -opaque...
- Querying installation: META list not found
- make install will double-check installed META files
- Configuring libraries...
- unix: found (in +unix)
- dynlink: found (in +dynlink)
- bigarray: not present (possible since 4.08)
- compiler-libs: found
- dbm: not present (normal since 4.00)
- graphics: not present (normal since 4.09)
- num: not present (normal since 4.06)
- ocamlbuild: not present (normal since 4.03)
- ocamldoc: found (in +ocamldoc)
- raw_spacetime: not present (normal since 4.12)
- threads: found (in +threads)
- runtime_events: found (in +runtime_events)
- str: found (in +str)
- labltk: not present (normal since 4.02)
- native dynlink: found
- camlp4: disabled
- bytes: found, installing fake library
- Configuration for stdlib written to site-lib-src/stdlib/META
- Configuration for unix written to site-lib-src/unix/META
- Configuration for dynlink written to site-lib-src/dynlink/META
- Configuration for compiler-libs written to site-lib-src/compiler-libs/META
- Configuration for ocamldoc written to site-lib-src/ocamldoc/META
- Configuration for threads written to site-lib-src/threads/META
- Configuration for runtime_events written to site-lib-src/runtime_events/META
- Configuration for str written to site-lib-src/str/META
- Configuration for bytes written to site-lib-src/bytes/META
- Detecting compiler arguments: (extractor built) ok
- 
- About the OCAML core installation:
-     Standard library:      /home/opam/.opam/5.0+alpha-repo/lib/ocaml
-     Binaries:              /home/opam/.opam/5.0+alpha-repo/bin
-     Manual pages:          /home/opam/.opam/5.0+alpha-repo/man
-     Multi-threading type:  posix
- The directory of site-specific packages will be
-     site-lib:              /home/opam/.opam/5.0+alpha-repo/lib
- The configuration file is written to:
-     findlib config file:   /home/opam/.opam/5.0+alpha-repo/lib/findlib.conf
- Software will be installed:
-     Libraries:             in <site-lib>/findlib
-     Binaries:              /home/opam/.opam/5.0+alpha-repo/bin
-     Manual pages:          /home/opam/.opam/5.0+alpha-repo/man
-     topfind script:        /home/opam/.opam/5.0+alpha-repo/lib/ocaml
- Topfind ppxopt support:    yes
- Toolbox:                   no
- Link custom runtime:       no
- Need bytes compatibility:  no
- 
- Configuration has been written to Makefile.config
- 
- You can now do 'make all', and optionally 'make opt', to build ocamlfind.
Processing 12/31: [dune: ocaml bootstrap.ml] [ocamlbuild: make check-if-preinstalled] [ocamlfind: make all]
+ /home/opam/.opam/opam-init/hooks/sandbox.sh "build" "make" "all" (CWD=/home/opam/.opam/5.0+alpha-repo/.opam-switch/build/ocamlfind.1.9.5)
- for p in findlib; do ( cd src/$p; make all ) || exit; done
- make[1]: Entering directory '/home/opam/.opam/5.0+alpha-repo/.opam-switch/build/ocamlfind.1.9.5/src/findlib'
- ocamllex fl_meta.mll
- 22 states, 392 transitions, table size 1700 bytes
- USE_CYGPATH="0"; \
- export USE_CYGPATH; \
- cat findlib_config.mlp | \
-          ../../tools/patch '@CONFIGFILE@' '/home/opam/.opam/5.0+alpha-repo/lib/findlib.conf' | \
-          ../../tools/patch '@STDLIB@' '/home/opam/.opam/5.0+alpha-repo/lib/ocaml' | \
- 	sed -e 's;@AUTOLINK@;true;g' \
- 	    -e 's;@SYSTEM@;linux;g' \
- 	     >findlib_config.ml
- if [ "true" = "true" ]; then                 \
- 	cp topfind.ml.in topfind.ml;                             \
- else                                                             \
- 	sed -e '/PPXOPT_BEGIN/,/PPXOPT_END/ d' topfind.ml.in     \
- 		> topfind.ml ;                                   \
- fi
- ocamldep *.ml *.mli >depend
- ocamlc -I +compiler-libs -opaque   -I +unix -I +dynlink -g -c findlib_config.ml
- ocamlc -I +compiler-libs -opaque   -I +unix -I +dynlink -g -c fl_split.ml
- ocamlc -I +compiler-libs -opaque   -I +unix -I +dynlink -g -c fl_metatoken.ml
- ocamlc -I +compiler-libs -opaque   -I +unix -I +dynlink -g -c fl_meta.ml
- ocamlc -I +compiler-libs -opaque   -I +unix -I +dynlink -c fl_metascanner.mli
- ocamlc -I +compiler-libs -opaque   -I +unix -I +dynlink -g -c fl_metascanner.ml
- ocamlc -I +compiler-libs -opaque   -I +unix -I +dynlink -c fl_topo.mli
- ocamlc -I +compiler-libs -opaque   -I +unix -I +dynlink -g -c fl_topo.ml
- ocamlc -I +compiler-libs -opaque   -I +unix -I +dynlink -c fl_package_base.mli
- ocamlc -I +compiler-libs -opaque   -I +unix -I +dynlink -g -c fl_package_base.ml
- File "fl_package_base.ml", line 304, characters 22-40:
- 304 | 	 let pkg_ancestors = query_requirements predlist pkg in
-       	                     ^^^^^^^^^^^^^^^^^^
- Warning 6 [labels-omitted]: label preds was omitted in the application of this function.
- File "fl_package_base.ml", line 350, characters 18-36:
- 350 |   let ancestors = query_requirements predlist package_name in
-                         ^^^^^^^^^^^^^^^^^^
- Warning 6 [labels-omitted]: label preds was omitted in the application of this function.
- File "fl_package_base.ml", line 375, characters 23-41:
- 375 | 	  let pkg_ancestors = query_requirements predlist pkg in
-       	                      ^^^^^^^^^^^^^^^^^^
- Warning 6 [labels-omitted]: label preds was omitted in the application of this function.
- File "fl_package_base.ml", line 510, characters 16-35:
- 510 | 	     ( let c = package_definitions search_path pkg.package_name in
-       	               ^^^^^^^^^^^^^^^^^^^
- Warning 6 [labels-omitted]: label search_path was omitted in the application of this function.
- ocamlc -I +compiler-libs -opaque   -I +unix -I +dynlink -c findlib.mli
- ocamlc -I +compiler-libs -opaque   -I +unix -I +dynlink -g -c findlib.ml
- File "findlib.ml", line 390, characters 2-26:
- 390 |   Fl_package_base.requires predlist pkg
-         ^^^^^^^^^^^^^^^^^^^^^^^^
- Warning 6 [labels-omitted]: label preds was omitted in the application of this function.
- File "findlib.ml", line 396, characters 2-33:
- 396 |   Fl_package_base.requires_deeply predlist pkglist
-         ^^^^^^^^^^^^^^^^^^^^^^^^^^^^^^^
- Warning 6 [labels-omitted]: label preds was omitted in the application of this function.
- ocamlc -I +compiler-libs -opaque   -I +unix -I +dynlink -g -c fl_args.ml
- ocamlc -I +compiler-libs -opaque   -I +unix -I +dynlink -g -c fl_lint.ml
- ocamlc -I +compiler-libs -a -o findlib.cma findlib_config.cmo fl_split.cmo fl_metatoken.cmo fl_meta.cmo fl_metascanner.cmo fl_topo.cmo fl_package_base.cmo findlib.cmo fl_args.cmo fl_lint.cmo
- ocamlc -I +compiler-libs -opaque   -I +unix -I +dynlink -g -c ocaml_args.ml
- ocamlc -I +compiler-libs -opaque   -I +unix -I +dynlink -g -c frontend.ml
- File "frontend.ml", line 859, characters 10-39:
- 859 |           Fl_package_base.package_users predicates1 packages1
-                 ^^^^^^^^^^^^^^^^^^^^^^^^^^^^^
- Warning 6 [labels-omitted]: label preds was omitted in the application of this function.
- ocamlc -I +compiler-libs  -o ocamlfind -g findlib.cma unix.cma \
-            -I +unix -I +dynlink ocaml_args.cmo frontend.cmo
- ocamlc -I +compiler-libs -opaque   -I +unix -I +dynlink -c topfind.mli
- ocamlc -I +compiler-libs -opaque   -I +unix -I +dynlink -g -c topfind.ml
- File "topfind.ml", line 126, characters 40-63:
- 126 |                      match Hashtbl.find Toploop.directive_table "ppx" with
-                                               ^^^^^^^^^^^^^^^^^^^^^^^
- Alert deprecated: Toploop.directive_table
- File "topfind.ml", line 256, characters 4-27:
- 256 |     Toploop.directive_table
-           ^^^^^^^^^^^^^^^^^^^^^^^
- Alert deprecated: Toploop.directive_table
- File "topfind.ml", line 266, characters 4-27:
- 266 |     Toploop.directive_table
-           ^^^^^^^^^^^^^^^^^^^^^^^
- Alert deprecated: Toploop.directive_table
- File "topfind.ml", line 278, characters 4-27:
- 278 |     Toploop.directive_table
-           ^^^^^^^^^^^^^^^^^^^^^^^
- Alert deprecated: Toploop.directive_table
- File "topfind.ml", line 291, characters 4-27:
- 291 |     Toploop.directive_table
-           ^^^^^^^^^^^^^^^^^^^^^^^
- Alert deprecated: Toploop.directive_table
- File "topfind.ml", line 305, characters 4-27:
- 305 |     Toploop.directive_table
-           ^^^^^^^^^^^^^^^^^^^^^^^
- Alert deprecated: Toploop.directive_table
- File "topfind.ml", line 317, characters 4-27:
- 317 |     Toploop.directive_table
-           ^^^^^^^^^^^^^^^^^^^^^^^
- Alert deprecated: Toploop.directive_table
- ocamlc -I +compiler-libs -a -o findlib_top.cma topfind.cmo
- USE_CYGPATH="0"; \
- export USE_CYGPATH; \
- cat topfind_rd1.p | \
-          ../../tools/patch '@SITELIB@' '/home/opam/.opam/5.0+alpha-repo/lib' \
-     	    >topfind
- ocamlc -I +compiler-libs -opaque   -I +unix -I +dynlink -c fl_dynload.mli
- ocamlc -I +compiler-libs -opaque   -I +unix -I +dynlink -g -c fl_dynload.ml
- ocamlc -I +compiler-libs -a -o findlib_dynload.cma fl_dynload.cmo
- make[1]: Leaving directory '/home/opam/.opam/5.0+alpha-repo/.opam-switch/build/ocamlfind.1.9.5/src/findlib'
- make all-config
- make[1]: Entering directory '/home/opam/.opam/5.0+alpha-repo/.opam-switch/build/ocamlfind.1.9.5'
- USE_CYGPATH="0"; \
- export USE_CYGPATH; \
- cat findlib.conf.in | \
-      tools/patch '@SITELIB@' '/home/opam/.opam/5.0+alpha-repo/lib' >findlib.conf
- if ./tools/cmd_from_same_dir ocamlc; then \
- 	echo 'ocamlc="ocamlc.opt"' >>findlib.conf; \
- fi
- if ./tools/cmd_from_same_dir ocamlopt; then \
- 	echo 'ocamlopt="ocamlopt.opt"' >>findlib.conf; \
- fi
- if ./tools/cmd_from_same_dir ocamldep; then \
- 	echo 'ocamldep="ocamldep.opt"' >>findlib.conf; \
- fi
- if ./tools/cmd_from_same_dir ocamldoc; then \
- 	echo 'ocamldoc="ocamldoc.opt"' >>findlib.conf; \
- fi
- make[1]: Leaving directory '/home/opam/.opam/5.0+alpha-repo/.opam-switch/build/ocamlfind.1.9.5'
Processing 12/31: [dune: ocaml bootstrap.ml] [ocamlbuild: make check-if-preinstalled] [ocamlfind: make opt]
+ /home/opam/.opam/opam-init/hooks/sandbox.sh "build" "make" "opt" (CWD=/home/opam/.opam/5.0+alpha-repo/.opam-switch/build/ocamlfind.1.9.5)
- for p in findlib; do ( cd src/$p; make opt ) || exit; done
- make[1]: Entering directory '/home/opam/.opam/5.0+alpha-repo/.opam-switch/build/ocamlfind.1.9.5/src/findlib'
- ocamlopt -I +compiler-libs -g -opaque  -I +unix -I +dynlink -c findlib_config.ml
- ocamlopt -I +compiler-libs -g -opaque  -I +unix -I +dynlink -c fl_split.ml
- ocamlopt -I +compiler-libs -g -opaque  -I +unix -I +dynlink -c fl_metatoken.ml
- ocamlopt -I +compiler-libs -g -opaque  -I +unix -I +dynlink -c fl_meta.ml
- ocamlopt -I +compiler-libs -g -opaque  -I +unix -I +dynlink -c fl_metascanner.ml
- ocamlopt -I +compiler-libs -g -opaque  -I +unix -I +dynlink -c fl_topo.ml
- ocamlopt -I +compiler-libs -g -opaque  -I +unix -I +dynlink -c fl_package_base.ml
- File "fl_package_base.ml", line 304, characters 22-40:
- 304 | 	 let pkg_ancestors = query_requirements predlist pkg in
-       	                     ^^^^^^^^^^^^^^^^^^
- Warning 6 [labels-omitted]: label preds was omitted in the application of this function.
- File "fl_package_base.ml", line 350, characters 18-36:
- 350 |   let ancestors = query_requirements predlist package_name in
-                         ^^^^^^^^^^^^^^^^^^
- Warning 6 [labels-omitted]: label preds was omitted in the application of this function.
- File "fl_package_base.ml", line 375, characters 23-41:
- 375 | 	  let pkg_ancestors = query_requirements predlist pkg in
-       	                      ^^^^^^^^^^^^^^^^^^
- Warning 6 [labels-omitted]: label preds was omitted in the application of this function.
- File "fl_package_base.ml", line 510, characters 16-35:
- 510 | 	     ( let c = package_definitions search_path pkg.package_name in
-       	               ^^^^^^^^^^^^^^^^^^^
- Warning 6 [labels-omitted]: label search_path was omitted in the application of this function.
- ocamlopt -I +compiler-libs -g -opaque  -I +unix -I +dynlink -c findlib.ml
- File "findlib.ml", line 390, characters 2-26:
- 390 |   Fl_package_base.requires predlist pkg
-         ^^^^^^^^^^^^^^^^^^^^^^^^
- Warning 6 [labels-omitted]: label preds was omitted in the application of this function.
- File "findlib.ml", line 396, characters 2-33:
- 396 |   Fl_package_base.requires_deeply predlist pkglist
-         ^^^^^^^^^^^^^^^^^^^^^^^^^^^^^^^
- Warning 6 [labels-omitted]: label preds was omitted in the application of this function.
- ocamlopt -I +compiler-libs -g -opaque  -I +unix -I +dynlink -c fl_args.ml
- ocamlopt -I +compiler-libs -g -opaque  -I +unix -I +dynlink -c fl_lint.ml
- ocamlopt -I +compiler-libs -g -a -o findlib.cmxa findlib_config.cmx fl_split.cmx fl_metatoken.cmx fl_meta.cmx fl_metascanner.cmx fl_topo.cmx fl_package_base.cmx findlib.cmx fl_args.cmx fl_lint.cmx
- if [ 1 -gt 0 ]; then \
-     ocamlopt -I +compiler-libs -g -shared -o findlib.cmxs findlib_config.cmx fl_split.cmx fl_metatoken.cmx fl_meta.cmx fl_metascanner.cmx fl_topo.cmx fl_package_base.cmx findlib.cmx fl_args.cmx fl_lint.cmx; \
- fi
- ocamlopt -I +compiler-libs -g -opaque  -I +unix -I +dynlink -c ocaml_args.ml
- ocamlopt -I +compiler-libs -g -opaque  -I +unix -I +dynlink -c frontend.ml
- File "frontend.ml", line 859, characters 10-39:
- 859 |           Fl_package_base.package_users predicates1 packages1
-                 ^^^^^^^^^^^^^^^^^^^^^^^^^^^^^
- Warning 6 [labels-omitted]: label preds was omitted in the application of this function.
- ocamlopt -I +compiler-libs -g -o ocamlfind_opt findlib.cmxa unix.cmxa \
- 	   -I +unix -I +dynlink ocaml_args.cmx frontend.cmx
- ocamlopt -I +compiler-libs -g -opaque  -I +unix -I +dynlink -c topfind.ml
- File "topfind.ml", line 126, characters 40-63:
- 126 |                      match Hashtbl.find Toploop.directive_table "ppx" with
-                                               ^^^^^^^^^^^^^^^^^^^^^^^
- Alert deprecated: Toploop.directive_table
- File "topfind.ml", line 256, characters 4-27:
- 256 |     Toploop.directive_table
-           ^^^^^^^^^^^^^^^^^^^^^^^
- Alert deprecated: Toploop.directive_table
- File "topfind.ml", line 266, characters 4-27:
- 266 |     Toploop.directive_table
-           ^^^^^^^^^^^^^^^^^^^^^^^
- Alert deprecated: Toploop.directive_table
- File "topfind.ml", line 278, characters 4-27:
- 278 |     Toploop.directive_table
-           ^^^^^^^^^^^^^^^^^^^^^^^
- Alert deprecated: Toploop.directive_table
- File "topfind.ml", line 291, characters 4-27:
- 291 |     Toploop.directive_table
-           ^^^^^^^^^^^^^^^^^^^^^^^
- Alert deprecated: Toploop.directive_table
- File "topfind.ml", line 305, characters 4-27:
- 305 |     Toploop.directive_table
-           ^^^^^^^^^^^^^^^^^^^^^^^
- Alert deprecated: Toploop.directive_table
- File "topfind.ml", line 317, characters 4-27:
- 317 |     Toploop.directive_table
-           ^^^^^^^^^^^^^^^^^^^^^^^
- Alert deprecated: Toploop.directive_table
- ocamlopt -I +compiler-libs -g -a -o findlib_top.cmxa topfind.cmx
- if [ 1 -gt 0 ]; then \
-     ocamlopt -I +compiler-libs -g -shared -o findlib_top.cmxs topfind.cmx; \
- fi
- ocamlopt -I +compiler-libs -g -opaque  -I +unix -I +dynlink -c fl_dynload.ml
- ocamlopt -I +compiler-libs -g -a -o findlib_dynload.cmxa fl_dynload.cmx
- if [ 1 -gt 0 ]; then \
-     ocamlopt -I +compiler-libs -g -shared -o findlib_dynload.cmxs fl_dynload.cmx; \
- fi
- make[1]: Leaving directory '/home/opam/.opam/5.0+alpha-repo/.opam-switch/build/ocamlfind.1.9.5/src/findlib'
-> compiled  ocamlfind.1.9.5
Processing 12/31: [dune: ocaml bootstrap.ml] [ocamlbuild: make check-if-preinstalled]
Processing 13/31: [dune: ocaml bootstrap.ml] [ocamlbuild: make check-if-preinstalled] [ocamlfind: make install]
+ /home/opam/.opam/opam-init/hooks/sandbox.sh "build" "make" "check-if-preinstalled" "all" "opam-install" (CWD=/home/opam/.opam/5.0+alpha-repo/.opam-switch/build/ocamlbuild.0.14.2)
- if test -d /home/opam/.opam/5.0+alpha-repo/lib/ocaml/ocamlbuild; then\
-   >&2 echo "ERROR: Preinstalled ocamlbuild detected at"\
-        "/home/opam/.opam/5.0+alpha-repo/lib/ocaml/ocamlbuild";\
-   >&2 echo "Installation aborted; if you want to bypass this"\
-         "safety check, pass CHECK_IF_PREINSTALLED=false to make";\
-   exit 2;\
- fi
- ocamlc.opt -w +L -w +R -w +Z -I src -I plugin-lib -I bin -I +unix -safe-string -bin-annot -strict-sequence -c src/const.ml
- ocamlc.opt -w +L -w +R -w +Z -I src -I plugin-lib -I bin -I +unix -safe-string -bin-annot -strict-sequence -c src/loc.mli
- ocamlc.opt -w +L -w +R -w +Z -I src -I plugin-lib -I bin -I +unix -safe-string -bin-annot -strict-sequence -c src/loc.ml
- ocamlc.opt -w +L -w +R -w +Z -I src -I plugin-lib -I bin -I +unix -safe-string -bin-annot -strict-sequence -c src/discard_printf.mli
- ocamlc.opt -w +L -w +R -w +Z -I src -I plugin-lib -I bin -I +unix -safe-string -bin-annot -strict-sequence -c src/discard_printf.ml
- ocamlc.opt -w +L -w +R -w +Z -I src -I plugin-lib -I bin -I +unix -safe-string -bin-annot -strict-sequence -c src/signatures.mli
- ocamlc.opt -w +L -w +R -w +Z -I src -I plugin-lib -I bin -I +unix -safe-string -bin-annot -strict-sequence -c src/my_std.mli
- ocamlc.opt -w +L -w +R -w +Z -I src -I plugin-lib -I bin -I +unix -safe-string -bin-annot -strict-sequence -c src/my_std.ml
- ocamlc.opt -w +L -w +R -w +Z -I src -I plugin-lib -I bin -I +unix -safe-string -bin-annot -strict-sequence -c src/my_unix.mli
- ocamlc.opt -w +L -w +R -w +Z -I src -I plugin-lib -I bin -I +unix -safe-string -bin-annot -strict-sequence -c src/my_unix.ml
- ocamlc.opt -w +L -w +R -w +Z -I src -I plugin-lib -I bin -I +unix -safe-string -bin-annot -strict-sequence -c src/tags.mli
- ocamlc.opt -w +L -w +R -w +Z -I src -I plugin-lib -I bin -I +unix -safe-string -bin-annot -strict-sequence -c src/tags.ml
- ocamlc.opt -w +L -w +R -w +Z -I src -I plugin-lib -I bin -I +unix -safe-string -bin-annot -strict-sequence -c src/display.mli
- ocamlc.opt -w +L -w +R -w +Z -I src -I plugin-lib -I bin -I +unix -safe-string -bin-annot -strict-sequence -c src/display.ml
- ocamlc.opt -w +L -w +R -w +Z -I src -I plugin-lib -I bin -I +unix -safe-string -bin-annot -strict-sequence -c src/log.mli
- ocamlc.opt -w +L -w +R -w +Z -I src -I plugin-lib -I bin -I +unix -safe-string -bin-annot -strict-sequence -c src/log.ml
- ocamlc.opt -w +L -w +R -w +Z -I src -I plugin-lib -I bin -I +unix -safe-string -bin-annot -strict-sequence -c src/shell.mli
- ocamlc.opt -w +L -w +R -w +Z -I src -I plugin-lib -I bin -I +unix -safe-string -bin-annot -strict-sequence -c src/shell.ml
- ocamlc.opt -w +L -w +R -w +Z -I src -I plugin-lib -I bin -I +unix -safe-string -bin-annot -strict-sequence -c src/bool.mli
- ocamlc.opt -w +L -w +R -w +Z -I src -I plugin-lib -I bin -I +unix -safe-string -bin-annot -strict-sequence -c src/bool.ml
- ocamlc.opt -w +L -w +R -w +Z -I src -I plugin-lib -I bin -I +unix -safe-string -bin-annot -strict-sequence -c src/glob_ast.mli
- ocamlc.opt -w +L -w +R -w +Z -I src -I plugin-lib -I bin -I +unix -safe-string -bin-annot -strict-sequence -c src/glob_ast.ml
- ocamllex.opt src/glob_lexer.mll
- 55 states, 419 transitions, table size 2006 bytes
- ocamlc.opt -w +L -w +R -w +Z -I src -I plugin-lib -I bin -I +unix -safe-string -bin-annot -strict-sequence -c src/glob_lexer.mli
- ocamlc.opt -w +L -w +R -w +Z -I src -I plugin-lib -I bin -I +unix -safe-string -bin-annot -strict-sequence -c src/glob_lexer.ml
- ocamlc.opt -w +L -w +R -w +Z -I src -I plugin-lib -I bin -I +unix -safe-string -bin-annot -strict-sequence -c src/glob.mli
- ocamlc.opt -w +L -w +R -w +Z -I src -I plugin-lib -I bin -I +unix -safe-string -bin-annot -strict-sequence -c src/glob.ml
- ocamllex.opt src/lexers.mll
- 251 states, 1051 transitions, table size 5710 bytes
- 4334 additional bytes used for bindings
- ocamlc.opt -w +L -w +R -w +Z -I src -I plugin-lib -I bin -I +unix -safe-string -bin-annot -strict-sequence -c src/lexers.mli
- ocamlc.opt -w +L -w +R -w +Z -I src -I plugin-lib -I bin -I +unix -safe-string -bin-annot -strict-sequence -c src/lexers.ml
- ocamlc.opt -w +L -w +R -w +Z -I src -I plugin-lib -I bin -I +unix -safe-string -bin-annot -strict-sequence -c src/param_tags.mli
- ocamlc.opt -w +L -w +R -w +Z -I src -I plugin-lib -I bin -I +unix -safe-string -bin-annot -strict-sequence -c src/param_tags.ml
- ocamlc.opt -w +L -w +R -w +Z -I src -I plugin-lib -I bin -I +unix -safe-string -bin-annot -strict-sequence -c src/command.mli
- ocamlc.opt -w +L -w +R -w +Z -I src -I plugin-lib -I bin -I +unix -safe-string -bin-annot -strict-sequence -c src/command.ml
- ocamlc.opt -w +L -w +R -w +Z -I src -I plugin-lib -I bin -I +unix -safe-string -bin-annot -strict-sequence -c src/ocamlbuild_config.ml
- ocamlc.opt -w +L -w +R -w +Z -I src -I plugin-lib -I bin -I +unix -safe-string -bin-annot -strict-sequence -c src/ocamlbuild_where.mli
- ocamlc.opt -w +L -w +R -w +Z -I src -I plugin-lib -I bin -I +unix -safe-string -bin-annot -strict-sequence -c src/ocamlbuild_where.ml
- ocamlc.opt -w +L -w +R -w +Z -I src -I plugin-lib -I bin -I +unix -safe-string -bin-annot -strict-sequence -c src/slurp.mli
- ocamlc.opt -w +L -w +R -w +Z -I src -I plugin-lib -I bin -I +unix -safe-string -bin-annot -strict-sequence -c src/slurp.ml
- ocamlc.opt -w +L -w +R -w +Z -I src -I plugin-lib -I bin -I +unix -safe-string -bin-annot -strict-sequence -c src/options.mli
- ocamlc.opt -w +L -w +R -w +Z -I src -I plugin-lib -I bin -I +unix -safe-string -bin-annot -strict-sequence -c src/options.ml
- ocamlc.opt -w +L -w +R -w +Z -I src -I plugin-lib -I bin -I +unix -safe-string -bin-annot -strict-sequence -c src/pathname.mli
- ocamlc.opt -w +L -w +R -w +Z -I src -I plugin-lib -I bin -I +unix -safe-string -bin-annot -strict-sequence -c src/pathname.ml
- ocamlc.opt -w +L -w +R -w +Z -I src -I plugin-lib -I bin -I +unix -safe-string -bin-annot -strict-sequence -c src/configuration.mli
- ocamlc.opt -w +L -w +R -w +Z -I src -I plugin-lib -I bin -I +unix -safe-string -bin-annot -strict-sequence -c src/configuration.ml
- ocamlc.opt -w +L -w +R -w +Z -I src -I plugin-lib -I bin -I +unix -safe-string -bin-annot -strict-sequence -c src/flags.mli
- ocamlc.opt -w +L -w +R -w +Z -I src -I plugin-lib -I bin -I +unix -safe-string -bin-annot -strict-sequence -c src/flags.ml
- ocamlc.opt -w +L -w +R -w +Z -I src -I plugin-lib -I bin -I +unix -safe-string -bin-annot -strict-sequence -c src/hygiene.mli
- ocamlc.opt -w +L -w +R -w +Z -I src -I plugin-lib -I bin -I +unix -safe-string -bin-annot -strict-sequence -c src/hygiene.ml
- ocamlc.opt -w +L -w +R -w +Z -I src -I plugin-lib -I bin -I +unix -safe-string -bin-annot -strict-sequence -c src/digest_cache.mli
- ocamlc.opt -w +L -w +R -w +Z -I src -I plugin-lib -I bin -I +unix -safe-string -bin-annot -strict-sequence -c src/digest_cache.ml
- ocamlc.opt -w +L -w +R -w +Z -I src -I plugin-lib -I bin -I +unix -safe-string -bin-annot -strict-sequence -c src/resource.mli
- ocamlc.opt -w +L -w +R -w +Z -I src -I plugin-lib -I bin -I +unix -safe-string -bin-annot -strict-sequence -c src/resource.ml
- ocamlc.opt -w +L -w +R -w +Z -I src -I plugin-lib -I bin -I +unix -safe-string -bin-annot -strict-sequence -c src/rule.mli
- ocamlc.opt -w +L -w +R -w +Z -I src -I plugin-lib -I bin -I +unix -safe-string -bin-annot -strict-sequence -c src/rule.ml
- ocamlc.opt -w +L -w +R -w +Z -I src -I plugin-lib -I bin -I +unix -safe-string -bin-annot -strict-sequence -c src/solver.mli
- ocamlc.opt -w +L -w +R -w +Z -I src -I plugin-lib -I bin -I +unix -safe-string -bin-annot -strict-sequence -c src/solver.ml
- ocamlc.opt -w +L -w +R -w +Z -I src -I plugin-lib -I bin -I +unix -safe-string -bin-annot -strict-sequence -c src/report.mli
- ocamlc.opt -w +L -w +R -w +Z -I src -I plugin-lib -I bin -I +unix -safe-string -bin-annot -strict-sequence -c src/report.ml
- ocamlc.opt -w +L -w +R -w +Z -I src -I plugin-lib -I bin -I +unix -safe-string -bin-annot -strict-sequence -c src/tools.mli
- ocamlc.opt -w +L -w +R -w +Z -I src -I plugin-lib -I bin -I +unix -safe-string -bin-annot -strict-sequence -c src/tools.ml
- ocamlc.opt -w +L -w +R -w +Z -I src -I plugin-lib -I bin -I +unix -safe-string -bin-annot -strict-sequence -c src/fda.mli
- ocamlc.opt -w +L -w +R -w +Z -I src -I plugin-lib -I bin -I +unix -safe-string -bin-annot -strict-sequence -c src/fda.ml
- ocamlc.opt -w +L -w +R -w +Z -I src -I plugin-lib -I bin -I +unix -safe-string -bin-annot -strict-sequence -c src/findlib.mli
- ocamlc.opt -w +L -w +R -w +Z -I src -I plugin-lib -I bin -I +unix -safe-string -bin-annot -strict-sequence -c src/findlib.ml
- ocamlc.opt -w +L -w +R -w +Z -I src -I plugin-lib -I bin -I +unix -safe-string -bin-annot -strict-sequence -c src/ocaml_arch.mli
- ocamlc.opt -w +L -w +R -w +Z -I src -I plugin-lib -I bin -I +unix -safe-string -bin-annot -strict-sequence -c src/ocaml_arch.ml
- ocamlc.opt -w +L -w +R -w +Z -I src -I plugin-lib -I bin -I +unix -safe-string -bin-annot -strict-sequence -c src/ocaml_utils.mli
- ocamlc.opt -w +L -w +R -w +Z -I src -I plugin-lib -I bin -I +unix -safe-string -bin-annot -strict-sequence -c src/ocaml_utils.ml
- ocamlc.opt -w +L -w +R -w +Z -I src -I plugin-lib -I bin -I +unix -safe-string -bin-annot -strict-sequence -c src/ocaml_dependencies.mli
- ocamlc.opt -w +L -w +R -w +Z -I src -I plugin-lib -I bin -I +unix -safe-string -bin-annot -strict-sequence -c src/ocaml_dependencies.ml
- ocamlc.opt -w +L -w +R -w +Z -I src -I plugin-lib -I bin -I +unix -safe-string -bin-annot -strict-sequence -c src/ocaml_compiler.mli
- ocamlc.opt -w +L -w +R -w +Z -I src -I plugin-lib -I bin -I +unix -safe-string -bin-annot -strict-sequence -c src/ocaml_compiler.ml
- ocamlc.opt -w +L -w +R -w +Z -I src -I plugin-lib -I bin -I +unix -safe-string -bin-annot -strict-sequence -c src/ocaml_tools.mli
- ocamlc.opt -w +L -w +R -w +Z -I src -I plugin-lib -I bin -I +unix -safe-string -bin-annot -strict-sequence -c src/ocaml_tools.ml
- ocamlc.opt -w +L -w +R -w +Z -I src -I plugin-lib -I bin -I +unix -safe-string -bin-annot -strict-sequence -c src/ocaml_specific.mli
- ocamlc.opt -w +L -w +R -w +Z -I src -I plugin-lib -I bin -I +unix -safe-string -bin-annot -strict-sequence -c src/ocaml_specific.ml
- ocamlc.opt -w +L -w +R -w +Z -I src -I plugin-lib -I bin -I +unix -safe-string -bin-annot -strict-sequence -c src/exit_codes.mli
- ocamlc.opt -w +L -w +R -w +Z -I src -I plugin-lib -I bin -I +unix -safe-string -bin-annot -strict-sequence -c src/exit_codes.ml
- ocamlc.opt -w +L -w +R -w +Z -I src -I plugin-lib -I bin -I +unix -safe-string -bin-annot -strict-sequence -c src/plugin.mli
- ocamlc.opt -w +L -w +R -w +Z -I src -I plugin-lib -I bin -I +unix -safe-string -bin-annot -strict-sequence -c src/plugin.ml
- ocamlc.opt -w +L -w +R -w +Z -I src -I plugin-lib -I bin -I +unix -safe-string -bin-annot -strict-sequence -c src/hooks.mli
- ocamlc.opt -w +L -w +R -w +Z -I src -I plugin-lib -I bin -I +unix -safe-string -bin-annot -strict-sequence -c src/hooks.ml
- ocamlc.opt -w +L -w +R -w +Z -I src -I plugin-lib -I bin -I +unix -safe-string -bin-annot -strict-sequence -c src/main.mli
- ocamlc.opt -w +L -w +R -w +Z -I src -I plugin-lib -I bin -I +unix -safe-string -bin-annot -strict-sequence -c src/main.ml
- mkdir -p tmp
- ocamlc.opt -pack src/const.cmo src/loc.cmo src/discard_printf.cmo src/signatures.cmi src/my_std.cmo src/my_unix.cmo src/tags.cmo src/display.cmo src/log.cmo src/shell.cmo src/bool.cmo src/glob_ast.cmo src/glob_lexer.cmo src/glob.cmo src/lexers.cmo src/param_tags.cmo src/command.cmo src/ocamlbuild_config.cmo src/ocamlbuild_where.cmo src/slurp.cmo src/options.cmo src/pathname.cmo src/configuration.cmo src/flags.cmo src/hygiene.cmo src/digest_cache.cmo src/resource.cmo src/rule.cmo src/solver.cmo src/report.cmo src/tools.cmo src/fda.cmo src/findlib.cmo src/ocaml_arch.cmo src/ocaml_utils.cmo src/ocaml_dependencies.cmo src/ocaml_compiler.cmo src/ocaml_tools.cmo src/ocaml_specific.cmo src/exit_codes.cmo src/plugin.cmo src/hooks.cmo src/main.cmo -o tmp/ocamlbuild_pack.cmo
- mv tmp/ocamlbuild_pack.cmi src/ocamlbuild_pack.cmi
- mv tmp/ocamlbuild_pack.cmo src/ocamlbuild_pack.cmo
- ocamlc.opt -w +L -w +R -w +Z -I src -I plugin-lib -I bin -I +unix -safe-string -bin-annot -strict-sequence -c plugin-lib/ocamlbuild_plugin.mli
- ocamlc.opt -w +L -w +R -w +Z -I src -I plugin-lib -I bin -I +unix -safe-string -bin-annot -strict-sequence -c plugin-lib/ocamlbuild_plugin.ml
- ocamlc.opt -w +L -w +R -w +Z -I src -I plugin-lib -I bin -I +unix -safe-string -bin-annot -strict-sequence -c plugin-lib/ocamlbuild_executor.mli
- ocamlc.opt -w +L -w +R -w +Z -I src -I plugin-lib -I bin -I +unix -safe-string -bin-annot -strict-sequence -c plugin-lib/ocamlbuild_executor.ml
- ocamlc.opt -w +L -w +R -w +Z -I src -I plugin-lib -I bin -I +unix -safe-string -bin-annot -strict-sequence -c plugin-lib/ocamlbuild_unix_plugin.mli
- ocamlc.opt -w +L -w +R -w +Z -I src -I plugin-lib -I bin -I +unix -safe-string -bin-annot -strict-sequence -c plugin-lib/ocamlbuild_unix_plugin.ml
- ocamlc.opt -w +L -w +R -w +Z -I src -I plugin-lib -I bin -I +unix -safe-string -bin-annot -strict-sequence -c bin/ocamlbuild.mli
- ocamlc.opt -w +L -w +R -w +Z -I src -I plugin-lib -I bin -I +unix -safe-string -bin-annot -strict-sequence -c bin/ocamlbuild.ml
- ocamlc.opt -I +unix -I src -o ocamlbuild.byte unix.cma src/ocamlbuild_pack.cmo plugin-lib/ocamlbuild_plugin.cmo plugin-lib/ocamlbuild_executor.cmo plugin-lib/ocamlbuild_unix_plugin.cmo bin/ocamlbuild.cmo
- ocamlc.opt -a -o plugin-lib/ocamlbuildlib.cma src/ocamlbuild_pack.cmo plugin-lib/ocamlbuild_plugin.cmo plugin-lib/ocamlbuild_executor.cmo plugin-lib/ocamlbuild_unix_plugin.cmo
- ocamlopt.opt -for-pack Ocamlbuild_pack -w +L -w +R -w +Z -I src -I plugin-lib -I bin -I +unix -safe-string -bin-annot -strict-sequence -c src/const.ml
- ocamlopt.opt -for-pack Ocamlbuild_pack -w +L -w +R -w +Z -I src -I plugin-lib -I bin -I +unix -safe-string -bin-annot -strict-sequence -c src/loc.ml
- ocamlopt.opt -for-pack Ocamlbuild_pack -w +L -w +R -w +Z -I src -I plugin-lib -I bin -I +unix -safe-string -bin-annot -strict-sequence -c src/discard_printf.ml
- ocamlopt.opt -for-pack Ocamlbuild_pack -w +L -w +R -w +Z -I src -I plugin-lib -I bin -I +unix -safe-string -bin-annot -strict-sequence -c src/my_std.ml
- ocamlopt.opt -for-pack Ocamlbuild_pack -w +L -w +R -w +Z -I src -I plugin-lib -I bin -I +unix -safe-string -bin-annot -strict-sequence -c src/my_unix.ml
- ocamlopt.opt -for-pack Ocamlbuild_pack -w +L -w +R -w +Z -I src -I plugin-lib -I bin -I +unix -safe-string -bin-annot -strict-sequence -c src/tags.ml
- ocamlopt.opt -for-pack Ocamlbuild_pack -w +L -w +R -w +Z -I src -I plugin-lib -I bin -I +unix -safe-string -bin-annot -strict-sequence -c src/display.ml
- ocamlopt.opt -for-pack Ocamlbuild_pack -w +L -w +R -w +Z -I src -I plugin-lib -I bin -I +unix -safe-string -bin-annot -strict-sequence -c src/log.ml
- ocamlopt.opt -for-pack Ocamlbuild_pack -w +L -w +R -w +Z -I src -I plugin-lib -I bin -I +unix -safe-string -bin-annot -strict-sequence -c src/shell.ml
- ocamlopt.opt -for-pack Ocamlbuild_pack -w +L -w +R -w +Z -I src -I plugin-lib -I bin -I +unix -safe-string -bin-annot -strict-sequence -c src/bool.ml
- ocamlopt.opt -for-pack Ocamlbuild_pack -w +L -w +R -w +Z -I src -I plugin-lib -I bin -I +unix -safe-string -bin-annot -strict-sequence -c src/glob_ast.ml
- ocamlopt.opt -for-pack Ocamlbuild_pack -w +L -w +R -w +Z -I src -I plugin-lib -I bin -I +unix -safe-string -bin-annot -strict-sequence -c src/glob_lexer.ml
- ocamlopt.opt -for-pack Ocamlbuild_pack -w +L -w +R -w +Z -I src -I plugin-lib -I bin -I +unix -safe-string -bin-annot -strict-sequence -c src/glob.ml
- ocamlopt.opt -for-pack Ocamlbuild_pack -w +L -w +R -w +Z -I src -I plugin-lib -I bin -I +unix -safe-string -bin-annot -strict-sequence -c src/lexers.ml
- ocamlopt.opt -for-pack Ocamlbuild_pack -w +L -w +R -w +Z -I src -I plugin-lib -I bin -I +unix -safe-string -bin-annot -strict-sequence -c src/param_tags.ml
- ocamlopt.opt -for-pack Ocamlbuild_pack -w +L -w +R -w +Z -I src -I plugin-lib -I bin -I +unix -safe-string -bin-annot -strict-sequence -c src/command.ml
- ocamlopt.opt -for-pack Ocamlbuild_pack -w +L -w +R -w +Z -I src -I plugin-lib -I bin -I +unix -safe-string -bin-annot -strict-sequence -c src/ocamlbuild_config.ml
- ocamlopt.opt -for-pack Ocamlbuild_pack -w +L -w +R -w +Z -I src -I plugin-lib -I bin -I +unix -safe-string -bin-annot -strict-sequence -c src/ocamlbuild_where.ml
- ocamlopt.opt -for-pack Ocamlbuild_pack -w +L -w +R -w +Z -I src -I plugin-lib -I bin -I +unix -safe-string -bin-annot -strict-sequence -c src/slurp.ml
- ocamlopt.opt -for-pack Ocamlbuild_pack -w +L -w +R -w +Z -I src -I plugin-lib -I bin -I +unix -safe-string -bin-annot -strict-sequence -c src/options.ml
- ocamlopt.opt -for-pack Ocamlbuild_pack -w +L -w +R -w +Z -I src -I plugin-lib -I bin -I +unix -safe-string -bin-annot -strict-sequence -c src/pathname.ml
- ocamlopt.opt -for-pack Ocamlbuild_pack -w +L -w +R -w +Z -I src -I plugin-lib -I bin -I +unix -safe-string -bin-annot -strict-sequence -c src/configuration.ml
- ocamlopt.opt -for-pack Ocamlbuild_pack -w +L -w +R -w +Z -I src -I plugin-lib -I bin -I +unix -safe-string -bin-annot -strict-sequence -c src/flags.ml
- ocamlopt.opt -for-pack Ocamlbuild_pack -w +L -w +R -w +Z -I src -I plugin-lib -I bin -I +unix -safe-string -bin-annot -strict-sequence -c src/hygiene.ml
- ocamlopt.opt -for-pack Ocamlbuild_pack -w +L -w +R -w +Z -I src -I plugin-lib -I bin -I +unix -safe-string -bin-annot -strict-sequence -c src/digest_cache.ml
- ocamlopt.opt -for-pack Ocamlbuild_pack -w +L -w +R -w +Z -I src -I plugin-lib -I bin -I +unix -safe-string -bin-annot -strict-sequence -c src/resource.ml
- ocamlopt.opt -for-pack Ocamlbuild_pack -w +L -w +R -w +Z -I src -I plugin-lib -I bin -I +unix -safe-string -bin-annot -strict-sequence -c src/rule.ml
- ocamlopt.opt -for-pack Ocamlbuild_pack -w +L -w +R -w +Z -I src -I plugin-lib -I bin -I +unix -safe-string -bin-annot -strict-sequence -c src/solver.ml
- ocamlopt.opt -for-pack Ocamlbuild_pack -w +L -w +R -w +Z -I src -I plugin-lib -I bin -I +unix -safe-string -bin-annot -strict-sequence -c src/report.ml
- ocamlopt.opt -for-pack Ocamlbuild_pack -w +L -w +R -w +Z -I src -I plugin-lib -I bin -I +unix -safe-string -bin-annot -strict-sequence -c src/tools.ml
- ocamlopt.opt -for-pack Ocamlbuild_pack -w +L -w +R -w +Z -I src -I plugin-lib -I bin -I +unix -safe-string -bin-annot -strict-sequence -c src/fda.ml
- ocamlopt.opt -for-pack Ocamlbuild_pack -w +L -w +R -w +Z -I src -I plugin-lib -I bin -I +unix -safe-string -bin-annot -strict-sequence -c src/findlib.ml
- ocamlopt.opt -for-pack Ocamlbuild_pack -w +L -w +R -w +Z -I src -I plugin-lib -I bin -I +unix -safe-string -bin-annot -strict-sequence -c src/ocaml_arch.ml
- ocamlopt.opt -for-pack Ocamlbuild_pack -w +L -w +R -w +Z -I src -I plugin-lib -I bin -I +unix -safe-string -bin-annot -strict-sequence -c src/ocaml_utils.ml
- ocamlopt.opt -for-pack Ocamlbuild_pack -w +L -w +R -w +Z -I src -I plugin-lib -I bin -I +unix -safe-string -bin-annot -strict-sequence -c src/ocaml_dependencies.ml
- ocamlopt.opt -for-pack Ocamlbuild_pack -w +L -w +R -w +Z -I src -I plugin-lib -I bin -I +unix -safe-string -bin-annot -strict-sequence -c src/ocaml_compiler.ml
- ocamlopt.opt -for-pack Ocamlbuild_pack -w +L -w +R -w +Z -I src -I plugin-lib -I bin -I +unix -safe-string -bin-annot -strict-sequence -c src/ocaml_tools.ml
- ocamlopt.opt -for-pack Ocamlbuild_pack -w +L -w +R -w +Z -I src -I plugin-lib -I bin -I +unix -safe-string -bin-annot -strict-sequence -c src/ocaml_specific.ml
- ocamlopt.opt -for-pack Ocamlbuild_pack -w +L -w +R -w +Z -I src -I plugin-lib -I bin -I +unix -safe-string -bin-annot -strict-sequence -c src/exit_codes.ml
- ocamlopt.opt -for-pack Ocamlbuild_pack -w +L -w +R -w +Z -I src -I plugin-lib -I bin -I +unix -safe-string -bin-annot -strict-sequence -c src/plugin.ml
- ocamlopt.opt -for-pack Ocamlbuild_pack -w +L -w +R -w +Z -I src -I plugin-lib -I bin -I +unix -safe-string -bin-annot -strict-sequence -c src/hooks.ml
- ocamlopt.opt -for-pack Ocamlbuild_pack -w +L -w +R -w +Z -I src -I plugin-lib -I bin -I +unix -safe-string -bin-annot -strict-sequence -c src/main.ml
- mkdir -p tmp
- ocamlopt.opt -pack src/const.cmx src/loc.cmx src/discard_printf.cmx src/signatures.cmi src/my_std.cmx src/my_unix.cmx src/tags.cmx src/display.cmx src/log.cmx src/shell.cmx src/bool.cmx src/glob_ast.cmx src/glob_lexer.cmx src/glob.cmx src/lexers.cmx src/param_tags.cmx src/command.cmx src/ocamlbuild_config.cmx src/ocamlbuild_where.cmx src/slurp.cmx src/options.cmx src/pathname.cmx src/configuration.cmx src/flags.cmx src/hygiene.cmx src/digest_cache.cmx src/resource.cmx src/rule.cmx src/solver.cmx src/report.cmx src/tools.cmx src/fda.cmx src/findlib.cmx src/ocaml_arch.cmx src/ocaml_utils.cmx src/ocaml_dependencies.cmx src/ocaml_compiler.cmx src/ocaml_tools.cmx src/ocaml_specific.cmx src/exit_codes.cmx src/plugin.cmx src/hooks.cmx src/main.cmx -o tmp/ocamlbuild_pack.cmx
- mv tmp/ocamlbuild_pack.cmx src/ocamlbuild_pack.cmx
- mv tmp/ocamlbuild_pack.o src/ocamlbuild_pack.o
- ocamlopt.opt -w +L -w +R -w +Z -I src -I plugin-lib -I bin -I +unix -safe-string -bin-annot -strict-sequence -c plugin-lib/ocamlbuild_plugin.ml
- ocamlopt.opt -w +L -w +R -w +Z -I src -I plugin-lib -I bin -I +unix -safe-string -bin-annot -strict-sequence -c plugin-lib/ocamlbuild_executor.ml
- ocamlopt.opt -w +L -w +R -w +Z -I src -I plugin-lib -I bin -I +unix -safe-string -bin-annot -strict-sequence -c plugin-lib/ocamlbuild_unix_plugin.ml
- ocamlopt.opt -w +L -w +R -w +Z -I src -I plugin-lib -I bin -I +unix -safe-string -bin-annot -strict-sequence -c bin/ocamlbuild.ml
- ocamlopt.opt -I +unix -I src -o ocamlbuild.native unix.cmxa src/ocamlbuild_pack.cmx plugin-lib/ocamlbuild_plugin.cmx plugin-lib/ocamlbuild_executor.cmx plugin-lib/ocamlbuild_unix_plugin.cmx bin/ocamlbuild.cmx
- ocamlopt.opt -a -o plugin-lib/ocamlbuildlib.cmxa src/ocamlbuild_pack.cmx plugin-lib/ocamlbuild_plugin.cmx plugin-lib/ocamlbuild_executor.cmx plugin-lib/ocamlbuild_unix_plugin.cmx
- ocamlc.opt src/ocamlbuild_pack.cmo -I src man/options_man.ml -o man/options_man.byte
- ./man/options_man.byte > man/ocamlbuild.options.1
- cat man/ocamlbuild.header.1 man/ocamlbuild.options.1 man/ocamlbuild.footer.1 > man/ocamlbuild.1
- make ocamlbuild.install
- make[1]: Entering directory '/home/opam/.opam/5.0+alpha-repo/.opam-switch/build/ocamlbuild.0.14.2'
- rm -f ocamlbuild.install
- touch ocamlbuild.install
- make install-bin-opam
- make[2]: Entering directory '/home/opam/.opam/5.0+alpha-repo/.opam-switch/build/ocamlbuild.0.14.2'
- echo 'bin: [' >> ocamlbuild.install
- echo '  "ocamlbuild.byte" {"ocamlbuild.byte"}' >> ocamlbuild.install
- echo '  "ocamlbuild.native" {"ocamlbuild.native"}' >> ocamlbuild.install
- echo '  "ocamlbuild.native" {"ocamlbuild"}' >> ocamlbuild.install
- echo ']' >> ocamlbuild.install
- echo >> ocamlbuild.install
- make[2]: Leaving directory '/home/opam/.opam/5.0+alpha-repo/.opam-switch/build/ocamlbuild.0.14.2'
- make install-lib-opam
- make[2]: Entering directory '/home/opam/.opam/5.0+alpha-repo/.opam-switch/build/ocamlbuild.0.14.2'
- echo 'lib: [' >> ocamlbuild.install
- make install-lib-basics-opam
- make[3]: Entering directory '/home/opam/.opam/5.0+alpha-repo/.opam-switch/build/ocamlbuild.0.14.2'
- echo '  "ocamlbuild.opam" {"opam"}' >> ocamlbuild.install
- echo '  "META"' >> ocamlbuild.install
- for lib in src/signatures.mli src/signatures.cmi src/signatures.cmti; do \
-   echo "  \"$lib\" {\"$(basename $lib)\"}" >> ocamlbuild.install; \
- done
- make[3]: Leaving directory '/home/opam/.opam/5.0+alpha-repo/.opam-switch/build/ocamlbuild.0.14.2'
- make install-lib-byte-opam
- make[3]: Entering directory '/home/opam/.opam/5.0+alpha-repo/.opam-switch/build/ocamlbuild.0.14.2'
- for lib in plugin-lib/ocamlbuildlib.cma bin/ocamlbuild.cmo src/ocamlbuild_pack.cmi plugin-lib/ocamlbuild_plugin.cmi plugin-lib/ocamlbuild_executor.cmi plugin-lib/ocamlbuild_unix_plugin.cmi; do \
-   echo "  \"$lib\" {\"$(basename $lib)\"}" >> ocamlbuild.install; \
- done
- make[3]: Leaving directory '/home/opam/.opam/5.0+alpha-repo/.opam-switch/build/ocamlbuild.0.14.2'
- make install-lib-native-opam
- make[3]: Entering directory '/home/opam/.opam/5.0+alpha-repo/.opam-switch/build/ocamlbuild.0.14.2'
- for lib in plugin-lib/ocamlbuildlib.cmxa plugin-lib/ocamlbuildlib.a bin/ocamlbuild.cmx bin/ocamlbuild.o src/ocamlbuild_pack.cmx plugin-lib/ocamlbuild_plugin.cmx plugin-lib/ocamlbuild_executor.cmx plugin-lib/ocamlbuild_unix_plugin.cmx plugin-lib/ocamlbuild_plugin.o plugin-lib/ocamlbuild_executor.o plugin-lib/ocamlbuild_unix_plugin.o; do \
-   echo "  \"$lib\" {\"$(basename $lib)\"}" >> ocamlbuild.install; \
- done
- make[3]: Leaving directory '/home/opam/.opam/5.0+alpha-repo/.opam-switch/build/ocamlbuild.0.14.2'
- echo ']' >> ocamlbuild.install
- echo >> ocamlbuild.install
- make[2]: Leaving directory '/home/opam/.opam/5.0+alpha-repo/.opam-switch/build/ocamlbuild.0.14.2'
- make install-man-opam
- make[2]: Entering directory '/home/opam/.opam/5.0+alpha-repo/.opam-switch/build/ocamlbuild.0.14.2'
- echo 'man: [' >> ocamlbuild.install
- echo '  "man/ocamlbuild.1" {"man1/ocamlbuild.1"}' >> ocamlbuild.install
- echo ']' >> ocamlbuild.install
- echo >> ocamlbuild.install
- make[2]: Leaving directory '/home/opam/.opam/5.0+alpha-repo/.opam-switch/build/ocamlbuild.0.14.2'
- make install-doc-opam
- make[2]: Entering directory '/home/opam/.opam/5.0+alpha-repo/.opam-switch/build/ocamlbuild.0.14.2'
- echo 'doc: [' >> ocamlbuild.install
- echo '  "LICENSE"' >> ocamlbuild.install
- echo '  "Changes"' >> ocamlbuild.install
- echo '  "Readme.md"' >> ocamlbuild.install
- echo ']' >> ocamlbuild.install
- make[2]: Leaving directory '/home/opam/.opam/5.0+alpha-repo/.opam-switch/build/ocamlbuild.0.14.2'
- make[1]: Leaving directory '/home/opam/.opam/5.0+alpha-repo/.opam-switch/build/ocamlbuild.0.14.2'
-> compiled  ocamlbuild.0.14.2
Processing 13/31: [dune: ocaml bootstrap.ml] [ocamlfind: make install]
+ /home/opam/.opam/opam-init/hooks/sandbox.sh "install" "make" "install" (CWD=/home/opam/.opam/5.0+alpha-repo/.opam-switch/build/ocamlfind.1.9.5)
- if [ "1" -eq 1 ]; then \
-     for x in camlp4 dbm graphics labltk num ocamlbuild; do \
-       if [ -f "/home/opam/.opam/5.0+alpha-repo/lib/$x/META" ]; then \
-         if ! grep -Fq '[distributed with Ocaml]' "//home/opam/.opam/5.0+alpha-repo/lib/$x/META"; then \
-           rm -f site-lib-src/$x/META; \
-         fi; \
-       fi; \
-     done; \
-     test -f "site-lib-src/num/META" || rm -f "site-lib-src/num-top/META"; \
-   fi
- echo 'SITELIB_META =' > Makefile.packages.in
- for x in `ls site-lib-src`; do test ! -f "site-lib-src/$x/META" || echo $x >> Makefile.packages.in; done
- tr '\n' ' ' < Makefile.packages.in > Makefile.packages
- rm Makefile.packages.in
- install -d "/home/opam/.opam/5.0+alpha-repo/bin"
- install -d "/home/opam/.opam/5.0+alpha-repo/man"
- make install-config
- make[1]: Entering directory '/home/opam/.opam/5.0+alpha-repo/.opam-switch/build/ocamlfind.1.9.5'
- install -d "`dirname \"/home/opam/.opam/5.0+alpha-repo/lib/findlib.conf\"`"
- test -f "/home/opam/.opam/5.0+alpha-repo/lib/findlib.conf" || install -c findlib.conf "/home/opam/.opam/5.0+alpha-repo/lib/findlib.conf"
- make[1]: Leaving directory '/home/opam/.opam/5.0+alpha-repo/.opam-switch/build/ocamlfind.1.9.5'
- for p in findlib; do ( cd src/$p; make install ); done
- make[1]: Entering directory '/home/opam/.opam/5.0+alpha-repo/.opam-switch/build/ocamlfind.1.9.5/src/findlib'
- install -d "/home/opam/.opam/5.0+alpha-repo/lib/findlib"
- install -d "/home/opam/.opam/5.0+alpha-repo/bin"
- test 1 -eq 0 || install -d "/home/opam/.opam/5.0+alpha-repo/lib/ocaml"
- test 1 -eq 0 || install -c topfind "/home/opam/.opam/5.0+alpha-repo/lib/ocaml/"
- files=` ../../tools/collect_files ../../Makefile.config \
- findlib.cmi findlib.mli findlib.cma findlib.cmxa findlib.a findlib.cmxs \
- findlib_config.cmi findlib_config.ml topfind.cmi topfind.mli \
- fl_args.cmi fl_lint.cmi fl_meta.cmi fl_split.cmi fl_topo.cmi ocaml_args.cmi \
- fl_package_base.mli fl_package_base.cmi fl_metascanner.mli fl_metascanner.cmi \
- fl_metatoken.cmi findlib_top.cma findlib_top.cmxa findlib_top.a findlib_top.cmxs \
- findlib_dynload.cma findlib_dynload.cmxa findlib_dynload.a findlib_dynload.cmxs fl_dynload.mli fl_dynload.cmi \
- META` && \
- install -c $files "/home/opam/.opam/5.0+alpha-repo/lib/findlib/"
- f="ocamlfind"; { test -f ocamlfind_opt && f="ocamlfind_opt"; }; \
- install -c $f "/home/opam/.opam/5.0+alpha-repo/bin/ocamlfind"
- # the following "if" block is only needed for 4.00beta2
- if [ 1 -eq 0 -a -f "/home/opam/.opam/5.0+alpha-repo/lib/ocaml/compiler-libs/topdirs.cmi" ]; then \
-     cd "/home/opam/.opam/5.0+alpha-repo/lib/ocaml/compiler-libs/"; \
-     install -c topdirs.cmi toploop.cmi "/home/opam/.opam/5.0+alpha-repo/lib/findlib/"; \
- fi
- make[1]: Leaving directory '/home/opam/.opam/5.0+alpha-repo/.opam-switch/build/ocamlfind.1.9.5/src/findlib'
- make install-meta
- make[1]: Entering directory '/home/opam/.opam/5.0+alpha-repo/.opam-switch/build/ocamlfind.1.9.5'
- for x in bytes compiler-libs dynlink ocamldoc runtime_events stdlib str threads unix ; do install -d "/home/opam/.opam/5.0+alpha-repo/lib/$x"; install -c site-lib-src/$x/META "/home/opam/.opam/5.0+alpha-repo/lib/$x/META.tmp" && mv "/home/opam/.opam/5.0+alpha-repo/lib/$x/META.tmp" "/home/opam/.opam/5.0+alpha-repo/lib/$x/META"; done
- install -d "/home/opam/.opam/5.0+alpha-repo/lib/findlib"; install -c Makefile.packages "/home/opam/.opam/5.0+alpha-repo/lib/findlib/Makefile.packages"
- make[1]: Leaving directory '/home/opam/.opam/5.0+alpha-repo/.opam-switch/build/ocamlfind.1.9.5'
- test ! -f 'site-lib-src/num-top/META' || { cd src/findlib; make install-num-top; }
- test ! -f 'site-lib-src/camlp4/META' ||	install -c tools/safe_camlp4 "/home/opam/.opam/5.0+alpha-repo/bin"
- make install-doc
- make[1]: Entering directory '/home/opam/.opam/5.0+alpha-repo/.opam-switch/build/ocamlfind.1.9.5'
- install -d "/home/opam/.opam/5.0+alpha-repo/man/man1" "/home/opam/.opam/5.0+alpha-repo/man/man3" "/home/opam/.opam/5.0+alpha-repo/man/man5"
- install -c doc/ref-man/ocamlfind.1 "/home/opam/.opam/5.0+alpha-repo/man/man1"
- install -c doc/ref-man/META.5 doc/ref-man/site-lib.5 doc/ref-man/findlib.conf.5 "/home/opam/.opam/5.0+alpha-repo/man/man5"
- make[1]: Leaving directory '/home/opam/.opam/5.0+alpha-repo/.opam-switch/build/ocamlfind.1.9.5'
-> installed ocamlfind.1.9.5
Processing 13/31: [dune: ocaml bootstrap.ml]
Processing 14/31: [dune: ocaml bootstrap.ml] [nonstd: ocaml please.ml]
-> installed ocamlbuild.0.14.2
Processing 15/31: [dune: ocaml bootstrap.ml] [nonstd: ocaml please.ml]
+ /home/opam/.opam/opam-init/hooks/sandbox.sh "build" "ocaml" "please.ml" "build" (CWD=/home/opam/.opam/5.0+alpha-repo/.opam-switch/build/nonstd.0.0.2)
- Please-> Building
- ! cp ../nonstd.ml .
- ! ocamlfind ocamlc  -c nonstd.ml -o nonstd.cmo
- File "nonstd.ml", line 296, characters 22-40:
- 296 |   let dedup ?(compare=Pervasives.compare) list =
-                             ^^^^^^^^^^^^^^^^^^
- Error: Unbound module Pervasives
- Exception:
- Failure "\"ocamlfind ocamlc  -c nonstd.ml -o nonstd.cmo\" failed.".
[ERROR] The compilation of nonstd.0.0.2 failed at "ocaml please.ml build".
Processing 15/31: [dune: ocaml bootstrap.ml]
Processing 16/31: [dune: ocaml bootstrap.ml]
+ /home/opam/.opam/opam-init/hooks/sandbox.sh "build" "ocaml" "bootstrap.ml" "-j" "47" (CWD=/home/opam/.opam/5.0+alpha-repo/.opam-switch/build/dune.3.5.0)
- ocamlc -output-complete-exe -w -24 -g -o .duneboot.exe -I boot -I +unix unix.cma boot/libs.ml boot/duneboot.ml
- ./.duneboot.exe -j 47
- cd _boot && /home/opam/.opam/5.0+alpha-repo/bin/ocamlopt.opt -c -g -no-alias-deps -w -49-6 -alert -unstable -I +unix -I +threads build_path_prefix_map.ml
- File "vendor/build_path_prefix_map/src/build_path_prefix_map.ml", line 5, characters 17-31:
- Alert deprecated: Stdlib.Printf.kprintf
- Use Printf.ksprintf instead.
- cd _boot && /home/opam/.opam/5.0+alpha-repo/bin/ocamlopt.opt -c -g -no-alias-deps -w -49-6 -alert -unstable -I +unix -I +threads opamLexer.ml
- File "vendor/opam-file-format/src/opamLexer.mll", line 21, characters 2-16:
- Alert deprecated: Stdlib.Printf.kprintf
- Use Printf.ksprintf instead.
- 

Processing 16/31: [dune: ./dune.exe build]
+ /home/opam/.opam/opam-init/hooks/sandbox.sh "build" "./dune.exe" "build" "dune.install" "--release" "--profile" "dune-bootstrap" "-j" "47" (CWD=/home/opam/.opam/5.0+alpha-repo/.opam-switch/build/dune.3.5.0)
-> compiled  dune.3.5.0
-> installed dune.3.5.0
Processing 18/31: [easy-format: dune build]
Processing 19/31: [easy-format: dune build] [menhirLib: dune build]
Processing 20/31: [easy-format: dune build] [menhirLib: dune build] [menhirSdk: dune build]
Processing 21/31: [easy-format: dune build] [menhirLib: dune build] [menhirSdk: dune build] [smart-print: dune build]
+ /home/opam/.opam/opam-init/hooks/sandbox.sh "build" "dune" "build" "-p" "easy-format" "-j" "47" "@install" (CWD=/home/opam/.opam/5.0+alpha-repo/.opam-switch/build/easy-format.1.3.4)
-> compiled  easy-format.1.3.4
Processing 21/31: [menhirLib: dune build] [menhirSdk: dune build] [smart-print: dune build]
-> installed easy-format.1.3.4
Processing 22/31: [menhirLib: dune build] [menhirSdk: dune build] [smart-print: dune build]
+ /home/opam/.opam/opam-init/hooks/sandbox.sh "build" "dune" "build" "-p" "smart-print" "-j" "47" (CWD=/home/opam/.opam/5.0+alpha-repo/.opam-switch/build/smart-print.0.3.0)
-> compiled  smart-print.0.3.0
Processing 22/31: [menhirLib: dune build] [menhirSdk: dune build]
-> installed smart-print.0.3.0
Processing 23/31: [menhirLib: dune build] [menhirSdk: dune build]
+ /home/opam/.opam/opam-init/hooks/sandbox.sh "build" "dune" "build" "-p" "menhirSdk" "-j" "47" (CWD=/home/opam/.opam/5.0+alpha-repo/.opam-switch/build/menhirSdk.20211012)
-> compiled  menhirSdk.20211012
Processing 23/31: [menhirLib: dune build]
-> installed menhirSdk.20211012
Processing 24/31: [menhirLib: dune build]
+ /home/opam/.opam/opam-init/hooks/sandbox.sh "build" "dune" "build" "-p" "menhirLib" "-j" "47" (CWD=/home/opam/.opam/5.0+alpha-repo/.opam-switch/build/menhirLib.20211012)
- (cd _build/default/lib/pack && ./pack.exe)
- Creating menhirLib.ml...
- Creating menhirLib.mli...
-> compiled  menhirLib.20211012
-> installed menhirLib.20211012
Processing 26/31: [menhir: dune build]
+ /home/opam/.opam/opam-init/hooks/sandbox.sh "build" "dune" "build" "-p" "menhir" "-j" "47" (CWD=/home/opam/.opam/5.0+alpha-repo/.opam-switch/build/menhir.20211012)
- (cd _build/default/src/stage2 && .bin/menhir --no-pager --table --fixed-exception --require-aliases --strict parser.mly --compare-errors parserMessages.auto.messages --compare-errors parserMessages.messages) > _build/default/src/stage2/parserMessages.check
- Read 101 sample input sentences and 101 error messages.
- Read 101 sample input sentences and 48 error messages.
- (cd _build/default && src/stage2/.bin/menhir --no-pager --table --fixed-exception --require-aliases --strict --strict -lg 1 -la 1 -lc 1 -v src/stage2/parser.mly --base src/stage2/parser --infer-read-reply src/stage2/parser__mock.mli.inferred)
- Grammar has 56 nonterminal symbols, among which 1 start symbols.
- Grammar has 37 terminal symbols.
- Grammar has 129 productions.
- Built an LR(0) automaton with 194 states.
- The grammar is not SLR(1) -- 5 states have a conflict.
- The construction mode is no-pager.
- Built an LR(1) automaton with 298 states.
- One shift/reduce conflict was silently solved.
- Extra reductions on error were added in 40 states.
- Priority played a role in 0 of these states.
- 152 out of 298 states have a default reduction.
- 102 out of 298 states are represented.
- 44 out of 96 symbols keep track of their start position.
- 48 out of 96 symbols keep track of their end position.
- The action table is 11324 entries; 1610 non-zero; 1359 compressed.
- The action table occupies roughly 2816 bytes.
- The goto table is 16986 entries; 329 non-zero; 636 compressed.
- The goto table occupies roughly 1368 bytes.
- The error table occupies roughly 1448 bytes.
- The default_reduction table occupies roughly 336 bytes.
- The lhs table occupies roughly 168 bytes.
- The trace table occupies roughly 8 bytes.
- (cd _build/default/src/stage2 && .bin/menhir --no-pager --table --fixed-exception --require-aliases --strict parser.mly --compile-errors parserMessages.messages) > _build/default/src/stage2/parserMessages.ml
- Read 101 sample input sentences and 48 error messages.
-> compiled  menhir.20211012
-> installed menhir.20211012
Processing 28/31: [atd: make]
+ /home/opam/.opam/opam-init/hooks/sandbox.sh "build" "make" (CWD=/home/opam/.opam/5.0+alpha-repo/.opam-switch/build/atd.1.2.0)
- echo 'let version = "1.2.0"' > atd_version.ml
- menhir atd_parser.mly
- ocamlfind ocamldep -package "easy-format unix str" atd_ast.mli atd_annot.mli atd_parser.mli atd_doc.mli atd_print.mli atd_expand.mli atd_inherit.mli atd_util.mli atd_reflect.mli atd_indent.mli atd_version.ml atd_ast.ml atd_annot.ml atd_parser.ml atd_lexer.ml atd_doc_lexer.ml atd_doc.ml atd_print.ml atd_predef.ml atd_check.ml atd_expand.ml atd_inherit.ml atd_sort.ml atd_util.ml atd_reflect.ml atd_indent.ml > dep
- echo 1.2.0 > VERSION
- echo 'version = "1.2.0"' > META
- cat META.in >> META
- ocamlfind ocamlc -dtypes -g -c -package "easy-format unix str" atd_version.ml
- ocamlfind ocamlc -dtypes -g -c -package "easy-format unix str" atd_ast.mli
- ocamlfind ocamlc -dtypes -g -c -package "easy-format unix str" atd_annot.mli
- ocamlfind ocamlc -dtypes -g -c -package "easy-format unix str" atd_parser.mli
- ocamllex atd_lexer.mll
- 72 states, 1997 transitions, table size 8420 bytes
- ocamlfind ocamlc -dtypes -g -c -package "easy-format unix str" atd_lexer.ml
- ocamllex atd_doc_lexer.mll
- 46 states, 313 transitions, table size 1528 bytes
- ocamlfind ocamlc -dtypes -g -c -package "easy-format unix str" atd_doc_lexer.ml
- ocamlfind ocamlc -dtypes -g -c -package "easy-format unix str" atd_doc.mli
- ocamlfind ocamlc -dtypes -g -c -package "easy-format unix str" atd_print.mli
- ocamlfind ocamlc -dtypes -g -c -package "easy-format unix str" atd_predef.ml
- ocamlfind ocamlc -dtypes -g -c -package "easy-format unix str" atd_check.ml
- ocamlfind ocamlc -dtypes -g -c -package "easy-format unix str" atd_expand.mli
- ocamlfind ocamlc -dtypes -g -c -package "easy-format unix str" atd_inherit.mli
- ocamlfind ocamlc -dtypes -g -c -package "easy-format unix str" atd_sort.mli
- ocamlfind ocamlc -dtypes -g -c -package "easy-format unix str" atd_util.mli
- ocamlfind ocamlc -dtypes -g -c -package "easy-format unix str" atd_reflect.mli
- ocamlfind ocamlc -dtypes -g -c -package "easy-format unix str" atd_indent.mli
- ocamlfind ocamlc -dtypes -g -c -package "easy-format unix str" atd_ast.ml
- ocamlfind ocamlc -dtypes -g -c -package "easy-format unix str" atd_annot.ml
- ocamlfind ocamlc -dtypes -g -c -package "easy-format unix str" atd_parser.ml
- ocamlfind ocamlc -dtypes -g -c -package "easy-format unix str" atd_doc.ml
- ocamlfind ocamlc -dtypes -g -c -package "easy-format unix str" atd_print.ml
- ocamlfind ocamlc -dtypes -g -c -package "easy-format unix str" atd_expand.ml
- ocamlfind ocamlc -dtypes -g -c -package "easy-format unix str" atd_inherit.ml
- ocamlfind ocamlc -dtypes -g -c -package "easy-format unix str" atd_sort.ml
- File "atd_sort.ml", line 53, characters 24-42:
- 53 |       let compare a b = Pervasives.compare a.id b.id
-                              ^^^^^^^^^^^^^^^^^^
- Error: Unbound module Pervasives
- make: *** [Makefile:115: atd_sort.cmo] Error 2
[ERROR] The compilation of atd.1.2.0 failed at "make".

#=== ERROR while compiling nonstd.0.0.2 =======================================#
# context              2.2.0~alpha~dev | linux/x86_64 | ocaml-variants.5.0.0+trunk | file:///home/opam/opam-repository
# path                 ~/.opam/5.0+alpha-repo/.opam-switch/build/nonstd.0.0.2
# command              ~/.opam/opam-init/hooks/sandbox.sh build ocaml please.ml build
# exit-code            2
# env-file             ~/.opam/log/nonstd-8-b65f61.env
# output-file          ~/.opam/log/nonstd-8-b65f61.out
### output ###
# Please-> Building
# ! cp ../nonstd.ml .
# ! ocamlfind ocamlc  -c nonstd.ml -o nonstd.cmo
# File "nonstd.ml", line 296, characters 22-40:
# 296 |   let dedup ?(compare=Pervasives.compare) list =
#                             ^^^^^^^^^^^^^^^^^^
# Error: Unbound module Pervasives
# Exception:
# Failure "\"ocamlfind ocamlc  -c nonstd.ml -o nonstd.cmo\" failed.".


#=== ERROR while compiling atd.1.2.0 ==========================================#
# context              2.2.0~alpha~dev | linux/x86_64 | ocaml-variants.5.0.0+trunk | file:///home/opam/opam-repository
# path                 ~/.opam/5.0+alpha-repo/.opam-switch/build/atd.1.2.0
# command              ~/.opam/opam-init/hooks/sandbox.sh build make
# exit-code            2
# env-file             ~/.opam/log/atd-8-001763.env
# output-file          ~/.opam/log/atd-8-001763.out
### output ###
# echo 'let version = "1.2.0"' > atd_version.ml
# menhir atd_parser.mly
# ocamlfind ocamldep -package "easy-format unix str" atd_ast.mli atd_annot.mli atd_parser.mli atd_doc.mli atd_print.mli atd_expand.mli atd_inherit.mli atd_util.mli atd_reflect.mli atd_indent.mli atd_version.ml atd_ast.ml atd_annot.ml atd_parser.ml atd_lexer.ml atd_doc_lexer.ml atd_doc.ml atd_print.ml atd_predef.ml atd_check.ml atd_expand.ml atd_inherit.ml atd_sort.ml atd_util.ml atd_reflect.ml atd_indent.ml > dep
# echo 1.2.0 > VERSION
# echo 'version = "1.2.0"' > META
# cat META.in >> META
# ocamlfind ocamlc -dtypes -g -c -package "easy-format unix str" atd_version.ml
# ocamlfind ocamlc -dtypes -g -c -package "easy-format unix str" atd_ast.mli
# ocamlfind ocamlc -dtypes -g -c -package "easy-format unix str" atd_annot.mli
# ocamlfind ocamlc -dtypes -g -c -package "easy-format unix str" atd_parser.mli
# ocamllex atd_lexer.mll
# 72 states, 1997 transitions, table size 8420 bytes
# ocamlfind ocamlc -dtypes -g -c -package "easy-format unix str" atd_lexer.ml
# ocamllex atd_doc_lexer.mll
# 46 states, 313 transitions, table size 1528 bytes
# ocamlfind ocamlc -dtypes -g -c -package "easy-format unix str" atd_doc_lexer.ml
# ocamlfind ocamlc -dtypes -g -c -package "easy-format unix str" atd_doc.mli
# ocamlfind ocamlc -dtypes -g -c -package "easy-format unix str" atd_print.mli
# ocamlfind ocamlc -dtypes -g -c -package "easy-format unix str" atd_predef.ml
# ocamlfind ocamlc -dtypes -g -c -package "easy-format unix str" atd_check.ml
# ocamlfind ocamlc -dtypes -g -c -package "easy-format unix str" atd_expand.mli
# ocamlfind ocamlc -dtypes -g -c -package "easy-format unix str" atd_inherit.mli
# ocamlfind ocamlc -dtypes -g -c -package "easy-format unix str" atd_sort.mli
# ocamlfind ocamlc -dtypes -g -c -package "easy-format unix str" atd_util.mli
# ocamlfind ocamlc -dtypes -g -c -package "easy-format unix str" atd_reflect.mli
# ocamlfind ocamlc -dtypes -g -c -package "easy-format unix str" atd_indent.mli
# ocamlfind ocamlc -dtypes -g -c -package "easy-format unix str" atd_ast.ml
# ocamlfind ocamlc -dtypes -g -c -package "easy-format unix str" atd_annot.ml
# ocamlfind ocamlc -dtypes -g -c -package "easy-format unix str" atd_parser.ml
# ocamlfind ocamlc -dtypes -g -c -package "easy-format unix str" atd_doc.ml
# ocamlfind ocamlc -dtypes -g -c -package "easy-format unix str" atd_print.ml
# ocamlfind ocamlc -dtypes -g -c -package "easy-format unix str" atd_expand.ml
# ocamlfind ocamlc -dtypes -g -c -package "easy-format unix str" atd_inherit.ml
# ocamlfind ocamlc -dtypes -g -c -package "easy-format unix str" atd_sort.ml
# File "atd_sort.ml", line 53, characters 24-42:
# 53 |       let compare a b = Pervasives.compare a.id b.id
#                              ^^^^^^^^^^^^^^^^^^
# Error: Unbound module Pervasives
# make: *** [Makefile:115: atd_sort.cmo] Error 2



<><> Error report <><><><><><><><><><><><><><><><><><><><><><><><><><><><><><><>
+- The following actions were aborted
| - install atd2cconv 0.0.0
+- 
+- The following actions failed
| - build atd    1.2.0
| - build nonstd 0.0.2
+- 
+- The following changes have been performed (the rest was aborted)
| - install dune        3.5.0
| - install easy-format 1.3.4
| - install menhir      20211012
| - install menhirLib   20211012
| - install menhirSdk   20211012
| - install ocamlbuild  0.14.2
| - install ocamlfind   1.9.5
| - install smart-print 0.3.0
+- 
# Run eval $(opam env) to update the current shell environment

The former state can be restored with:
    /usr/bin/opam switch import "/home/opam/.opam/5.0+alpha-repo/.opam-switch/backup/state-20221115085503.export"
'opam install -vy atd2cconv.0.0.0' failed.
"/bin/bash" "-c"
"
opam remove -y "atd2cconv.0.0.0"
opam install -vy "atd2cconv.0.0.0"
res=$?
if [ $res = 31 ]; then
    if opam show -f x-ci-accept-failures: "atd2cconv.0.0.0" | grep -q '"debian-unstable"'; then
        echo "This package failed and has been disabled for CI using the 'x-ci-accept-failures' field."
        exit 69
    fi
fi


exit $res
" failed with exit status 31
Failed: Build failed