OCamllabs icon Home|Differences with the last checks|Previous runs


Building on x86-bm-3.ocamllabs.io

(from ocaml/opam:debian-unstable@sha256:a20618cee40a09b4c7604919411db28c4ae473b9780730085f91824e8dd5f205)
2022-09-02 11:44.09 ---> using "00583e82ec888c922d57db664b8acb62b642829c5a4a94b17a44e5693b1db2de" from cache

/: (user (uid 1000) (gid 1000))

/: (env OPAMPRECISETRACKING 1)

/: (env OPAMUTF8 never)

/: (env OPAMEXTERNALSOLVER builtin-0install)

/: (env OPAMCRITERIA +removed)

/: (run (shell "sudo ln -f /usr/bin/opam-dev /usr/bin/opam"))
2022-09-02 11:44.09 ---> using "f816199fc982412d3ea70ae1ae1bab135eea82bc7670ac5d731bc57d0733e3c4" from cache

/: (run (network host)
        (shell "rm -rf ~/opam-repository && git clone -q 'https://github.com/ocaml/opam-repository' ~/opam-repository && git -C ~/opam-repository checkout -q 418227c38ed4e28a0827786e5e9e50b9547c0b27"))
2022-09-02 11:44.09 ---> using "4cabcce7a0cb6de31986471b51abc9f1f3fec6a75be6e83e549da867c7605e5a" from cache

/: (run (shell "rm -rf ~/.opam && opam init -ya --bare --config ~/.opamrc-sandbox ~/opam-repository"))
Configuring from /home/opam/.opamrc-sandbox, then /home/opam/.opamrc, and finally from built-in defaults.
Checking for available remotes: rsync and local, git.
  - you won't be able to use mercurial repositories unless you install the hg command on your system.
  - you won't be able to use darcs repositories unless you install the darcs command on your system.


<><> Fetching repository information ><><><><><><><><><><><><><><><><><><><><><>
[default] Initialised

User configuration:
  ~/.profile is already up-to-date.
[NOTE] Make sure that ~/.profile is well sourced in your ~/.bashrc.

2022-09-02 11:44.09 ---> using "d451da695ab21573c7bdead4176eec083b0218f568c4ccf5f5b38b162d64d4d7" from cache

/: (run (network host)
        (shell "git clone -q 'https://github.com/kit-ty-kate/opam-alpha-repository' ~/'alpha' && git -C ~/'alpha' checkout -q 6c5c682bd9208419bc24faaa163e42e74cb4e9a5"))
2022-09-02 11:44.09 ---> using "6df2c126a9b1ccede02c2b3fd26d0561e2107be8c6304477ccb8de0a479f33c1" from cache

/: (run (shell "opam repository add --dont-select 'alpha' ~/'alpha'"))
[alpha] Initialised
2022-09-02 11:44.09 ---> using "36c2866864e62ed4ca7db324088339d0b6f8bfe49e44038af6b20b9d54e88efd" from cache

/: (run (cache (opam-archives (target /home/opam/.opam/download-cache)))
        (network host)
        (shell "opam switch create --repositories=alpha,default '5.0+alpha-repo' '5.0.0+trunk'"))

<><> Installing new switch packages <><><><><><><><><><><><><><><><><><><><><><>
Switch invariant: ["ocaml-variants" {= "5.0.0+trunk"}]

<><> Processing actions <><><><><><><><><><><><><><><><><><><><><><><><><><><><>
-> installed base-bigarray.base
-> installed base-threads.base
-> installed base-unix.base
-> retrieved ocaml-variants.5.0.0+trunk  (https://github.com/ocaml/ocaml/archive/5.0.tar.gz)
-> installed ocaml-variants.5.0.0+trunk
-> installed ocaml-config.3
-> installed ocaml.5.0.0
-> installed base-domains.base
-> installed base-nnp.base
Done.
# Run eval $(opam env --switch=5.0+alpha-repo) to update the current shell environment
2022-09-02 11:44.09 ---> using "d0af8b0acc9dfb423091d8298ed9937c524ea943b8afa3166209172a10c7c646" from cache

/: (run (network host)
        (shell "opam update --depexts"))
+ /usr/bin/sudo "apt-get" "update"
- Get:1 http://deb.debian.org/debian unstable InRelease [192 kB]
- Get:2 http://deb.debian.org/debian unstable/main amd64 Packages.diff/Index [63.6 kB]
- Get:3 http://deb.debian.org/debian unstable/main amd64 Packages T-2022-09-02-0804.09-F-2022-08-29-1405.22.pdiff [252 kB]
- Get:3 http://deb.debian.org/debian unstable/main amd64 Packages T-2022-09-02-0804.09-F-2022-08-29-1405.22.pdiff [252 kB]
- Fetched 508 kB in 3s (203 kB/s)
- Reading package lists...
- 
2022-09-02 11:44.09 ---> using "26b19488803a26f98ff4a26939ab35d3570fd165e979664e48d2aced1a5c2b5a" from cache

/: (run (cache (opam-archives (target /home/opam/.opam/download-cache)))
        (network host)
        (shell  "\
               \nopam remove -y \"amqp-client-async.2.2.2\"\
               \nopam install -vy \"amqp-client-async.2.2.2\"\
               \nres=$?\
               \nif [ $res = 31 ]; then\
               \n    if opam show -f x-ci-accept-failures: \"amqp-client-async.2.2.2\" | grep -q '\"debian-unstable\"'; then\
               \n        echo \"This package failed and has been disabled for CI using the 'x-ci-accept-failures' field.\"\
               \n        exit 69\
               \n    fi\
               \nfi\
               \n\
               \n\
               \nexit $res\
               \n"))
Nothing to do.
[NOTE] amqp-client-async.2.2.2 is not installed.

The following actions will be performed:
=== install 90 packages
  - install amqp-client                 2.2.2                [required by amqp-client-async]
  - install amqp-client-async           2.2.2
  - install angstrom                    0.15.0               [required by uri]
  - install async                       v0.15.0              [required by amqp-client-async]
  - install async_kernel                v0.15.0              [required by async]
  - install async_rpc_kernel            v0.15.0              [required by async]
  - install async_unix                  v0.15.0              [required by async]
  - install base                        v0.15.1~5.0preview   [required by core, core_kernel]
  - install base-bytes                  base                 [required by ocplib-endian]
  - install base_bigstring              v0.15.0              [required by core]
  - install base_quickcheck             v0.15.0              [required by core]
  - install bigstringaf                 0.9.0                [required by angstrom]
  - install bin_prot                    v0.15.0              [required by core]
  - install conf-pkg-config             2                    [required by bigstringaf]
  - install core                        v0.15.0.1~alpha-repo [required by async]
  - install core_kernel                 v0.15.0              [required by async]
  - install core_unix                   v0.15.0.1~alpha-repo [required by async]
  - install cppo                        1.6.9                [required by ocplib-endian]
  - install csexp                       1.5.1                [required by dune-configurator]
  - install dune                        3.4.1                [required by amqp-client-async]
  - install dune-configurator           3.4.1                [required by base, ocaml_intrinsics]
  - install expect_test_helpers_core    v0.15.0              [required by core_unix]
  - install ezxmlm                      1.1.0                [required by amqp-client]
  - install fieldslib                   v0.15.0              [required by core]
  - install int_repr                    v0.15.0              [required by core_kernel]
  - install jane-street-headers         v0.15.0              [required by core, core_unix]
  - install jst-config                  v0.15.1              [required by core, core_unix]
  - install num                         1.4                  [required by sexplib]
  - install ocaml-compiler-libs         v0.12.4              [required by ppxlib]
  - install ocaml-syntax-shims          1.0.0                [required by angstrom]
  - install ocaml_intrinsics            v0.15.2              [required by core_unix]
  - install ocamlbuild                  0.14.1               [required by xmlm]
  - install ocamlfind                   1.9.5                [required by xml-light]
  - install ocplib-endian               1.2                  [required by amqp-client-async]
  - install parsexp                     v0.15.0              [required by sexplib]
  - install ppx_assert                  v0.15.0              [required by core]
  - install ppx_base                    v0.15.0              [required by core]
  - install ppx_bench                   v0.15.0              [required by ppx_jane]
  - install ppx_bin_prot                v0.15.0              [required by ppx_jane]
  - install ppx_cold                    v0.15.0              [required by ppx_base]
  - install ppx_compare                 v0.15.0              [required by ppx_base, bin_prot]
  - install ppx_custom_printf           v0.15.0              [required by ppx_jane]
  - install ppx_derivers                1.2.1                [required by ppxlib]
  - install ppx_disable_unused_warnings v0.15.0              [required by ppx_jane]
  - install ppx_enumerate               v0.15.0              [required by ppx_base]
  - install ppx_expect                  v0.15.0.1~alpha-repo [required by ppx_jane]
  - install ppx_fields_conv             v0.15.0              [required by ppx_jane]
  - install ppx_fixed_literal           v0.15.0              [required by ppx_jane]
  - install ppx_hash                    v0.15.0              [required by core]
  - install ppx_here                    v0.15.0              [required by ppx_jane]
  - install ppx_ignore_instrumentation  v0.15.0              [required by ppx_jane]
  - install ppx_inline_test             v0.15.0              [required by core]
  - install ppx_jane                    v0.15.0              [required by async]
  - install ppx_let                     v0.15.0              [required by ppx_jane]
  - install ppx_log                     v0.15.0              [required by async]
  - install ppx_module_timer            v0.15.0              [required by ppx_jane]
  - install ppx_optcomp                 v0.15.0              [required by ppx_jane]
  - install ppx_optional                v0.15.0              [required by ppx_jane]
  - install ppx_pipebang                v0.15.0              [required by ppx_jane]
  - install ppx_sexp_conv               v0.15.1              [required by core]
  - install ppx_sexp_message            v0.15.0              [required by core]
  - install ppx_sexp_value              v0.15.0              [required by ppx_jane]
  - install ppx_stable                  v0.15.0              [required by ppx_jane]
  - install ppx_string                  v0.15.0              [required by ppx_jane]
  - install ppx_typerep_conv            v0.15.0              [required by ppx_jane]
  - install ppx_variants_conv           v0.15.0              [required by ppx_jane]
  - install ppxlib                      0.27.0               [required by ppx_jane]
  - install protocol_version_header     v0.15.0              [required by async_rpc_kernel]
  - install re                          1.10.4               [required by expect_test_helpers_core]
  - install result                      1.5                  [required by angstrom]
  - install seq                         base                 [required by re]
  - install sexp_pretty                 v0.15.0.1~alpha-repo [required by expect_test_helpers_core]
  - install sexplib                     v0.15.1              [required by core, core_unix]
  - install sexplib0                    v0.15.1              [required by base]
  - install spawn                       v0.15.1              [required by core_unix]
  - install splittable_random           v0.15.0              [required by core]
  - install stdio                       v0.15.0              [required by core]
  - install stdlib-shims                0.3.0                [required by ppxlib]
  - install stringext                   1.6.0                [required by uri]
  - install textutils                   v0.15.0              [required by async]
  - install textutils_kernel            v0.15.0              [required by textutils]
  - install time_now                    v0.15.0              [required by core]
  - install timezone                    v0.15.0              [required by core_unix]
  - install topkg                       1.0.5                [required by xmlm]
  - install typerep                     v0.15.0              [required by core]
  - install uri                         4.2.0                [required by amqp-client-async]
  - install uutf                        1.0.3                [required by textutils]
  - install variantslib                 v0.15.0              [required by core]
  - install xml-light                   2.4                  [required by amqp-client-async]
  - install xmlm                        1.4.0                [required by ezxmlm]

The following system packages will first need to be installed:
    pkg-config

<><> Handling external dependencies <><><><><><><><><><><><><><><><><><><><><><>

opam believes some required external dependencies are missing. opam can:
> 1. Run apt-get to install them (may need root/sudo access)
  2. Display the recommended apt-get command and wait while you run it manually (e.g. in another terminal)
  3. Attempt installation anyway, and permanently register that this external dependency is present, but not detectable
  4. Abort the installation

[1/2/3/4] 1
+ /usr/bin/sudo "apt-get" "install" "-qq" "-yy" "pkg-config"
- debconf: delaying package configuration, since apt-utils is not installed
- Selecting previously unselected package libglib2.0-0:amd64.
- (Reading database ... 
(Reading database ... 5%
(Reading database ... 10%
(Reading database ... 15%
(Reading database ... 20%
(Reading database ... 25%
(Reading database ... 30%
(Reading database ... 35%
(Reading database ... 40%
(Reading database ... 45%
(Reading database ... 50%
(Reading database ... 55%
(Reading database ... 60%
(Reading database ... 65%
(Reading database ... 70%
(Reading database ... 75%
(Reading database ... 80%
(Reading database ... 85%
(Reading database ... 90%
(Reading database ... 95%
(Reading database ... 100%
(Reading database ... 19664 files and directories currently installed.)
- Preparing to unpack .../0-libglib2.0-0_2.73.3-3_amd64.deb ...
- Unpacking libglib2.0-0:amd64 (2.73.3-3) ...
- Selecting previously unselected package libglib2.0-data.
- Preparing to unpack .../1-libglib2.0-data_2.73.3-3_all.deb ...
- Unpacking libglib2.0-data (2.73.3-3) ...
- Selecting previously unselected package libicu71:amd64.
- Preparing to unpack .../2-libicu71_71.1-3_amd64.deb ...
- Unpacking libicu71:amd64 (71.1-3) ...
- Selecting previously unselected package libxml2:amd64.
- Preparing to unpack .../3-libxml2_2.9.14+dfsg-1+b1_amd64.deb ...
- Unpacking libxml2:amd64 (2.9.14+dfsg-1+b1) ...
- Selecting previously unselected package pkg-config.
- Preparing to unpack .../4-pkg-config_0.29.2-1_amd64.deb ...
- Unpacking pkg-config (0.29.2-1) ...
- Selecting previously unselected package shared-mime-info.
- Preparing to unpack .../5-shared-mime-info_2.2-1_amd64.deb ...
- Unpacking shared-mime-info (2.2-1) ...
- Selecting previously unselected package xdg-user-dirs.
- Preparing to unpack .../6-xdg-user-dirs_0.17-2_amd64.deb ...
- Unpacking xdg-user-dirs (0.17-2) ...
- Setting up libicu71:amd64 (71.1-3) ...
- Setting up xdg-user-dirs (0.17-2) ...
- Setting up libglib2.0-0:amd64 (2.73.3-3) ...
- No schema files found: doing nothing.
- Setting up libglib2.0-data (2.73.3-3) ...
- Setting up pkg-config (0.29.2-1) ...
- Setting up libxml2:amd64 (2.9.14+dfsg-1+b1) ...
- Setting up shared-mime-info (2.2-1) ...
- Processing triggers for libc-bin (2.34-7) ...

<><> Processing actions <><><><><><><><><><><><><><><><><><><><><><><><><><><><>
Processing  1/268: [amqp-client.2.2.2, amqp-client-async.2.2.2: http]
Processing  2/268: [amqp-client.2.2.2, amqp-client-async.2.2.2: http]
Processing  3/268: [amqp-client.2.2.2, amqp-client-async.2.2.2: http]
-> retrieved async.v0.15.0  (cached)
Processing  4/268: [amqp-client.2.2.2, amqp-client-async.2.2.2: http]
-> retrieved angstrom.0.15.0  (cached)
Processing  5/268: [amqp-client.2.2.2, amqp-client-async.2.2.2: http]
-> retrieved async_kernel.v0.15.0  (cached)
Processing  6/268: [amqp-client.2.2.2, amqp-client-async.2.2.2: http]
-> retrieved async_rpc_kernel.v0.15.0  (cached)
Processing  7/268: [amqp-client.2.2.2, amqp-client-async.2.2.2: http] [base.v0.15.1~5.0preview: git]
-> retrieved async_unix.v0.15.0  (cached)
Processing  8/268: [amqp-client.2.2.2, amqp-client-async.2.2.2: http] [base.v0.15.1~5.0preview: git]
Processing  9/268: [amqp-client.2.2.2, amqp-client-async.2.2.2: http] [base.v0.15.1~5.0preview: git]
-> retrieved base_bigstring.v0.15.0  (cached)
Processing 10/268: [amqp-client.2.2.2, amqp-client-async.2.2.2: http] [base.v0.15.1~5.0preview: git]
-> retrieved base_quickcheck.v0.15.0  (cached)
Processing 11/268: [amqp-client.2.2.2, amqp-client-async.2.2.2: http] [base.v0.15.1~5.0preview: git]
-> retrieved bigstringaf.0.9.0  (cached)
Processing 12/268: [amqp-client.2.2.2, amqp-client-async.2.2.2: http] [base.v0.15.1~5.0preview: git]
-> retrieved bin_prot.v0.15.0  (cached)
Processing 13/268: [amqp-client.2.2.2, amqp-client-async.2.2.2: http] [base.v0.15.1~5.0preview: git]
Processing 14/268: [amqp-client.2.2.2, amqp-client-async.2.2.2: http] [base.v0.15.1~5.0preview: git] [core.v0.15.0.1~alpha-repo: http]
Processing 15/268: [amqp-client.2.2.2, amqp-client-async.2.2.2: http] [base.v0.15.1~5.0preview: git] [core.v0.15.0.1~alpha-repo: http] [conf-pkg-config: pkg-config]
+ /home/opam/.opam/opam-init/hooks/sandbox.sh "build" "pkg-config" "--help" (CWD=/home/opam/.opam/5.0+alpha-repo/.opam-switch/build/conf-pkg-config.2)
- Usage:
-   pkg-config [OPTION?]
- 
- Help Options:
-   -h, --help                              Show help options
- 
- Application Options:
-   --version                               output version of pkg-config
-   --modversion                            output version for package
-   --atleast-pkgconfig-version=VERSION     require given version of pkg-config
-   --libs                                  output all linker flags
-   --static                                output linker flags for static linking
-   --short-errors                          print short errors
-   --libs-only-l                           output -l flags
-   --libs-only-other                       output other libs (e.g. -pthread)
-   --libs-only-L                           output -L flags
-   --cflags                                output all pre-processor and compiler flags
-   --cflags-only-I                         output -I flags
-   --cflags-only-other                     output cflags not covered by the cflags-only-I option
-   --variable=NAME                         get the value of variable named NAME
-   --define-variable=NAME=VALUE            set variable NAME to VALUE
-   --exists                                return 0 if the module(s) exist
-   --print-variables                       output list of variables defined by the module
-   --uninstalled                           return 0 if the uninstalled version of one or more module(s) or their dependencies will be used
-   --atleast-version=VERSION               return 0 if the module is at least version VERSION
-   --exact-version=VERSION                 return 0 if the module is at exactly version VERSION
-   --max-version=VERSION                   return 0 if the module is at no newer than version VERSION
-   --list-all                              list all known packages
-   --debug                                 show verbose debug information
-   --print-errors                          show verbose information about missing or conflicting packages (default unless --exists or --atleast/exact/max-version given on the command line)
-   --silence-errors                        be silent about errors (default when --exists or --atleast/exact/max-version given on the command line)
-   --errors-to-stdout                      print errors from --print-errors to stdout not stderr
-   --print-provides                        print which packages the package provides
-   --print-requires                        print which packages the package requires
-   --print-requires-private                print which packages the package requires for static linking
-   --validate                              validate a package's .pc file
-   --define-prefix                         try to override the value of prefix for each .pc file found with a guesstimated value based on the location of the .pc file
-   --dont-define-prefix                    don't try to override the value of prefix for each .pc file found with a guesstimated value based on the location of the .pc file
-   --prefix-variable=PREFIX                set the name of the variable that pkg-config automatically sets
- 
-> compiled  conf-pkg-config.2
Processing 15/268: [amqp-client.2.2.2, amqp-client-async.2.2.2: http] [base.v0.15.1~5.0preview: git] [core.v0.15.0.1~alpha-repo: http]
Processing 16/268: [amqp-client.2.2.2, amqp-client-async.2.2.2: http] [base.v0.15.1~5.0preview: git] [core.v0.15.0.1~alpha-repo: http] [conf-pkg-config: mkdir]
Processing 16/268: [base.v0.15.1~5.0preview: git] [core.v0.15.0.1~alpha-repo: http] [conf-pkg-config: mkdir]
Processing 16/268: [base.v0.15.1~5.0preview: git] [conf-pkg-config: mkdir]
-> retrieved amqp-client.2.2.2, amqp-client-async.2.2.2  (https://github.com/andersfugmann/amqp-client/archive/2.2.2.tar.gz)
Processing 17/268: [base.v0.15.1~5.0preview: git] [conf-pkg-config: mkdir]
+ /home/opam/.opam/opam-init/hooks/sandbox.sh "install" "mkdir" "-p" "/home/opam/.opam/5.0+alpha-repo/lib/pkgconfig" (CWD=/home/opam/.opam/5.0+alpha-repo/.opam-switch/build/conf-pkg-config.2)
-> installed conf-pkg-config.2
Processing 17/268: [base.v0.15.1~5.0preview: git]
-> retrieved core.v0.15.0.1~alpha-repo  (https://github.com/kit-ty-kate/core/archive/500.tar.gz)
Processing 18/268: [base.v0.15.1~5.0preview: git] [core_unix.v0.15.0.1~alpha-repo: http]
-> retrieved core_kernel.v0.15.0  (cached)
Processing 19/268: [base.v0.15.1~5.0preview: git] [core_unix.v0.15.0.1~alpha-repo: http]
-> retrieved cppo.1.6.9  (cached)
Processing 20/268: [base.v0.15.1~5.0preview: git] [core_unix.v0.15.0.1~alpha-repo: http]
-> retrieved csexp.1.5.1  (cached)
Processing 21/268: [base.v0.15.1~5.0preview: git] [core_unix.v0.15.0.1~alpha-repo: http]
Processing 21/268: [base.v0.15.1~5.0preview: git]
-> retrieved core_unix.v0.15.0.1~alpha-repo  (https://github.com/dra27/core_unix/archive/check-symbols-caml_unix.tar.gz)
Processing 22/268: [base.v0.15.1~5.0preview: git]
-> retrieved expect_test_helpers_core.v0.15.0  (cached)
Processing 23/268: [base.v0.15.1~5.0preview: git]
-> retrieved ezxmlm.1.1.0  (cached)
Processing 24/268: [base.v0.15.1~5.0preview: git]
-> retrieved fieldslib.v0.15.0  (cached)
Processing 25/268: [base.v0.15.1~5.0preview: git]
-> retrieved int_repr.v0.15.0  (cached)
Processing 26/268: [base.v0.15.1~5.0preview: git]
-> retrieved jane-street-headers.v0.15.0  (cached)
Processing 27/268: [base.v0.15.1~5.0preview: git]
-> retrieved jst-config.v0.15.1  (cached)
Processing 28/268: [base.v0.15.1~5.0preview: git]
-> retrieved num.1.4  (cached)
Processing 29/268: [base.v0.15.1~5.0preview: git]
-> retrieved ocaml-compiler-libs.v0.12.4  (cached)
Processing 30/268: [base.v0.15.1~5.0preview: git]
-> retrieved ocaml-syntax-shims.1.0.0  (cached)
Processing 31/268: [base.v0.15.1~5.0preview: git]
-> retrieved ocaml_intrinsics.v0.15.2  (cached)
Processing 32/268: [base.v0.15.1~5.0preview: git]
-> retrieved ocamlbuild.0.14.1  (cached)
Processing 33/268: [base.v0.15.1~5.0preview: git]
Processing 34/268: [base.v0.15.1~5.0preview: git] [ocamlbuild: make configure.make]
-> retrieved ocamlfind.1.9.5  (cached)
Processing 35/268: [base.v0.15.1~5.0preview: git] [ocamlbuild: make configure.make]
[ocamlfind: patch] applying 0001-Fix-bug-when-installing-with-a-system-compiler.patch
Processing 36/268: [base.v0.15.1~5.0preview: git] [ocamlbuild: make configure.make] [ocamlfind: patch]
-> retrieved dune.3.4.1, dune-configurator.3.4.1  (cached)
Processing 37/268: [base.v0.15.1~5.0preview: git] [ocamlbuild: make configure.make] [ocamlfind: patch]
Processing 38/268: [base.v0.15.1~5.0preview: git] [dune: ocaml bootstrap.ml] [ocamlbuild: make configure.make] [ocamlfind: patch]
+ /home/opam/.opam/opam-init/hooks/sandbox.sh "build" "make" "-f" "configure.make" "all" "OCAMLBUILD_PREFIX=/home/opam/.opam/5.0+alpha-repo" "OCAMLBUILD_BINDIR=/home/opam/.opam/5.0+alpha-repo/bin" "OCAMLBUILD_LIBDIR=/home/opam/.opam/5.0+alpha-repo/lib" "OCAMLBUILD_MANDIR=/home/opam/.opam/5.0+alpha-repo/man" "OCAML_NATIVE=true" "OCAML_NATIVE_TOOLS=true" (CWD=/home/opam/.opam/5.0+alpha-repo/.opam-switch/build/ocamlbuild.0.14.1)
- (echo "# This file was generated from configure.make"; \
- echo ;\
- echo "OCAML_PREFIX="; \
- echo "OCAML_BINDIR=/home/opam/.opam/5.0+alpha-repo/bin"; \
- echo "OCAML_LIBDIR=/home/opam/.opam/5.0+alpha-repo/lib/ocaml"; \
- echo "OCAML_MANDIR=/home/opam/.opam/5.0+alpha-repo/man"; \
- echo ;\
- echo "EXT_OBJ=.o"; \
- echo "EXT_ASM=.s"; \
- echo "EXT_LIB=.a"; \
- echo "EXT_DLL=.so"; \
- echo "EXE="; \
- echo ;\
- echo "OCAML_NATIVE=true"; \
- echo "OCAML_NATIVE_TOOLS=true"; \
- echo "NATDYNLINK=true"; \
- echo "SUPPORT_SHARED_LIBRARIES=true"; \
- echo ;\
- echo "PREFIX=/home/opam/.opam/5.0+alpha-repo"; \
- echo "BINDIR=/home/opam/.opam/5.0+alpha-repo/bin"; \
- echo "LIBDIR=/home/opam/.opam/5.0+alpha-repo/lib"; \
- echo "MANDIR=/home/opam/.opam/5.0+alpha-repo/man"; \
- ) > Makefile.config
- (echo "(* This file was generated from ../configure.make *)"; \
- echo ;\
- echo 'let bindir = "/home/opam/.opam/5.0+alpha-repo/bin"'; \
- echo 'let libdir = "/home/opam/.opam/5.0+alpha-repo/lib"'; \
- echo 'let ocaml_libdir = "/home/opam/.opam/5.0+alpha-repo/lib/ocaml"'; \
- echo 'let libdir_abs = "/home/opam/.opam/5.0+alpha-repo/lib"'; \
- echo 'let ocaml_native = true'; \
- echo 'let ocaml_native_tools = true'; \
- echo 'let supports_shared_libraries = true';\
- echo 'let a = "a"'; \
- echo 'let o = "o"'; \
- echo 'let so = "so"'; \
- echo 'let ext_dll = ".so"'; \
- echo 'let exe = ""'; \
- echo 'let version = "0.14.1"'; \
- ) > src/ocamlbuild_config.ml
Processing 38/268: [base.v0.15.1~5.0preview: git] [dune: ocaml bootstrap.ml] [ocamlbuild: make check-if-preinstalled] [ocamlfind: patch]
-> retrieved ocplib-endian.1.2  (cached)
Processing 39/268: [base.v0.15.1~5.0preview: git] [dune: ocaml bootstrap.ml] [ocamlbuild: make check-if-preinstalled] [ocamlfind: patch]
Processing 39/268: [base.v0.15.1~5.0preview: git] [dune: ocaml bootstrap.ml] [ocamlbuild: make check-if-preinstalled] [ocamlfind: ./configure]
-> retrieved parsexp.v0.15.0  (cached)
Processing 40/268: [base.v0.15.1~5.0preview: git] [dune: ocaml bootstrap.ml] [ocamlbuild: make check-if-preinstalled] [ocamlfind: ./configure]
-> retrieved ppx_assert.v0.15.0  (cached)
Processing 41/268: [base.v0.15.1~5.0preview: git] [dune: ocaml bootstrap.ml] [ocamlbuild: make check-if-preinstalled] [ocamlfind: ./configure]
-> retrieved ppx_base.v0.15.0  (cached)
Processing 42/268: [base.v0.15.1~5.0preview: git] [dune: ocaml bootstrap.ml] [ocamlbuild: make check-if-preinstalled] [ocamlfind: ./configure]
-> retrieved ppx_bench.v0.15.0  (cached)
Processing 43/268: [base.v0.15.1~5.0preview: git] [dune: ocaml bootstrap.ml] [ocamlbuild: make check-if-preinstalled] [ocamlfind: ./configure]
-> retrieved ppx_bin_prot.v0.15.0  (cached)
Processing 44/268: [base.v0.15.1~5.0preview: git] [dune: ocaml bootstrap.ml] [ocamlbuild: make check-if-preinstalled] [ocamlfind: ./configure]
-> retrieved ppx_cold.v0.15.0  (cached)
Processing 45/268: [base.v0.15.1~5.0preview: git] [dune: ocaml bootstrap.ml] [ocamlbuild: make check-if-preinstalled] [ocamlfind: ./configure]
-> retrieved base.v0.15.1~5.0preview  (git+https://github.com/kit-ty-kate/base#500-015)
Processing 45/268: [dune: ocaml bootstrap.ml] [ocamlbuild: make check-if-preinstalled] [ocamlfind: ./configure]
Processing 46/268: [dune: ocaml bootstrap.ml] [ocamlbuild: make check-if-preinstalled] [ocamlfind: ./configure]
-> retrieved ppx_compare.v0.15.0  (cached)
Processing 47/268: [dune: ocaml bootstrap.ml] [ocamlbuild: make check-if-preinstalled] [ocamlfind: ./configure]
-> retrieved ppx_custom_printf.v0.15.0  (cached)
Processing 48/268: [dune: ocaml bootstrap.ml] [ocamlbuild: make check-if-preinstalled] [ocamlfind: ./configure]
-> retrieved ppx_derivers.1.2.1  (cached)
Processing 49/268: [ppx_expect.v0.15.0.1~alpha-repo: http] [dune: ocaml bootstrap.ml] [ocamlbuild: make check-if-preinstalled] [ocamlfind: ./configure]
-> retrieved ppx_disable_unused_warnings.v0.15.0  (cached)
Processing 50/268: [ppx_expect.v0.15.0.1~alpha-repo: http] [dune: ocaml bootstrap.ml] [ocamlbuild: make check-if-preinstalled] [ocamlfind: ./configure]
-> retrieved ppx_enumerate.v0.15.0  (cached)
Processing 51/268: [ppx_expect.v0.15.0.1~alpha-repo: http] [dune: ocaml bootstrap.ml] [ocamlbuild: make check-if-preinstalled] [ocamlfind: ./configure]
-> retrieved ppx_fields_conv.v0.15.0  (cached)
Processing 52/268: [ppx_expect.v0.15.0.1~alpha-repo: http] [dune: ocaml bootstrap.ml] [ocamlbuild: make check-if-preinstalled] [ocamlfind: ./configure]
-> retrieved ppx_fixed_literal.v0.15.0  (cached)
Processing 53/268: [ppx_expect.v0.15.0.1~alpha-repo: http] [dune: ocaml bootstrap.ml] [ocamlbuild: make check-if-preinstalled] [ocamlfind: ./configure]
-> retrieved ppx_hash.v0.15.0  (cached)
Processing 54/268: [ppx_expect.v0.15.0.1~alpha-repo: http] [dune: ocaml bootstrap.ml] [ocamlbuild: make check-if-preinstalled] [ocamlfind: ./configure]
-> retrieved ppx_here.v0.15.0  (cached)
Processing 55/268: [ppx_expect.v0.15.0.1~alpha-repo: http] [dune: ocaml bootstrap.ml] [ocamlbuild: make check-if-preinstalled] [ocamlfind: ./configure]
-> retrieved ppx_ignore_instrumentation.v0.15.0  (cached)
Processing 56/268: [ppx_expect.v0.15.0.1~alpha-repo: http] [dune: ocaml bootstrap.ml] [ocamlbuild: make check-if-preinstalled] [ocamlfind: ./configure]
-> retrieved ppx_inline_test.v0.15.0  (cached)
Processing 57/268: [ppx_expect.v0.15.0.1~alpha-repo: http] [dune: ocaml bootstrap.ml] [ocamlbuild: make check-if-preinstalled] [ocamlfind: ./configure]
-> retrieved ppx_jane.v0.15.0  (cached)
Processing 58/268: [ppx_expect.v0.15.0.1~alpha-repo: http] [dune: ocaml bootstrap.ml] [ocamlbuild: make check-if-preinstalled] [ocamlfind: ./configure]
-> retrieved ppx_let.v0.15.0  (cached)
Processing 59/268: [ppx_expect.v0.15.0.1~alpha-repo: http] [dune: ocaml bootstrap.ml] [ocamlbuild: make check-if-preinstalled] [ocamlfind: ./configure]
-> retrieved ppx_log.v0.15.0  (cached)
Processing 60/268: [ppx_expect.v0.15.0.1~alpha-repo: http] [dune: ocaml bootstrap.ml] [ocamlbuild: make check-if-preinstalled] [ocamlfind: ./configure]
-> retrieved ppx_module_timer.v0.15.0  (cached)
Processing 61/268: [ppx_expect.v0.15.0.1~alpha-repo: http] [dune: ocaml bootstrap.ml] [ocamlbuild: make check-if-preinstalled] [ocamlfind: ./configure]
-> retrieved ppx_optcomp.v0.15.0  (cached)
Processing 62/268: [ppx_expect.v0.15.0.1~alpha-repo: http] [dune: ocaml bootstrap.ml] [ocamlbuild: make check-if-preinstalled] [ocamlfind: ./configure]
-> retrieved ppx_optional.v0.15.0  (cached)
Processing 63/268: [ppx_expect.v0.15.0.1~alpha-repo: http] [dune: ocaml bootstrap.ml] [ocamlbuild: make check-if-preinstalled] [ocamlfind: ./configure]
-> retrieved ppx_pipebang.v0.15.0  (cached)
Processing 64/268: [ppx_expect.v0.15.0.1~alpha-repo: http] [dune: ocaml bootstrap.ml] [ocamlbuild: make check-if-preinstalled] [ocamlfind: ./configure]
-> retrieved ppx_sexp_conv.v0.15.1  (cached)
Processing 65/268: [ppx_expect.v0.15.0.1~alpha-repo: http] [dune: ocaml bootstrap.ml] [ocamlbuild: make check-if-preinstalled] [ocamlfind: ./configure]
+ /home/opam/.opam/opam-init/hooks/sandbox.sh "build" "./configure" "-bindir" "/home/opam/.opam/5.0+alpha-repo/bin" "-sitelib" "/home/opam/.opam/5.0+alpha-repo/lib" "-mandir" "/home/opam/.opam/5.0+alpha-repo/man" "-config" "/home/opam/.opam/5.0+alpha-repo/lib/findlib.conf" "-no-custom" "-no-camlp4" (CWD=/home/opam/.opam/5.0+alpha-repo/.opam-switch/build/ocamlfind.1.9.5)
- Welcome to findlib version 1.9.5
- Configuring core...
- Checking for #remove_directory...
- Testing threading model...
- systhread_supported: true
- Testing DLLs...
- Testing whether ppxopt can be supported...
- Checking for ocamlc -opaque...
- Querying installation: META list not found
- make install will double-check installed META files
- Configuring libraries...
- unix: found (in +unix)
- dynlink: found (in +dynlink)
- bigarray: not present (possible since 4.08)
- compiler-libs: found
- dbm: not present (normal since 4.00)
- graphics: not present (normal since 4.09)
- num: not present (normal since 4.06)
- ocamlbuild: not present (normal since 4.03)
- ocamldoc: found (in +ocamldoc)
- raw_spacetime: not present (normal since 4.12)
- threads: found (in +threads)
- runtime_events: found (in +runtime_events)
- str: found (in +str)
- labltk: not present (normal since 4.02)
- native dynlink: found
- camlp4: disabled
- bytes: found, installing fake library
- Configuration for stdlib written to site-lib-src/stdlib/META
- Configuration for unix written to site-lib-src/unix/META
- Configuration for dynlink written to site-lib-src/dynlink/META
- Configuration for compiler-libs written to site-lib-src/compiler-libs/META
- Configuration for ocamldoc written to site-lib-src/ocamldoc/META
- Configuration for threads written to site-lib-src/threads/META
- Configuration for runtime_events written to site-lib-src/runtime_events/META
- Configuration for str written to site-lib-src/str/META
- Configuration for bytes written to site-lib-src/bytes/META
- Detecting compiler arguments: (extractor built) ok
- 
- About the OCAML core installation:
-     Standard library:      /home/opam/.opam/5.0+alpha-repo/lib/ocaml
-     Binaries:              /home/opam/.opam/5.0+alpha-repo/bin
-     Manual pages:          /home/opam/.opam/5.0+alpha-repo/man
-     Multi-threading type:  posix
- The directory of site-specific packages will be
-     site-lib:              /home/opam/.opam/5.0+alpha-repo/lib
- The configuration file is written to:
-     findlib config file:   /home/opam/.opam/5.0+alpha-repo/lib/findlib.conf
- Software will be installed:
-     Libraries:             in <site-lib>/findlib
-     Binaries:              /home/opam/.opam/5.0+alpha-repo/bin
-     Manual pages:          /home/opam/.opam/5.0+alpha-repo/man
-     topfind script:        /home/opam/.opam/5.0+alpha-repo/lib/ocaml
- Topfind ppxopt support:    yes
- Toolbox:                   no
- Link custom runtime:       no
- Need bytes compatibility:  no
- 
- Configuration has been written to Makefile.config
- 
- You can now do 'make all', and optionally 'make opt', to build ocamlfind.
Processing 65/268: [ppx_expect.v0.15.0.1~alpha-repo: http] [dune: ocaml bootstrap.ml] [ocamlbuild: make check-if-preinstalled] [ocamlfind: make all]
Processing 65/268: [dune: ocaml bootstrap.ml] [ocamlbuild: make check-if-preinstalled] [ocamlfind: make all]
-> retrieved ppx_sexp_message.v0.15.0  (cached)
Processing 66/268: [dune: ocaml bootstrap.ml] [ocamlbuild: make check-if-preinstalled] [ocamlfind: make all]
-> retrieved ppx_sexp_value.v0.15.0  (cached)
Processing 67/268: [dune: ocaml bootstrap.ml] [ocamlbuild: make check-if-preinstalled] [ocamlfind: make all]
-> retrieved ppx_expect.v0.15.0.1~alpha-repo  (https://github.com/kit-ty-kate/ppx_expect/archive/500-015.tar.gz)
Processing 68/268: [dune: ocaml bootstrap.ml] [ocamlbuild: make check-if-preinstalled] [ocamlfind: make all]
-> retrieved ppx_stable.v0.15.0  (cached)
Processing 69/268: [dune: ocaml bootstrap.ml] [ocamlbuild: make check-if-preinstalled] [ocamlfind: make all]
-> retrieved ppx_string.v0.15.0  (cached)
Processing 70/268: [dune: ocaml bootstrap.ml] [ocamlbuild: make check-if-preinstalled] [ocamlfind: make all]
-> retrieved ppx_typerep_conv.v0.15.0  (cached)
Processing 71/268: [dune: ocaml bootstrap.ml] [ocamlbuild: make check-if-preinstalled] [ocamlfind: make all]
-> retrieved ppx_variants_conv.v0.15.0  (cached)
Processing 72/268: [dune: ocaml bootstrap.ml] [ocamlbuild: make check-if-preinstalled] [ocamlfind: make all]
-> retrieved protocol_version_header.v0.15.0  (cached)
Processing 73/268: [dune: ocaml bootstrap.ml] [ocamlbuild: make check-if-preinstalled] [ocamlfind: make all]
-> retrieved result.1.5  (cached)
Processing 74/268: [dune: ocaml bootstrap.ml] [ocamlbuild: make check-if-preinstalled] [ocamlfind: make all]
Processing 75/268: [sexp_pretty.v0.15.0.1~alpha-repo: http] [dune: ocaml bootstrap.ml] [ocamlbuild: make check-if-preinstalled] [ocamlfind: make all]
Processing 76/268: [sexp_pretty.v0.15.0.1~alpha-repo: http] [dune: ocaml bootstrap.ml] [ocamlbuild: make check-if-preinstalled] [ocamlfind: make all]
-> installed seq.base
Processing 77/268: [sexp_pretty.v0.15.0.1~alpha-repo: http] [dune: ocaml bootstrap.ml] [ocamlbuild: make check-if-preinstalled] [ocamlfind: make all]
-> retrieved re.1.10.4  (cached)
Processing 78/268: [sexp_pretty.v0.15.0.1~alpha-repo: http] [dune: ocaml bootstrap.ml] [ocamlbuild: make check-if-preinstalled] [ocamlfind: make all]
-> retrieved sexplib.v0.15.1  (cached)
Processing 79/268: [sexp_pretty.v0.15.0.1~alpha-repo: http] [dune: ocaml bootstrap.ml] [ocamlbuild: make check-if-preinstalled] [ocamlfind: make all]
-> retrieved sexplib0.v0.15.1  (cached)
Processing 80/268: [sexp_pretty.v0.15.0.1~alpha-repo: http] [dune: ocaml bootstrap.ml] [ocamlbuild: make check-if-preinstalled] [ocamlfind: make all]
-> retrieved spawn.v0.15.1  (cached)
Processing 81/268: [sexp_pretty.v0.15.0.1~alpha-repo: http] [dune: ocaml bootstrap.ml] [ocamlbuild: make check-if-preinstalled] [ocamlfind: make all]
-> retrieved splittable_random.v0.15.0  (cached)
Processing 82/268: [sexp_pretty.v0.15.0.1~alpha-repo: http] [dune: ocaml bootstrap.ml] [ocamlbuild: make check-if-preinstalled] [ocamlfind: make all]
-> retrieved stdio.v0.15.0  (cached)
Processing 83/268: [sexp_pretty.v0.15.0.1~alpha-repo: http] [dune: ocaml bootstrap.ml] [ocamlbuild: make check-if-preinstalled] [ocamlfind: make all]
-> retrieved stdlib-shims.0.3.0  (cached)
Processing 84/268: [sexp_pretty.v0.15.0.1~alpha-repo: http] [dune: ocaml bootstrap.ml] [ocamlbuild: make check-if-preinstalled] [ocamlfind: make all]
-> retrieved stringext.1.6.0  (cached)
Processing 85/268: [sexp_pretty.v0.15.0.1~alpha-repo: http] [dune: ocaml bootstrap.ml] [ocamlbuild: make check-if-preinstalled] [ocamlfind: make all]
-> retrieved textutils.v0.15.0  (cached)
Processing 86/268: [sexp_pretty.v0.15.0.1~alpha-repo: http] [dune: ocaml bootstrap.ml] [ocamlbuild: make check-if-preinstalled] [ocamlfind: make all]
-> retrieved textutils_kernel.v0.15.0  (cached)
Processing 87/268: [sexp_pretty.v0.15.0.1~alpha-repo: http] [dune: ocaml bootstrap.ml] [ocamlbuild: make check-if-preinstalled] [ocamlfind: make all]
-> retrieved time_now.v0.15.0  (cached)
Processing 88/268: [sexp_pretty.v0.15.0.1~alpha-repo: http] [dune: ocaml bootstrap.ml] [ocamlbuild: make check-if-preinstalled] [ocamlfind: make all]
-> retrieved timezone.v0.15.0  (cached)
Processing 89/268: [sexp_pretty.v0.15.0.1~alpha-repo: http] [dune: ocaml bootstrap.ml] [ocamlbuild: make check-if-preinstalled] [ocamlfind: make all]
-> retrieved ppxlib.0.27.0  (cached)
Processing 90/268: [sexp_pretty.v0.15.0.1~alpha-repo: http] [dune: ocaml bootstrap.ml] [ocamlbuild: make check-if-preinstalled] [ocamlfind: make all]
Processing 90/268: [dune: ocaml bootstrap.ml] [ocamlbuild: make check-if-preinstalled] [ocamlfind: make all]
-> retrieved topkg.1.0.5  (cached)
Processing 91/268: [dune: ocaml bootstrap.ml] [ocamlbuild: make check-if-preinstalled] [ocamlfind: make all]
-> retrieved typerep.v0.15.0  (cached)
Processing 92/268: [dune: ocaml bootstrap.ml] [ocamlbuild: make check-if-preinstalled] [ocamlfind: make all]
-> retrieved sexp_pretty.v0.15.0.1~alpha-repo  (https://github.com/kit-ty-kate/sexp_pretty/archive/500.tar.gz)
Processing 93/268: [dune: ocaml bootstrap.ml] [ocamlbuild: make check-if-preinstalled] [ocamlfind: make all]
-> retrieved uutf.1.0.3  (cached)
Processing 94/268: [dune: ocaml bootstrap.ml] [ocamlbuild: make check-if-preinstalled] [ocamlfind: make all]
-> retrieved variantslib.v0.15.0  (cached)
Processing 95/268: [dune: ocaml bootstrap.ml] [ocamlbuild: make check-if-preinstalled] [ocamlfind: make all]
-> retrieved uri.4.2.0  (cached)
-> retrieved xml-light.2.4  (cached)
-> retrieved xmlm.1.4.0  (cached)
+ /home/opam/.opam/opam-init/hooks/sandbox.sh "build" "make" "all" (CWD=/home/opam/.opam/5.0+alpha-repo/.opam-switch/build/ocamlfind.1.9.5)
- for p in findlib; do ( cd src/$p; make all ) || exit; done
- make[1]: Entering directory '/home/opam/.opam/5.0+alpha-repo/.opam-switch/build/ocamlfind.1.9.5/src/findlib'
- ocamllex fl_meta.mll
- 22 states, 392 transitions, table size 1700 bytes
- USE_CYGPATH="0"; \
- export USE_CYGPATH; \
- cat findlib_config.mlp | \
-          ../../tools/patch '@CONFIGFILE@' '/home/opam/.opam/5.0+alpha-repo/lib/findlib.conf' | \
-          ../../tools/patch '@STDLIB@' '/home/opam/.opam/5.0+alpha-repo/lib/ocaml' | \
- 	sed -e 's;@AUTOLINK@;true;g' \
- 	    -e 's;@SYSTEM@;linux;g' \
- 	     >findlib_config.ml
- if [ "true" = "true" ]; then                 \
- 	cp topfind.ml.in topfind.ml;                             \
- else                                                             \
- 	sed -e '/PPXOPT_BEGIN/,/PPXOPT_END/ d' topfind.ml.in     \
- 		> topfind.ml ;                                   \
- fi
- ocamldep *.ml *.mli >depend
- ocamlc -I +compiler-libs -opaque   -I +unix -I +dynlink -g -c findlib_config.ml
- ocamlc -I +compiler-libs -opaque   -I +unix -I +dynlink -g -c fl_split.ml
- ocamlc -I +compiler-libs -opaque   -I +unix -I +dynlink -g -c fl_metatoken.ml
- ocamlc -I +compiler-libs -opaque   -I +unix -I +dynlink -g -c fl_meta.ml
- ocamlc -I +compiler-libs -opaque   -I +unix -I +dynlink -c fl_metascanner.mli
- ocamlc -I +compiler-libs -opaque   -I +unix -I +dynlink -g -c fl_metascanner.ml
- ocamlc -I +compiler-libs -opaque   -I +unix -I +dynlink -c fl_topo.mli
- ocamlc -I +compiler-libs -opaque   -I +unix -I +dynlink -g -c fl_topo.ml
- ocamlc -I +compiler-libs -opaque   -I +unix -I +dynlink -c fl_package_base.mli
- ocamlc -I +compiler-libs -opaque   -I +unix -I +dynlink -g -c fl_package_base.ml
- File "fl_package_base.ml", line 304, characters 22-40:
- 304 | 	 let pkg_ancestors = query_requirements predlist pkg in
-       	                     ^^^^^^^^^^^^^^^^^^
- Warning 6 [labels-omitted]: label preds was omitted in the application of this function.
- File "fl_package_base.ml", line 350, characters 18-36:
- 350 |   let ancestors = query_requirements predlist package_name in
-                         ^^^^^^^^^^^^^^^^^^
- Warning 6 [labels-omitted]: label preds was omitted in the application of this function.
- File "fl_package_base.ml", line 375, characters 23-41:
- 375 | 	  let pkg_ancestors = query_requirements predlist pkg in
-       	                      ^^^^^^^^^^^^^^^^^^
- Warning 6 [labels-omitted]: label preds was omitted in the application of this function.
- File "fl_package_base.ml", line 510, characters 16-35:
- 510 | 	     ( let c = package_definitions search_path pkg.package_name in
-       	               ^^^^^^^^^^^^^^^^^^^
- Warning 6 [labels-omitted]: label search_path was omitted in the application of this function.
- ocamlc -I +compiler-libs -opaque   -I +unix -I +dynlink -c findlib.mli
- ocamlc -I +compiler-libs -opaque   -I +unix -I +dynlink -g -c findlib.ml
- File "findlib.ml", line 390, characters 2-26:
- 390 |   Fl_package_base.requires predlist pkg
-         ^^^^^^^^^^^^^^^^^^^^^^^^
- Warning 6 [labels-omitted]: label preds was omitted in the application of this function.
- File "findlib.ml", line 396, characters 2-33:
- 396 |   Fl_package_base.requires_deeply predlist pkglist
-         ^^^^^^^^^^^^^^^^^^^^^^^^^^^^^^^
- Warning 6 [labels-omitted]: label preds was omitted in the application of this function.
- ocamlc -I +compiler-libs -opaque   -I +unix -I +dynlink -g -c fl_args.ml
- ocamlc -I +compiler-libs -opaque   -I +unix -I +dynlink -g -c fl_lint.ml
- ocamlc -I +compiler-libs -a -o findlib.cma findlib_config.cmo fl_split.cmo fl_metatoken.cmo fl_meta.cmo fl_metascanner.cmo fl_topo.cmo fl_package_base.cmo findlib.cmo fl_args.cmo fl_lint.cmo
- ocamlc -I +compiler-libs -opaque   -I +unix -I +dynlink -g -c ocaml_args.ml
- ocamlc -I +compiler-libs -opaque   -I +unix -I +dynlink -g -c frontend.ml
- File "frontend.ml", line 859, characters 10-39:
- 859 |           Fl_package_base.package_users predicates1 packages1
-                 ^^^^^^^^^^^^^^^^^^^^^^^^^^^^^
- Warning 6 [labels-omitted]: label preds was omitted in the application of this function.
- ocamlc -I +compiler-libs  -o ocamlfind -g findlib.cma unix.cma \
-            -I +unix -I +dynlink ocaml_args.cmo frontend.cmo
- ocamlc -I +compiler-libs -opaque   -I +unix -I +dynlink -c topfind.mli
- ocamlc -I +compiler-libs -opaque   -I +unix -I +dynlink -g -c topfind.ml
- File "topfind.ml", line 126, characters 40-63:
- 126 |                      match Hashtbl.find Toploop.directive_table "ppx" with
-                                               ^^^^^^^^^^^^^^^^^^^^^^^
- Alert deprecated: Toploop.directive_table
- File "topfind.ml", line 256, characters 4-27:
- 256 |     Toploop.directive_table
-           ^^^^^^^^^^^^^^^^^^^^^^^
- Alert deprecated: Toploop.directive_table
- File "topfind.ml", line 266, characters 4-27:
- 266 |     Toploop.directive_table
-           ^^^^^^^^^^^^^^^^^^^^^^^
- Alert deprecated: Toploop.directive_table
- File "topfind.ml", line 278, characters 4-27:
- 278 |     Toploop.directive_table
-           ^^^^^^^^^^^^^^^^^^^^^^^
- Alert deprecated: Toploop.directive_table
- File "topfind.ml", line 291, characters 4-27:
- 291 |     Toploop.directive_table
-           ^^^^^^^^^^^^^^^^^^^^^^^
- Alert deprecated: Toploop.directive_table
- File "topfind.ml", line 305, characters 4-27:
- 305 |     Toploop.directive_table
-           ^^^^^^^^^^^^^^^^^^^^^^^
- Alert deprecated: Toploop.directive_table
- File "topfind.ml", line 317, characters 4-27:
- 317 |     Toploop.directive_table
-           ^^^^^^^^^^^^^^^^^^^^^^^
- Alert deprecated: Toploop.directive_table
- ocamlc -I +compiler-libs -a -o findlib_top.cma topfind.cmo
- USE_CYGPATH="0"; \
- export USE_CYGPATH; \
- cat topfind_rd1.p | \
-          ../../tools/patch '@SITELIB@' '/home/opam/.opam/5.0+alpha-repo/lib' \
-     	    >topfind
- ocamlc -I +compiler-libs -opaque   -I +unix -I +dynlink -c fl_dynload.mli
- ocamlc -I +compiler-libs -opaque   -I +unix -I +dynlink -g -c fl_dynload.ml
- ocamlc -I +compiler-libs -a -o findlib_dynload.cma fl_dynload.cmo
- make[1]: Leaving directory '/home/opam/.opam/5.0+alpha-repo/.opam-switch/build/ocamlfind.1.9.5/src/findlib'
- make all-config
- make[1]: Entering directory '/home/opam/.opam/5.0+alpha-repo/.opam-switch/build/ocamlfind.1.9.5'
- USE_CYGPATH="0"; \
- export USE_CYGPATH; \
- cat findlib.conf.in | \
-      tools/patch '@SITELIB@' '/home/opam/.opam/5.0+alpha-repo/lib' >findlib.conf
- if ./tools/cmd_from_same_dir ocamlc; then \
- 	echo 'ocamlc="ocamlc.opt"' >>findlib.conf; \
- fi
- if ./tools/cmd_from_same_dir ocamlopt; then \
- 	echo 'ocamlopt="ocamlopt.opt"' >>findlib.conf; \
- fi
- if ./tools/cmd_from_same_dir ocamldep; then \
- 	echo 'ocamldep="ocamldep.opt"' >>findlib.conf; \
- fi
- if ./tools/cmd_from_same_dir ocamldoc; then \
- 	echo 'ocamldoc="ocamldoc.opt"' >>findlib.conf; \
- fi
- make[1]: Leaving directory '/home/opam/.opam/5.0+alpha-repo/.opam-switch/build/ocamlfind.1.9.5'
Processing 95/268: [dune: ocaml bootstrap.ml] [ocamlbuild: make check-if-preinstalled] [ocamlfind: make opt]
+ /home/opam/.opam/opam-init/hooks/sandbox.sh "build" "make" "opt" (CWD=/home/opam/.opam/5.0+alpha-repo/.opam-switch/build/ocamlfind.1.9.5)
- for p in findlib; do ( cd src/$p; make opt ) || exit; done
- make[1]: Entering directory '/home/opam/.opam/5.0+alpha-repo/.opam-switch/build/ocamlfind.1.9.5/src/findlib'
- ocamlopt -I +compiler-libs -g -opaque  -I +unix -I +dynlink -c findlib_config.ml
- ocamlopt -I +compiler-libs -g -opaque  -I +unix -I +dynlink -c fl_split.ml
- ocamlopt -I +compiler-libs -g -opaque  -I +unix -I +dynlink -c fl_metatoken.ml
- ocamlopt -I +compiler-libs -g -opaque  -I +unix -I +dynlink -c fl_meta.ml
- ocamlopt -I +compiler-libs -g -opaque  -I +unix -I +dynlink -c fl_metascanner.ml
- ocamlopt -I +compiler-libs -g -opaque  -I +unix -I +dynlink -c fl_topo.ml
- ocamlopt -I +compiler-libs -g -opaque  -I +unix -I +dynlink -c fl_package_base.ml
- File "fl_package_base.ml", line 304, characters 22-40:
- 304 | 	 let pkg_ancestors = query_requirements predlist pkg in
-       	                     ^^^^^^^^^^^^^^^^^^
- Warning 6 [labels-omitted]: label preds was omitted in the application of this function.
- File "fl_package_base.ml", line 350, characters 18-36:
- 350 |   let ancestors = query_requirements predlist package_name in
-                         ^^^^^^^^^^^^^^^^^^
- Warning 6 [labels-omitted]: label preds was omitted in the application of this function.
- File "fl_package_base.ml", line 375, characters 23-41:
- 375 | 	  let pkg_ancestors = query_requirements predlist pkg in
-       	                      ^^^^^^^^^^^^^^^^^^
- Warning 6 [labels-omitted]: label preds was omitted in the application of this function.
- File "fl_package_base.ml", line 510, characters 16-35:
- 510 | 	     ( let c = package_definitions search_path pkg.package_name in
-       	               ^^^^^^^^^^^^^^^^^^^
- Warning 6 [labels-omitted]: label search_path was omitted in the application of this function.
- ocamlopt -I +compiler-libs -g -opaque  -I +unix -I +dynlink -c findlib.ml
- File "findlib.ml", line 390, characters 2-26:
- 390 |   Fl_package_base.requires predlist pkg
-         ^^^^^^^^^^^^^^^^^^^^^^^^
- Warning 6 [labels-omitted]: label preds was omitted in the application of this function.
- File "findlib.ml", line 396, characters 2-33:
- 396 |   Fl_package_base.requires_deeply predlist pkglist
-         ^^^^^^^^^^^^^^^^^^^^^^^^^^^^^^^
- Warning 6 [labels-omitted]: label preds was omitted in the application of this function.
- ocamlopt -I +compiler-libs -g -opaque  -I +unix -I +dynlink -c fl_args.ml
- ocamlopt -I +compiler-libs -g -opaque  -I +unix -I +dynlink -c fl_lint.ml
- ocamlopt -I +compiler-libs -g -a -o findlib.cmxa findlib_config.cmx fl_split.cmx fl_metatoken.cmx fl_meta.cmx fl_metascanner.cmx fl_topo.cmx fl_package_base.cmx findlib.cmx fl_args.cmx fl_lint.cmx
- if [ 1 -gt 0 ]; then \
-     ocamlopt -I +compiler-libs -g -shared -o findlib.cmxs findlib_config.cmx fl_split.cmx fl_metatoken.cmx fl_meta.cmx fl_metascanner.cmx fl_topo.cmx fl_package_base.cmx findlib.cmx fl_args.cmx fl_lint.cmx; \
- fi
- ocamlopt -I +compiler-libs -g -opaque  -I +unix -I +dynlink -c ocaml_args.ml
- ocamlopt -I +compiler-libs -g -opaque  -I +unix -I +dynlink -c frontend.ml
- File "frontend.ml", line 859, characters 10-39:
- 859 |           Fl_package_base.package_users predicates1 packages1
-                 ^^^^^^^^^^^^^^^^^^^^^^^^^^^^^
- Warning 6 [labels-omitted]: label preds was omitted in the application of this function.
- ocamlopt -I +compiler-libs -g -o ocamlfind_opt findlib.cmxa unix.cmxa \
- 	   -I +unix -I +dynlink ocaml_args.cmx frontend.cmx
- ocamlopt -I +compiler-libs -g -opaque  -I +unix -I +dynlink -c topfind.ml
- File "topfind.ml", line 126, characters 40-63:
- 126 |                      match Hashtbl.find Toploop.directive_table "ppx" with
-                                               ^^^^^^^^^^^^^^^^^^^^^^^
- Alert deprecated: Toploop.directive_table
- File "topfind.ml", line 256, characters 4-27:
- 256 |     Toploop.directive_table
-           ^^^^^^^^^^^^^^^^^^^^^^^
- Alert deprecated: Toploop.directive_table
- File "topfind.ml", line 266, characters 4-27:
- 266 |     Toploop.directive_table
-           ^^^^^^^^^^^^^^^^^^^^^^^
- Alert deprecated: Toploop.directive_table
- File "topfind.ml", line 278, characters 4-27:
- 278 |     Toploop.directive_table
-           ^^^^^^^^^^^^^^^^^^^^^^^
- Alert deprecated: Toploop.directive_table
- File "topfind.ml", line 291, characters 4-27:
- 291 |     Toploop.directive_table
-           ^^^^^^^^^^^^^^^^^^^^^^^
- Alert deprecated: Toploop.directive_table
- File "topfind.ml", line 305, characters 4-27:
- 305 |     Toploop.directive_table
-           ^^^^^^^^^^^^^^^^^^^^^^^
- Alert deprecated: Toploop.directive_table
- File "topfind.ml", line 317, characters 4-27:
- 317 |     Toploop.directive_table
-           ^^^^^^^^^^^^^^^^^^^^^^^
- Alert deprecated: Toploop.directive_table
- ocamlopt -I +compiler-libs -g -a -o findlib_top.cmxa topfind.cmx
- if [ 1 -gt 0 ]; then \
-     ocamlopt -I +compiler-libs -g -shared -o findlib_top.cmxs topfind.cmx; \
- fi
- ocamlopt -I +compiler-libs -g -opaque  -I +unix -I +dynlink -c fl_dynload.ml
- ocamlopt -I +compiler-libs -g -a -o findlib_dynload.cmxa fl_dynload.cmx
- if [ 1 -gt 0 ]; then \
-     ocamlopt -I +compiler-libs -g -shared -o findlib_dynload.cmxs fl_dynload.cmx; \
- fi
- make[1]: Leaving directory '/home/opam/.opam/5.0+alpha-repo/.opam-switch/build/ocamlfind.1.9.5/src/findlib'
-> compiled  ocamlfind.1.9.5
Processing 95/268: [dune: ocaml bootstrap.ml] [ocamlbuild: make check-if-preinstalled]
Processing 96/268: [dune: ocaml bootstrap.ml] [ocamlbuild: make check-if-preinstalled] [ocamlfind: make install]
+ /home/opam/.opam/opam-init/hooks/sandbox.sh "install" "make" "install" (CWD=/home/opam/.opam/5.0+alpha-repo/.opam-switch/build/ocamlfind.1.9.5)
- if [ "1" -eq 1 ]; then \
-     for x in camlp4 dbm graphics labltk num ocamlbuild; do \
-       if [ -f "/home/opam/.opam/5.0+alpha-repo/lib/$x/META" ]; then \
-         if ! grep -Fq '[distributed with Ocaml]' "//home/opam/.opam/5.0+alpha-repo/lib/$x/META"; then \
-           rm -f site-lib-src/$x/META; \
-         fi; \
-       fi; \
-     done; \
-     test -f "site-lib-src/num/META" || rm -f "site-lib-src/num-top/META"; \
-   fi
- echo 'SITELIB_META =' > Makefile.packages.in
- for x in `ls site-lib-src`; do test ! -f "site-lib-src/$x/META" || echo $x >> Makefile.packages.in; done
- tr '\n' ' ' < Makefile.packages.in > Makefile.packages
- rm Makefile.packages.in
- install -d "/home/opam/.opam/5.0+alpha-repo/bin"
- install -d "/home/opam/.opam/5.0+alpha-repo/man"
- make install-config
- make[1]: Entering directory '/home/opam/.opam/5.0+alpha-repo/.opam-switch/build/ocamlfind.1.9.5'
- install -d "`dirname \"/home/opam/.opam/5.0+alpha-repo/lib/findlib.conf\"`"
- test -f "/home/opam/.opam/5.0+alpha-repo/lib/findlib.conf" || install -c findlib.conf "/home/opam/.opam/5.0+alpha-repo/lib/findlib.conf"
- make[1]: Leaving directory '/home/opam/.opam/5.0+alpha-repo/.opam-switch/build/ocamlfind.1.9.5'
- for p in findlib; do ( cd src/$p; make install ); done
- make[1]: Entering directory '/home/opam/.opam/5.0+alpha-repo/.opam-switch/build/ocamlfind.1.9.5/src/findlib'
- install -d "/home/opam/.opam/5.0+alpha-repo/lib/findlib"
- install -d "/home/opam/.opam/5.0+alpha-repo/bin"
- test 1 -eq 0 || install -d "/home/opam/.opam/5.0+alpha-repo/lib/ocaml"
- test 1 -eq 0 || install -c topfind "/home/opam/.opam/5.0+alpha-repo/lib/ocaml/"
- files=` ../../tools/collect_files ../../Makefile.config \
- findlib.cmi findlib.mli findlib.cma findlib.cmxa findlib.a findlib.cmxs \
- findlib_config.cmi findlib_config.ml topfind.cmi topfind.mli \
- fl_args.cmi fl_lint.cmi fl_meta.cmi fl_split.cmi fl_topo.cmi ocaml_args.cmi \
- fl_package_base.mli fl_package_base.cmi fl_metascanner.mli fl_metascanner.cmi \
- fl_metatoken.cmi findlib_top.cma findlib_top.cmxa findlib_top.a findlib_top.cmxs \
- findlib_dynload.cma findlib_dynload.cmxa findlib_dynload.a findlib_dynload.cmxs fl_dynload.mli fl_dynload.cmi \
- META` && \
- install -c $files "/home/opam/.opam/5.0+alpha-repo/lib/findlib/"
- f="ocamlfind"; { test -f ocamlfind_opt && f="ocamlfind_opt"; }; \
- install -c $f "/home/opam/.opam/5.0+alpha-repo/bin/ocamlfind"
- # the following "if" block is only needed for 4.00beta2
- if [ 1 -eq 0 -a -f "/home/opam/.opam/5.0+alpha-repo/lib/ocaml/compiler-libs/topdirs.cmi" ]; then \
-     cd "/home/opam/.opam/5.0+alpha-repo/lib/ocaml/compiler-libs/"; \
-     install -c topdirs.cmi toploop.cmi "/home/opam/.opam/5.0+alpha-repo/lib/findlib/"; \
- fi
- make[1]: Leaving directory '/home/opam/.opam/5.0+alpha-repo/.opam-switch/build/ocamlfind.1.9.5/src/findlib'
- make install-meta
- make[1]: Entering directory '/home/opam/.opam/5.0+alpha-repo/.opam-switch/build/ocamlfind.1.9.5'
- for x in bytes compiler-libs dynlink ocamldoc runtime_events stdlib str threads unix ; do install -d "/home/opam/.opam/5.0+alpha-repo/lib/$x"; install -c site-lib-src/$x/META "/home/opam/.opam/5.0+alpha-repo/lib/$x/META.tmp" && mv "/home/opam/.opam/5.0+alpha-repo/lib/$x/META.tmp" "/home/opam/.opam/5.0+alpha-repo/lib/$x/META"; done
- install -d "/home/opam/.opam/5.0+alpha-repo/lib/findlib"; install -c Makefile.packages "/home/opam/.opam/5.0+alpha-repo/lib/findlib/Makefile.packages"
- make[1]: Leaving directory '/home/opam/.opam/5.0+alpha-repo/.opam-switch/build/ocamlfind.1.9.5'
- test ! -f 'site-lib-src/num-top/META' || { cd src/findlib; make install-num-top; }
- test ! -f 'site-lib-src/camlp4/META' ||	install -c tools/safe_camlp4 "/home/opam/.opam/5.0+alpha-repo/bin"
- make install-doc
- make[1]: Entering directory '/home/opam/.opam/5.0+alpha-repo/.opam-switch/build/ocamlfind.1.9.5'
- install -d "/home/opam/.opam/5.0+alpha-repo/man/man1" "/home/opam/.opam/5.0+alpha-repo/man/man3" "/home/opam/.opam/5.0+alpha-repo/man/man5"
- install -c doc/ref-man/ocamlfind.1 "/home/opam/.opam/5.0+alpha-repo/man/man1"
- install -c doc/ref-man/META.5 doc/ref-man/site-lib.5 doc/ref-man/findlib.conf.5 "/home/opam/.opam/5.0+alpha-repo/man/man5"
- make[1]: Leaving directory '/home/opam/.opam/5.0+alpha-repo/.opam-switch/build/ocamlfind.1.9.5'
-> installed ocamlfind.1.9.5
Processing 96/268: [dune: ocaml bootstrap.ml] [ocamlbuild: make check-if-preinstalled]
Processing 97/268: [dune: ocaml bootstrap.ml] [ocamlbuild: make check-if-preinstalled]
Processing 98/268: [dune: ocaml bootstrap.ml] [num: make] [ocamlbuild: make check-if-preinstalled]
Processing 99/268: [dune: ocaml bootstrap.ml] [num: make] [ocamlbuild: make check-if-preinstalled]
-> installed base-bytes.base
Processing 100/268: [dune: ocaml bootstrap.ml] [num: make] [ocamlbuild: make check-if-preinstalled]
Processing 101/268: [dune: ocaml bootstrap.ml] [num: make] [ocamlbuild: make check-if-preinstalled] [xml-light: make install_ocamlfind]
+ /home/opam/.opam/opam-init/hooks/sandbox.sh "install" "make" "install_ocamlfind" (CWD=/home/opam/.opam/5.0+alpha-repo/.opam-switch/build/xml-light.2.4)
- ocamlyacc xml_parser.mly
- ocamlc  xml.mli
- ocamlc  dtd.mli
- ocamlc  xml_parser.mli
- ocamlc  -c xml_parser.ml
- ocamllex xml_lexer.mll
- 248 states, 1238 transitions, table size 6440 bytes
- ocamlc  xml_lexer.mli
- ocamlc  -c xml_lexer.ml
- File "xml_lexer.mll", line 279, characters 25-41:
- Error: Unbound value String.lowercase
- make: *** [Makefile:102: xml_lexer.cmo] Error 2
[ERROR] The installation of xml-light failed at "make install_ocamlfind".
Processing 101/268: [dune: ocaml bootstrap.ml] [num: make] [ocamlbuild: make check-if-preinstalled] [xml-light: ocamlfind remove]
+ /home/opam/.opam/opam-init/hooks/sandbox.sh "remove" "ocamlfind" "remove" "xml-light" (CWD=/home/opam/.opam/5.0+alpha-repo/.opam-switch/build/xml-light.2.4)
- ocamlfind: [WARNING] No such file: /home/opam/.opam/5.0+alpha-repo/lib/xml-light/META
Processing 101/268: [dune: ocaml bootstrap.ml] [num: make] [ocamlbuild: make check-if-preinstalled]
+ /home/opam/.opam/opam-init/hooks/sandbox.sh "build" "make" (CWD=/home/opam/.opam/5.0+alpha-repo/.opam-switch/build/num.1.4)
- make -C src all
- make[1]: Entering directory '/home/opam/.opam/5.0+alpha-repo/.opam-switch/build/num.1.4/src'
- ocamlc -ccopt -DBNG_ARCH_amd64 -c bng.c
- ocamlc -ccopt -DBNG_ARCH_amd64 -c nat_stubs.c
- ocamlmklib -oc nums bng.o nat_stubs.o
- ocamlc -w +a-4-9-41-42-44-45-48 -warn-error A -bin-annot -g -safe-string -strict-sequence -strict-formats -c int_misc.mli
- ocamlc -w +a-4-9-41-42-44-45-48 -warn-error A -bin-annot -g -safe-string -strict-sequence -strict-formats -c int_misc.ml
- ocamlc -w +a-4-9-41-42-44-45-48 -warn-error A -bin-annot -g -safe-string -strict-sequence -strict-formats -c nat.mli
- ocamlc -w +a-4-9-41-42-44-45-48 -warn-error A -bin-annot -g -safe-string -strict-sequence -strict-formats -c nat.ml
- ocamlc -w +a-4-9-41-42-44-45-48 -warn-error A -bin-annot -g -safe-string -strict-sequence -strict-formats -c big_int.mli
- ocamlc -w +a-4-9-41-42-44-45-48 -warn-error A -bin-annot -g -safe-string -strict-sequence -strict-formats -c big_int.ml
- ocamlc -w +a-4-9-41-42-44-45-48 -warn-error A -bin-annot -g -safe-string -strict-sequence -strict-formats -c arith_flags.mli
- ocamlc -w +a-4-9-41-42-44-45-48 -warn-error A -bin-annot -g -safe-string -strict-sequence -strict-formats -c arith_flags.ml
- ocamlc -w +a-4-9-41-42-44-45-48 -warn-error A -bin-annot -g -safe-string -strict-sequence -strict-formats -c ratio.mli
- ocamlc -w +a-4-9-41-42-44-45-48 -warn-error A -bin-annot -g -safe-string -strict-sequence -strict-formats -c ratio.ml
- ocamlc -w +a-4-9-41-42-44-45-48 -warn-error A -bin-annot -g -safe-string -strict-sequence -strict-formats -c num.mli
- ocamlc -w +a-4-9-41-42-44-45-48 -warn-error A -bin-annot -g -safe-string -strict-sequence -strict-formats -c num.ml
- ocamlc -w +a-4-9-41-42-44-45-48 -warn-error A -bin-annot -g -safe-string -strict-sequence -strict-formats -c arith_status.mli
- ocamlc -w +a-4-9-41-42-44-45-48 -warn-error A -bin-annot -g -safe-string -strict-sequence -strict-formats -c arith_status.ml
- ocamlmklib -o nums -oc nums -linkall int_misc.cmo nat.cmo big_int.cmo arith_flags.cmo ratio.cmo num.cmo arith_status.cmo
- ocamlopt -w +a-4-9-41-42-44-45-48 -warn-error A -bin-annot -g -safe-string -strict-sequence -strict-formats -c int_misc.ml
- ocamlopt -w +a-4-9-41-42-44-45-48 -warn-error A -bin-annot -g -safe-string -strict-sequence -strict-formats -c nat.ml
- ocamlopt -w +a-4-9-41-42-44-45-48 -warn-error A -bin-annot -g -safe-string -strict-sequence -strict-formats -c big_int.ml
- ocamlopt -w +a-4-9-41-42-44-45-48 -warn-error A -bin-annot -g -safe-string -strict-sequence -strict-formats -c arith_flags.ml
- ocamlopt -w +a-4-9-41-42-44-45-48 -warn-error A -bin-annot -g -safe-string -strict-sequence -strict-formats -c ratio.ml
- ocamlopt -w +a-4-9-41-42-44-45-48 -warn-error A -bin-annot -g -safe-string -strict-sequence -strict-formats -c num.ml
- ocamlopt -w +a-4-9-41-42-44-45-48 -warn-error A -bin-annot -g -safe-string -strict-sequence -strict-formats -c arith_status.ml
- ocamlmklib -o nums -oc nums -linkall int_misc.cmx nat.cmx big_int.cmx arith_flags.cmx ratio.cmx num.cmx arith_status.cmx
- ocamlopt -w +a-4-9-41-42-44-45-48 -warn-error A -bin-annot -g -safe-string -strict-sequence -strict-formats -I . -shared -o nums.cmxs nums.cmxa
- make[1]: Leaving directory '/home/opam/.opam/5.0+alpha-repo/.opam-switch/build/num.1.4/src'
- make -C toplevel all
- make[1]: Entering directory '/home/opam/.opam/5.0+alpha-repo/.opam-switch/build/num.1.4/toplevel'
- ocamlc -I ../src -I +compiler-libs -w +a-4-9-41-42-44-45-48 -warn-error A -safe-string -strict-sequence -strict-formats -c num_top_printers.mli
- ocamlc -I ../src -I +compiler-libs -w +a-4-9-41-42-44-45-48 -warn-error A -safe-string -strict-sequence -strict-formats -c num_top_printers.ml
- ocamlc -I ../src -I +compiler-libs -w +a-4-9-41-42-44-45-48 -warn-error A -safe-string -strict-sequence -strict-formats -c num_top.mli
- ocamlc -I ../src -I +compiler-libs -w +a-4-9-41-42-44-45-48 -warn-error A -safe-string -strict-sequence -strict-formats -c num_top.ml
- ocamlc -I ../src -I +compiler-libs -w +a-4-9-41-42-44-45-48 -warn-error A -safe-string -strict-sequence -strict-formats -a -o num_top.cma num_top_printers.cmo num_top.cmo
- make[1]: Leaving directory '/home/opam/.opam/5.0+alpha-repo/.opam-switch/build/num.1.4/toplevel'
-> compiled  num.1.4
Processing 101/268: [dune: ocaml bootstrap.ml] [ocamlbuild: make check-if-preinstalled]
Processing 102/268: [dune: ocaml bootstrap.ml] [ocamlbuild: make check-if-preinstalled] [num: ocamlfind remove]
+ /home/opam/.opam/opam-init/hooks/sandbox.sh "install" "ocamlfind" "remove" "num" (CWD=/home/opam/.opam/5.0+alpha-repo/.opam-switch/build/num.1.4)
- ocamlfind: [WARNING] No such file: /home/opam/.opam/5.0+alpha-repo/lib/num/META
+ /home/opam/.opam/opam-init/hooks/sandbox.sh "install" "ocamlfind" "remove" "num-top" (CWD=/home/opam/.opam/5.0+alpha-repo/.opam-switch/build/num.1.4)
- ocamlfind: [WARNING] No such file: /home/opam/.opam/5.0+alpha-repo/lib/num-top/META
Processing 102/268: [dune: ocaml bootstrap.ml] [ocamlbuild: make check-if-preinstalled] [num: make install]
+ /home/opam/.opam/opam-init/hooks/sandbox.sh "install" "make" "install" (CWD=/home/opam/.opam/5.0+alpha-repo/.opam-switch/build/num.1.4)
- make -C src install
- make[1]: Entering directory '/home/opam/.opam/5.0+alpha-repo/.opam-switch/build/num.1.4/src'
- install -d /home/opam/.opam/5.0+alpha-repo/lib/ocaml
- sed -e 's/%%VERSION%%/1.4/g' META.in > META
- ocamlfind install num META
- Installed /home/opam/.opam/5.0+alpha-repo/lib/num/META
- rm -f META
- install -m 644 nums.cma libnums.a big_int.cmi nat.cmi num.cmi ratio.cmi arith_status.cmi big_int.mli nat.mli num.mli ratio.mli arith_status.mli big_int.cmti nat.cmti num.cmti ratio.cmti arith_status.cmti nums.cmxa nums.a int_misc.cmx nat.cmx big_int.cmx arith_flags.cmx ratio.cmx num.cmx arith_status.cmx nums.cmxs /home/opam/.opam/5.0+alpha-repo/lib/ocaml
- install -d /home/opam/.opam/5.0+alpha-repo/lib/ocaml/stublibs
- install dllnums.so /home/opam/.opam/5.0+alpha-repo/lib/ocaml/stublibs
- make[1]: Leaving directory '/home/opam/.opam/5.0+alpha-repo/.opam-switch/build/num.1.4/src'
- make -C toplevel install
- make[1]: Entering directory '/home/opam/.opam/5.0+alpha-repo/.opam-switch/build/num.1.4/toplevel'
- sed -e 's/%%VERSION%%/1.4/g' META.in > META
- ocamlfind install num-top META num_top.cma num_top.cmi num_top_printers.cmi
- Installed /home/opam/.opam/5.0+alpha-repo/lib/num-top/num_top_printers.cmi
- Installed /home/opam/.opam/5.0+alpha-repo/lib/num-top/num_top.cmi
- Installed /home/opam/.opam/5.0+alpha-repo/lib/num-top/num_top.cma
- Installed /home/opam/.opam/5.0+alpha-repo/lib/num-top/META
- rm -f META
- make[1]: Leaving directory '/home/opam/.opam/5.0+alpha-repo/.opam-switch/build/num.1.4/toplevel'
-> installed num.1.4
Processing 102/268: [dune: ocaml bootstrap.ml] [ocamlbuild: make check-if-preinstalled]
+ /home/opam/.opam/opam-init/hooks/sandbox.sh "build" "make" "check-if-preinstalled" "all" "opam-install" (CWD=/home/opam/.opam/5.0+alpha-repo/.opam-switch/build/ocamlbuild.0.14.1)
- if test -d /home/opam/.opam/5.0+alpha-repo/lib/ocaml/ocamlbuild; then\
-   >&2 echo "ERROR: Preinstalled ocamlbuild detected at"\
-        "/home/opam/.opam/5.0+alpha-repo/lib/ocaml/ocamlbuild";\
-   >&2 echo "Installation aborted; if you want to bypass this"\
-         "safety check, pass CHECK_IF_PREINSTALLED=false to make";\
-   exit 2;\
- fi
- ocamlc.opt -w +L -w +R -w +Z -I src -I +unix -safe-string -bin-annot -strict-sequence -c src/const.ml
- ocamlc.opt -w +L -w +R -w +Z -I src -I +unix -safe-string -bin-annot -strict-sequence -c src/loc.mli
- ocamlc.opt -w +L -w +R -w +Z -I src -I +unix -safe-string -bin-annot -strict-sequence -c src/loc.ml
- ocamlc.opt -w +L -w +R -w +Z -I src -I +unix -safe-string -bin-annot -strict-sequence -c src/discard_printf.mli
- ocamlc.opt -w +L -w +R -w +Z -I src -I +unix -safe-string -bin-annot -strict-sequence -c src/discard_printf.ml
- ocamlc.opt -w +L -w +R -w +Z -I src -I +unix -safe-string -bin-annot -strict-sequence -c src/signatures.mli
- ocamlc.opt -w +L -w +R -w +Z -I src -I +unix -safe-string -bin-annot -strict-sequence -c src/my_std.mli
- ocamlc.opt -w +L -w +R -w +Z -I src -I +unix -safe-string -bin-annot -strict-sequence -c src/my_std.ml
- ocamlc.opt -w +L -w +R -w +Z -I src -I +unix -safe-string -bin-annot -strict-sequence -c src/my_unix.mli
- ocamlc.opt -w +L -w +R -w +Z -I src -I +unix -safe-string -bin-annot -strict-sequence -c src/my_unix.ml
- ocamlc.opt -w +L -w +R -w +Z -I src -I +unix -safe-string -bin-annot -strict-sequence -c src/tags.mli
- ocamlc.opt -w +L -w +R -w +Z -I src -I +unix -safe-string -bin-annot -strict-sequence -c src/tags.ml
- ocamlc.opt -w +L -w +R -w +Z -I src -I +unix -safe-string -bin-annot -strict-sequence -c src/display.mli
- ocamlc.opt -w +L -w +R -w +Z -I src -I +unix -safe-string -bin-annot -strict-sequence -c src/display.ml
- ocamlc.opt -w +L -w +R -w +Z -I src -I +unix -safe-string -bin-annot -strict-sequence -c src/log.mli
- ocamlc.opt -w +L -w +R -w +Z -I src -I +unix -safe-string -bin-annot -strict-sequence -c src/log.ml
- ocamlc.opt -w +L -w +R -w +Z -I src -I +unix -safe-string -bin-annot -strict-sequence -c src/shell.mli
- ocamlc.opt -w +L -w +R -w +Z -I src -I +unix -safe-string -bin-annot -strict-sequence -c src/shell.ml
- ocamlc.opt -w +L -w +R -w +Z -I src -I +unix -safe-string -bin-annot -strict-sequence -c src/bool.mli
- ocamlc.opt -w +L -w +R -w +Z -I src -I +unix -safe-string -bin-annot -strict-sequence -c src/bool.ml
- ocamlc.opt -w +L -w +R -w +Z -I src -I +unix -safe-string -bin-annot -strict-sequence -c src/glob_ast.mli
- ocamlc.opt -w +L -w +R -w +Z -I src -I +unix -safe-string -bin-annot -strict-sequence -c src/glob_ast.ml
- ocamllex.opt src/glob_lexer.mll
- 55 states, 419 transitions, table size 2006 bytes
- ocamlc.opt -w +L -w +R -w +Z -I src -I +unix -safe-string -bin-annot -strict-sequence -c src/glob_lexer.mli
- ocamlc.opt -w +L -w +R -w +Z -I src -I +unix -safe-string -bin-annot -strict-sequence -c src/glob_lexer.ml
- ocamlc.opt -w +L -w +R -w +Z -I src -I +unix -safe-string -bin-annot -strict-sequence -c src/glob.mli
- ocamlc.opt -w +L -w +R -w +Z -I src -I +unix -safe-string -bin-annot -strict-sequence -c src/glob.ml
- ocamllex.opt src/lexers.mll
- 251 states, 1051 transitions, table size 5710 bytes
- 4334 additional bytes used for bindings
- ocamlc.opt -w +L -w +R -w +Z -I src -I +unix -safe-string -bin-annot -strict-sequence -c src/lexers.mli
- ocamlc.opt -w +L -w +R -w +Z -I src -I +unix -safe-string -bin-annot -strict-sequence -c src/lexers.ml
- ocamlc.opt -w +L -w +R -w +Z -I src -I +unix -safe-string -bin-annot -strict-sequence -c src/param_tags.mli
- ocamlc.opt -w +L -w +R -w +Z -I src -I +unix -safe-string -bin-annot -strict-sequence -c src/param_tags.ml
- ocamlc.opt -w +L -w +R -w +Z -I src -I +unix -safe-string -bin-annot -strict-sequence -c src/command.mli
- ocamlc.opt -w +L -w +R -w +Z -I src -I +unix -safe-string -bin-annot -strict-sequence -c src/command.ml
- ocamlc.opt -w +L -w +R -w +Z -I src -I +unix -safe-string -bin-annot -strict-sequence -c src/ocamlbuild_config.ml
- ocamlc.opt -w +L -w +R -w +Z -I src -I +unix -safe-string -bin-annot -strict-sequence -c src/ocamlbuild_where.mli
- ocamlc.opt -w +L -w +R -w +Z -I src -I +unix -safe-string -bin-annot -strict-sequence -c src/ocamlbuild_where.ml
- ocamlc.opt -w +L -w +R -w +Z -I src -I +unix -safe-string -bin-annot -strict-sequence -c src/slurp.mli
- ocamlc.opt -w +L -w +R -w +Z -I src -I +unix -safe-string -bin-annot -strict-sequence -c src/slurp.ml
- ocamlc.opt -w +L -w +R -w +Z -I src -I +unix -safe-string -bin-annot -strict-sequence -c src/options.mli
- ocamlc.opt -w +L -w +R -w +Z -I src -I +unix -safe-string -bin-annot -strict-sequence -c src/options.ml
- ocamlc.opt -w +L -w +R -w +Z -I src -I +unix -safe-string -bin-annot -strict-sequence -c src/pathname.mli
- ocamlc.opt -w +L -w +R -w +Z -I src -I +unix -safe-string -bin-annot -strict-sequence -c src/pathname.ml
- ocamlc.opt -w +L -w +R -w +Z -I src -I +unix -safe-string -bin-annot -strict-sequence -c src/configuration.mli
- ocamlc.opt -w +L -w +R -w +Z -I src -I +unix -safe-string -bin-annot -strict-sequence -c src/configuration.ml
- ocamlc.opt -w +L -w +R -w +Z -I src -I +unix -safe-string -bin-annot -strict-sequence -c src/flags.mli
- ocamlc.opt -w +L -w +R -w +Z -I src -I +unix -safe-string -bin-annot -strict-sequence -c src/flags.ml
- ocamlc.opt -w +L -w +R -w +Z -I src -I +unix -safe-string -bin-annot -strict-sequence -c src/hygiene.mli
- ocamlc.opt -w +L -w +R -w +Z -I src -I +unix -safe-string -bin-annot -strict-sequence -c src/hygiene.ml
- ocamlc.opt -w +L -w +R -w +Z -I src -I +unix -safe-string -bin-annot -strict-sequence -c src/digest_cache.mli
- ocamlc.opt -w +L -w +R -w +Z -I src -I +unix -safe-string -bin-annot -strict-sequence -c src/digest_cache.ml
- ocamlc.opt -w +L -w +R -w +Z -I src -I +unix -safe-string -bin-annot -strict-sequence -c src/resource.mli
- ocamlc.opt -w +L -w +R -w +Z -I src -I +unix -safe-string -bin-annot -strict-sequence -c src/resource.ml
- ocamlc.opt -w +L -w +R -w +Z -I src -I +unix -safe-string -bin-annot -strict-sequence -c src/rule.mli
- ocamlc.opt -w +L -w +R -w +Z -I src -I +unix -safe-string -bin-annot -strict-sequence -c src/rule.ml
- ocamlc.opt -w +L -w +R -w +Z -I src -I +unix -safe-string -bin-annot -strict-sequence -c src/solver.mli
- ocamlc.opt -w +L -w +R -w +Z -I src -I +unix -safe-string -bin-annot -strict-sequence -c src/solver.ml
- ocamlc.opt -w +L -w +R -w +Z -I src -I +unix -safe-string -bin-annot -strict-sequence -c src/report.mli
- ocamlc.opt -w +L -w +R -w +Z -I src -I +unix -safe-string -bin-annot -strict-sequence -c src/report.ml
- ocamlc.opt -w +L -w +R -w +Z -I src -I +unix -safe-string -bin-annot -strict-sequence -c src/tools.mli
- ocamlc.opt -w +L -w +R -w +Z -I src -I +unix -safe-string -bin-annot -strict-sequence -c src/tools.ml
- ocamlc.opt -w +L -w +R -w +Z -I src -I +unix -safe-string -bin-annot -strict-sequence -c src/fda.mli
- ocamlc.opt -w +L -w +R -w +Z -I src -I +unix -safe-string -bin-annot -strict-sequence -c src/fda.ml
- ocamlc.opt -w +L -w +R -w +Z -I src -I +unix -safe-string -bin-annot -strict-sequence -c src/findlib.mli
- ocamlc.opt -w +L -w +R -w +Z -I src -I +unix -safe-string -bin-annot -strict-sequence -c src/findlib.ml
- ocamlc.opt -w +L -w +R -w +Z -I src -I +unix -safe-string -bin-annot -strict-sequence -c src/ocaml_arch.mli
- ocamlc.opt -w +L -w +R -w +Z -I src -I +unix -safe-string -bin-annot -strict-sequence -c src/ocaml_arch.ml
- ocamlc.opt -w +L -w +R -w +Z -I src -I +unix -safe-string -bin-annot -strict-sequence -c src/ocaml_utils.mli
- ocamlc.opt -w +L -w +R -w +Z -I src -I +unix -safe-string -bin-annot -strict-sequence -c src/ocaml_utils.ml
- ocamlc.opt -w +L -w +R -w +Z -I src -I +unix -safe-string -bin-annot -strict-sequence -c src/ocaml_dependencies.mli
- ocamlc.opt -w +L -w +R -w +Z -I src -I +unix -safe-string -bin-annot -strict-sequence -c src/ocaml_dependencies.ml
- ocamlc.opt -w +L -w +R -w +Z -I src -I +unix -safe-string -bin-annot -strict-sequence -c src/ocaml_compiler.mli
- ocamlc.opt -w +L -w +R -w +Z -I src -I +unix -safe-string -bin-annot -strict-sequence -c src/ocaml_compiler.ml
- ocamlc.opt -w +L -w +R -w +Z -I src -I +unix -safe-string -bin-annot -strict-sequence -c src/ocaml_tools.mli
- ocamlc.opt -w +L -w +R -w +Z -I src -I +unix -safe-string -bin-annot -strict-sequence -c src/ocaml_tools.ml
- ocamlc.opt -w +L -w +R -w +Z -I src -I +unix -safe-string -bin-annot -strict-sequence -c src/ocaml_specific.mli
- ocamlc.opt -w +L -w +R -w +Z -I src -I +unix -safe-string -bin-annot -strict-sequence -c src/ocaml_specific.ml
- ocamlc.opt -w +L -w +R -w +Z -I src -I +unix -safe-string -bin-annot -strict-sequence -c src/exit_codes.mli
- ocamlc.opt -w +L -w +R -w +Z -I src -I +unix -safe-string -bin-annot -strict-sequence -c src/exit_codes.ml
- ocamlc.opt -w +L -w +R -w +Z -I src -I +unix -safe-string -bin-annot -strict-sequence -c src/plugin.mli
- ocamlc.opt -w +L -w +R -w +Z -I src -I +unix -safe-string -bin-annot -strict-sequence -c src/plugin.ml
- ocamlc.opt -w +L -w +R -w +Z -I src -I +unix -safe-string -bin-annot -strict-sequence -c src/hooks.mli
- ocamlc.opt -w +L -w +R -w +Z -I src -I +unix -safe-string -bin-annot -strict-sequence -c src/hooks.ml
- ocamlc.opt -w +L -w +R -w +Z -I src -I +unix -safe-string -bin-annot -strict-sequence -c src/main.mli
- ocamlc.opt -w +L -w +R -w +Z -I src -I +unix -safe-string -bin-annot -strict-sequence -c src/main.ml
- mkdir -p tmp
- ocamlc.opt -pack src/const.cmo src/loc.cmo src/discard_printf.cmo src/signatures.cmi src/my_std.cmo src/my_unix.cmo src/tags.cmo src/display.cmo src/log.cmo src/shell.cmo src/bool.cmo src/glob_ast.cmo src/glob_lexer.cmo src/glob.cmo src/lexers.cmo src/param_tags.cmo src/command.cmo src/ocamlbuild_config.cmo src/ocamlbuild_where.cmo src/slurp.cmo src/options.cmo src/pathname.cmo src/configuration.cmo src/flags.cmo src/hygiene.cmo src/digest_cache.cmo src/resource.cmo src/rule.cmo src/solver.cmo src/report.cmo src/tools.cmo src/fda.cmo src/findlib.cmo src/ocaml_arch.cmo src/ocaml_utils.cmo src/ocaml_dependencies.cmo src/ocaml_compiler.cmo src/ocaml_tools.cmo src/ocaml_specific.cmo src/exit_codes.cmo src/plugin.cmo src/hooks.cmo src/main.cmo -o tmp/ocamlbuild_pack.cmo
- mv tmp/ocamlbuild_pack.cmi src/ocamlbuild_pack.cmi
- mv tmp/ocamlbuild_pack.cmo src/ocamlbuild_pack.cmo
- ocamlc.opt -w +L -w +R -w +Z -I src -I +unix -safe-string -bin-annot -strict-sequence -c src/ocamlbuild_plugin.mli
- ocamlc.opt -w +L -w +R -w +Z -I src -I +unix -safe-string -bin-annot -strict-sequence -c src/ocamlbuild_plugin.ml
- ocamlc.opt -w +L -w +R -w +Z -I src -I +unix -safe-string -bin-annot -strict-sequence -c src/ocamlbuild_executor.mli
- ocamlc.opt -w +L -w +R -w +Z -I src -I +unix -safe-string -bin-annot -strict-sequence -c src/ocamlbuild_executor.ml
- ocamlc.opt -w +L -w +R -w +Z -I src -I +unix -safe-string -bin-annot -strict-sequence -c src/ocamlbuild_unix_plugin.mli
- ocamlc.opt -w +L -w +R -w +Z -I src -I +unix -safe-string -bin-annot -strict-sequence -c src/ocamlbuild_unix_plugin.ml
- ocamlc.opt -w +L -w +R -w +Z -I src -I +unix -safe-string -bin-annot -strict-sequence -c src/ocamlbuild.mli
- ocamlc.opt -w +L -w +R -w +Z -I src -I +unix -safe-string -bin-annot -strict-sequence -c src/ocamlbuild.ml
- ocamlc.opt -I +unix -I src -o ocamlbuild.byte unix.cma src/ocamlbuild_pack.cmo src/ocamlbuild_plugin.cmo src/ocamlbuild_executor.cmo src/ocamlbuild_unix_plugin.cmo src/ocamlbuild.cmo
- ocamlc.opt -a -o src/ocamlbuildlib.cma src/ocamlbuild_pack.cmo src/ocamlbuild_plugin.cmo src/ocamlbuild_executor.cmo src/ocamlbuild_unix_plugin.cmo
- ocamlopt.opt -for-pack Ocamlbuild_pack -w +L -w +R -w +Z -I src -I +unix -safe-string -bin-annot -strict-sequence -c src/const.ml
- ocamlopt.opt -for-pack Ocamlbuild_pack -w +L -w +R -w +Z -I src -I +unix -safe-string -bin-annot -strict-sequence -c src/loc.ml
- ocamlopt.opt -for-pack Ocamlbuild_pack -w +L -w +R -w +Z -I src -I +unix -safe-string -bin-annot -strict-sequence -c src/discard_printf.ml
- ocamlopt.opt -for-pack Ocamlbuild_pack -w +L -w +R -w +Z -I src -I +unix -safe-string -bin-annot -strict-sequence -c src/my_std.ml
- ocamlopt.opt -for-pack Ocamlbuild_pack -w +L -w +R -w +Z -I src -I +unix -safe-string -bin-annot -strict-sequence -c src/my_unix.ml
- ocamlopt.opt -for-pack Ocamlbuild_pack -w +L -w +R -w +Z -I src -I +unix -safe-string -bin-annot -strict-sequence -c src/tags.ml
- ocamlopt.opt -for-pack Ocamlbuild_pack -w +L -w +R -w +Z -I src -I +unix -safe-string -bin-annot -strict-sequence -c src/display.ml
- ocamlopt.opt -for-pack Ocamlbuild_pack -w +L -w +R -w +Z -I src -I +unix -safe-string -bin-annot -strict-sequence -c src/log.ml
- ocamlopt.opt -for-pack Ocamlbuild_pack -w +L -w +R -w +Z -I src -I +unix -safe-string -bin-annot -strict-sequence -c src/shell.ml
- ocamlopt.opt -for-pack Ocamlbuild_pack -w +L -w +R -w +Z -I src -I +unix -safe-string -bin-annot -strict-sequence -c src/bool.ml
- ocamlopt.opt -for-pack Ocamlbuild_pack -w +L -w +R -w +Z -I src -I +unix -safe-string -bin-annot -strict-sequence -c src/glob_ast.ml
- ocamlopt.opt -for-pack Ocamlbuild_pack -w +L -w +R -w +Z -I src -I +unix -safe-string -bin-annot -strict-sequence -c src/glob_lexer.ml
- ocamlopt.opt -for-pack Ocamlbuild_pack -w +L -w +R -w +Z -I src -I +unix -safe-string -bin-annot -strict-sequence -c src/glob.ml
- ocamlopt.opt -for-pack Ocamlbuild_pack -w +L -w +R -w +Z -I src -I +unix -safe-string -bin-annot -strict-sequence -c src/lexers.ml
- ocamlopt.opt -for-pack Ocamlbuild_pack -w +L -w +R -w +Z -I src -I +unix -safe-string -bin-annot -strict-sequence -c src/param_tags.ml
- ocamlopt.opt -for-pack Ocamlbuild_pack -w +L -w +R -w +Z -I src -I +unix -safe-string -bin-annot -strict-sequence -c src/command.ml
- ocamlopt.opt -for-pack Ocamlbuild_pack -w +L -w +R -w +Z -I src -I +unix -safe-string -bin-annot -strict-sequence -c src/ocamlbuild_config.ml
- ocamlopt.opt -for-pack Ocamlbuild_pack -w +L -w +R -w +Z -I src -I +unix -safe-string -bin-annot -strict-sequence -c src/ocamlbuild_where.ml
- ocamlopt.opt -for-pack Ocamlbuild_pack -w +L -w +R -w +Z -I src -I +unix -safe-string -bin-annot -strict-sequence -c src/slurp.ml
- ocamlopt.opt -for-pack Ocamlbuild_pack -w +L -w +R -w +Z -I src -I +unix -safe-string -bin-annot -strict-sequence -c src/options.ml
- ocamlopt.opt -for-pack Ocamlbuild_pack -w +L -w +R -w +Z -I src -I +unix -safe-string -bin-annot -strict-sequence -c src/pathname.ml
- ocamlopt.opt -for-pack Ocamlbuild_pack -w +L -w +R -w +Z -I src -I +unix -safe-string -bin-annot -strict-sequence -c src/configuration.ml
- ocamlopt.opt -for-pack Ocamlbuild_pack -w +L -w +R -w +Z -I src -I +unix -safe-string -bin-annot -strict-sequence -c src/flags.ml
- ocamlopt.opt -for-pack Ocamlbuild_pack -w +L -w +R -w +Z -I src -I +unix -safe-string -bin-annot -strict-sequence -c src/hygiene.ml
- ocamlopt.opt -for-pack Ocamlbuild_pack -w +L -w +R -w +Z -I src -I +unix -safe-string -bin-annot -strict-sequence -c src/digest_cache.ml
- ocamlopt.opt -for-pack Ocamlbuild_pack -w +L -w +R -w +Z -I src -I +unix -safe-string -bin-annot -strict-sequence -c src/resource.ml
- ocamlopt.opt -for-pack Ocamlbuild_pack -w +L -w +R -w +Z -I src -I +unix -safe-string -bin-annot -strict-sequence -c src/rule.ml
- ocamlopt.opt -for-pack Ocamlbuild_pack -w +L -w +R -w +Z -I src -I +unix -safe-string -bin-annot -strict-sequence -c src/solver.ml
- ocamlopt.opt -for-pack Ocamlbuild_pack -w +L -w +R -w +Z -I src -I +unix -safe-string -bin-annot -strict-sequence -c src/report.ml
- ocamlopt.opt -for-pack Ocamlbuild_pack -w +L -w +R -w +Z -I src -I +unix -safe-string -bin-annot -strict-sequence -c src/tools.ml
- ocamlopt.opt -for-pack Ocamlbuild_pack -w +L -w +R -w +Z -I src -I +unix -safe-string -bin-annot -strict-sequence -c src/fda.ml
- ocamlopt.opt -for-pack Ocamlbuild_pack -w +L -w +R -w +Z -I src -I +unix -safe-string -bin-annot -strict-sequence -c src/findlib.ml
- ocamlopt.opt -for-pack Ocamlbuild_pack -w +L -w +R -w +Z -I src -I +unix -safe-string -bin-annot -strict-sequence -c src/ocaml_arch.ml
- ocamlopt.opt -for-pack Ocamlbuild_pack -w +L -w +R -w +Z -I src -I +unix -safe-string -bin-annot -strict-sequence -c src/ocaml_utils.ml
- ocamlopt.opt -for-pack Ocamlbuild_pack -w +L -w +R -w +Z -I src -I +unix -safe-string -bin-annot -strict-sequence -c src/ocaml_dependencies.ml
- ocamlopt.opt -for-pack Ocamlbuild_pack -w +L -w +R -w +Z -I src -I +unix -safe-string -bin-annot -strict-sequence -c src/ocaml_compiler.ml
- ocamlopt.opt -for-pack Ocamlbuild_pack -w +L -w +R -w +Z -I src -I +unix -safe-string -bin-annot -strict-sequence -c src/ocaml_tools.ml
- ocamlopt.opt -for-pack Ocamlbuild_pack -w +L -w +R -w +Z -I src -I +unix -safe-string -bin-annot -strict-sequence -c src/ocaml_specific.ml
- ocamlopt.opt -for-pack Ocamlbuild_pack -w +L -w +R -w +Z -I src -I +unix -safe-string -bin-annot -strict-sequence -c src/exit_codes.ml
- ocamlopt.opt -for-pack Ocamlbuild_pack -w +L -w +R -w +Z -I src -I +unix -safe-string -bin-annot -strict-sequence -c src/plugin.ml
- ocamlopt.opt -for-pack Ocamlbuild_pack -w +L -w +R -w +Z -I src -I +unix -safe-string -bin-annot -strict-sequence -c src/hooks.ml
- ocamlopt.opt -for-pack Ocamlbuild_pack -w +L -w +R -w +Z -I src -I +unix -safe-string -bin-annot -strict-sequence -c src/main.ml
- mkdir -p tmp
- ocamlopt.opt -pack src/const.cmx src/loc.cmx src/discard_printf.cmx src/signatures.cmi src/my_std.cmx src/my_unix.cmx src/tags.cmx src/display.cmx src/log.cmx src/shell.cmx src/bool.cmx src/glob_ast.cmx src/glob_lexer.cmx src/glob.cmx src/lexers.cmx src/param_tags.cmx src/command.cmx src/ocamlbuild_config.cmx src/ocamlbuild_where.cmx src/slurp.cmx src/options.cmx src/pathname.cmx src/configuration.cmx src/flags.cmx src/hygiene.cmx src/digest_cache.cmx src/resource.cmx src/rule.cmx src/solver.cmx src/report.cmx src/tools.cmx src/fda.cmx src/findlib.cmx src/ocaml_arch.cmx src/ocaml_utils.cmx src/ocaml_dependencies.cmx src/ocaml_compiler.cmx src/ocaml_tools.cmx src/ocaml_specific.cmx src/exit_codes.cmx src/plugin.cmx src/hooks.cmx src/main.cmx -o tmp/ocamlbuild_pack.cmx
- mv tmp/ocamlbuild_pack.cmx src/ocamlbuild_pack.cmx
- mv tmp/ocamlbuild_pack.o src/ocamlbuild_pack.o
- ocamlopt.opt -for-pack Ocamlbuild_pack -w +L -w +R -w +Z -I src -I +unix -safe-string -bin-annot -strict-sequence -c src/ocamlbuild_plugin.ml
- ocamlopt.opt -for-pack Ocamlbuild_pack -w +L -w +R -w +Z -I src -I +unix -safe-string -bin-annot -strict-sequence -c src/ocamlbuild_executor.ml
- ocamlopt.opt -for-pack Ocamlbuild_pack -w +L -w +R -w +Z -I src -I +unix -safe-string -bin-annot -strict-sequence -c src/ocamlbuild_unix_plugin.ml
- ocamlopt.opt -for-pack Ocamlbuild_pack -w +L -w +R -w +Z -I src -I +unix -safe-string -bin-annot -strict-sequence -c src/ocamlbuild.ml
- ocamlopt.opt -I +unix -I src -o ocamlbuild.native unix.cmxa src/ocamlbuild_pack.cmx src/ocamlbuild_plugin.cmx src/ocamlbuild_executor.cmx src/ocamlbuild_unix_plugin.cmx src/ocamlbuild.cmx
- ocamlopt.opt -a -o src/ocamlbuildlib.cmxa src/ocamlbuild_pack.cmx src/ocamlbuild_plugin.cmx src/ocamlbuild_executor.cmx src/ocamlbuild_unix_plugin.cmx
- ocamlc.opt src/ocamlbuild_pack.cmo -I src man/options_man.ml -o man/options_man.byte
- ./man/options_man.byte > man/ocamlbuild.options.1
- cat man/ocamlbuild.header.1 man/ocamlbuild.options.1 man/ocamlbuild.footer.1 > man/ocamlbuild.1
- make ocamlbuild.install
- make[1]: Entering directory '/home/opam/.opam/5.0+alpha-repo/.opam-switch/build/ocamlbuild.0.14.1'
- rm -f ocamlbuild.install
- touch ocamlbuild.install
- make install-bin-opam
- make[2]: Entering directory '/home/opam/.opam/5.0+alpha-repo/.opam-switch/build/ocamlbuild.0.14.1'
- echo 'bin: [' >> ocamlbuild.install
- echo '  "ocamlbuild.byte" {"ocamlbuild.byte"}' >> ocamlbuild.install
- echo '  "ocamlbuild.native" {"ocamlbuild.native"}' >> ocamlbuild.install
- echo '  "ocamlbuild.native" {"ocamlbuild"}' >> ocamlbuild.install
- echo ']' >> ocamlbuild.install
- echo >> ocamlbuild.install
- make[2]: Leaving directory '/home/opam/.opam/5.0+alpha-repo/.opam-switch/build/ocamlbuild.0.14.1'
- make install-lib-opam
- make[2]: Entering directory '/home/opam/.opam/5.0+alpha-repo/.opam-switch/build/ocamlbuild.0.14.1'
- echo 'lib: [' >> ocamlbuild.install
- make install-lib-basics-opam
- make[3]: Entering directory '/home/opam/.opam/5.0+alpha-repo/.opam-switch/build/ocamlbuild.0.14.1'
- echo '  "ocamlbuild.opam" {"opam"}' >> ocamlbuild.install
- echo '  "META"' >> ocamlbuild.install
- for lib in src/signatures.mli src/signatures.cmi src/signatures.cmti; do \
-   echo "  \"$lib\" {\"$(basename $lib)\"}" >> ocamlbuild.install; \
- done
- make[3]: Leaving directory '/home/opam/.opam/5.0+alpha-repo/.opam-switch/build/ocamlbuild.0.14.1'
- make install-lib-byte-opam
- make[3]: Entering directory '/home/opam/.opam/5.0+alpha-repo/.opam-switch/build/ocamlbuild.0.14.1'
- for lib in src/ocamlbuildlib.cma src/ocamlbuild.cmo src/ocamlbuild_pack.cmi src/ocamlbuild_plugin.cmi src/ocamlbuild_executor.cmi src/ocamlbuild_unix_plugin.cmi; do \
-   echo "  \"$lib\" {\"$(basename $lib)\"}" >> ocamlbuild.install; \
- done
- make[3]: Leaving directory '/home/opam/.opam/5.0+alpha-repo/.opam-switch/build/ocamlbuild.0.14.1'
- make install-lib-native-opam
- make[3]: Entering directory '/home/opam/.opam/5.0+alpha-repo/.opam-switch/build/ocamlbuild.0.14.1'
- for lib in src/ocamlbuildlib.cmxa src/ocamlbuildlib.a src/ocamlbuild.cmx src/ocamlbuild.o src/ocamlbuild_pack.cmx src/ocamlbuild_plugin.cmx src/ocamlbuild_executor.cmx src/ocamlbuild_unix_plugin.cmx src/ocamlbuild_plugin.o src/ocamlbuild_executor.o src/ocamlbuild_unix_plugin.o; do \
-   echo "  \"$lib\" {\"$(basename $lib)\"}" >> ocamlbuild.install; \
- done
- make[3]: Leaving directory '/home/opam/.opam/5.0+alpha-repo/.opam-switch/build/ocamlbuild.0.14.1'
- echo ']' >> ocamlbuild.install
- echo >> ocamlbuild.install
- make[2]: Leaving directory '/home/opam/.opam/5.0+alpha-repo/.opam-switch/build/ocamlbuild.0.14.1'
- make install-man-opam
- make[2]: Entering directory '/home/opam/.opam/5.0+alpha-repo/.opam-switch/build/ocamlbuild.0.14.1'
- echo 'man: [' >> ocamlbuild.install
- echo '  "man/ocamlbuild.1" {"man1/ocamlbuild.1"}' >> ocamlbuild.install
- echo ']' >> ocamlbuild.install
- echo >> ocamlbuild.install
- make[2]: Leaving directory '/home/opam/.opam/5.0+alpha-repo/.opam-switch/build/ocamlbuild.0.14.1'
- make install-doc-opam
- make[2]: Entering directory '/home/opam/.opam/5.0+alpha-repo/.opam-switch/build/ocamlbuild.0.14.1'
- echo 'doc: [' >> ocamlbuild.install
- echo '  "LICENSE"' >> ocamlbuild.install
- echo '  "Changes"' >> ocamlbuild.install
- echo '  "Readme.md"' >> ocamlbuild.install
- echo ']' >> ocamlbuild.install
- make[2]: Leaving directory '/home/opam/.opam/5.0+alpha-repo/.opam-switch/build/ocamlbuild.0.14.1'
- make[1]: Leaving directory '/home/opam/.opam/5.0+alpha-repo/.opam-switch/build/ocamlbuild.0.14.1'
-> compiled  ocamlbuild.0.14.1
Processing 102/268: [dune: ocaml bootstrap.ml]
-> installed ocamlbuild.0.14.1
Processing 103/268: [dune: ocaml bootstrap.ml]
Processing 104/268: [dune: ocaml bootstrap.ml] [topkg: ocaml build]
+ /home/opam/.opam/opam-init/hooks/sandbox.sh "build" "ocaml" "pkg/pkg.ml" "build" "--pkg-name" "topkg" "--dev-pkg" "false" (CWD=/home/opam/.opam/5.0+alpha-repo/.opam-switch/build/topkg.1.0.5)
- ocamlfind ocamldep -modules src/topkg.ml > src/topkg.ml.depends
- ocamlfind ocamldep -modules src/topkg.mli > src/topkg.mli.depends
- ocamlfind ocamlc -c -g -bin-annot -safe-string -I src -I test -I src-care -I src-bin -o src/topkg.cmi src/topkg.mli
- ocamlfind ocamldep -modules src/topkg_build.ml > src/topkg_build.ml.depends
- ocamlfind ocamldep -modules src/topkg_build.mli > src/topkg_build.mli.depends
- ocamlfind ocamldep -modules src/topkg_cmd.mli > src/topkg_cmd.mli.depends
- ocamlfind ocamldep -modules src/topkg_fpath.mli > src/topkg_fpath.mli.depends
- ocamlfind ocamlc -c -g -bin-annot -safe-string -I src -I test -I src-care -I src-bin -o src/topkg_fpath.cmi src/topkg_fpath.mli
- ocamlfind ocamldep -modules src/topkg_codec.mli > src/topkg_codec.mli.depends
- ocamlfind ocamlc -c -g -bin-annot -safe-string -I src -I test -I src-care -I src-bin -o src/topkg_cmd.cmi src/topkg_cmd.mli
- ocamlfind ocamldep -modules src/topkg_result.mli > src/topkg_result.mli.depends
- ocamlfind ocamlc -c -g -bin-annot -safe-string -I src -I test -I src-care -I src-bin -o src/topkg_result.cmi src/topkg_result.mli
- ocamlfind ocamldep -modules src/topkg_conf.mli > src/topkg_conf.mli.depends
- ocamlfind ocamlc -c -g -bin-annot -safe-string -I src -I test -I src-care -I src-bin -o src/topkg_codec.cmi src/topkg_codec.mli
- ocamlfind ocamlc -c -g -bin-annot -safe-string -I src -I test -I src-care -I src-bin -o src/topkg_conf.cmi src/topkg_conf.mli
- ocamlfind ocamlc -c -g -bin-annot -safe-string -I src -I test -I src-care -I src-bin -o src/topkg_build.cmi src/topkg_build.mli
- ocamlfind ocamldep -modules src/topkg_cmd.ml > src/topkg_cmd.ml.depends
- ocamlfind ocamldep -modules src/topkg_fpath.ml > src/topkg_fpath.ml.depends
- ocamlfind ocamldep -modules src/topkg_string.ml > src/topkg_string.ml.depends
- ocamlfind ocamldep -modules src/topkg_string.mli > src/topkg_string.mli.depends
- ocamlfind ocamlc -c -g -bin-annot -safe-string -I src -I test -I src-care -I src-bin -o src/topkg_string.cmi src/topkg_string.mli
- ocamlfind ocamlopt -c -g -bin-annot -safe-string -I src -I test -I src-care -I src-bin -o src/topkg_string.cmx src/topkg_string.ml
- ocamlfind ocamlopt -c -g -bin-annot -safe-string -I src -I test -I src-care -I src-bin -o src/topkg_fpath.cmx src/topkg_fpath.ml
- ocamlfind ocamldep -modules src/topkg_codec.ml > src/topkg_codec.ml.depends
- ocamlfind ocamlopt -c -g -bin-annot -safe-string -I src -I test -I src-care -I src-bin -o src/topkg_cmd.cmx src/topkg_cmd.ml
- ocamlfind ocamldep -modules src/topkg_os.ml > src/topkg_os.ml.depends
- ocamlfind ocamldep -modules src/topkg_os.mli > src/topkg_os.mli.depends
- ocamlfind ocamlc -c -g -bin-annot -safe-string -I src -I test -I src-care -I src-bin -o src/topkg_os.cmi src/topkg_os.mli
- ocamlfind ocamldep -modules src/topkg_log.ml > src/topkg_log.ml.depends
- ocamlfind ocamldep -modules src/topkg_log.mli > src/topkg_log.mli.depends
- ocamlfind ocamlc -c -g -bin-annot -safe-string -I src -I test -I src-care -I src-bin -o src/topkg_log.cmi src/topkg_log.mli
- ocamlfind ocamldep -modules src/topkg_result.ml > src/topkg_result.ml.depends
- ocamlfind ocamlopt -c -g -bin-annot -safe-string -I src -I test -I src-care -I src-bin -o src/topkg_result.cmx src/topkg_result.ml
- ocamlfind ocamlopt -c -g -bin-annot -safe-string -I src -I test -I src-care -I src-bin -o src/topkg_log.cmx src/topkg_log.ml
- ocamlfind ocamlopt -c -g -bin-annot -safe-string -I src -I test -I src-care -I src-bin -o src/topkg_os.cmx src/topkg_os.ml
- ocamlfind ocamldep -modules src/topkg_conf.ml > src/topkg_conf.ml.depends
- ocamlfind ocamlopt -c -g -bin-annot -safe-string -I src -I test -I src-care -I src-bin -o src/topkg_codec.cmx src/topkg_codec.ml
- ocamlfind ocamldep -modules src/topkg_vcs.ml > src/topkg_vcs.ml.depends
- ocamlfind ocamldep -modules src/topkg_vcs.mli > src/topkg_vcs.mli.depends
- ocamlfind ocamlc -c -g -bin-annot -safe-string -I src -I test -I src-care -I src-bin -o src/topkg_vcs.cmi src/topkg_vcs.mli
- ocamlfind ocamlopt -c -g -bin-annot -safe-string -I src -I test -I src-care -I src-bin -o src/topkg_vcs.cmx src/topkg_vcs.ml
- ocamlfind ocamlopt -c -g -bin-annot -safe-string -I src -I test -I src-care -I src-bin -o src/topkg_conf.cmx src/topkg_conf.ml
- ocamlfind ocamldep -modules src/topkg_distrib.ml > src/topkg_distrib.ml.depends
- ocamlfind ocamldep -modules src/topkg_distrib.mli > src/topkg_distrib.mli.depends
- ocamlfind ocamlc -c -g -bin-annot -safe-string -I src -I test -I src-care -I src-bin -o src/topkg_distrib.cmi src/topkg_distrib.mli
- ocamlfind ocamldep -modules src/topkg_opam.ml > src/topkg_opam.ml.depends
- ocamlfind ocamldep -modules src/topkg_opam.mli > src/topkg_opam.mli.depends
- ocamlfind ocamlc -c -g -bin-annot -safe-string -I src -I test -I src-care -I src-bin -o src/topkg_opam.cmi src/topkg_opam.mli
- ocamlfind ocamlopt -c -g -bin-annot -safe-string -I src -I test -I src-care -I src-bin -o src/topkg_opam.cmx src/topkg_opam.ml
- ocamlfind ocamldep -modules src/topkg_fexts.ml > src/topkg_fexts.ml.depends
- ocamlfind ocamldep -modules src/topkg_fexts.mli > src/topkg_fexts.mli.depends
- ocamlfind ocamlc -c -g -bin-annot -safe-string -I src -I test -I src-care -I src-bin -o src/topkg_fexts.cmi src/topkg_fexts.mli
- ocamlfind ocamldep -modules src/topkg_install.ml > src/topkg_install.ml.depends
- ocamlfind ocamldep -modules src/topkg_install.mli > src/topkg_install.mli.depends
- ocamlfind ocamldep -modules src/topkg_test.mli > src/topkg_test.mli.depends
- ocamlfind ocamlc -c -g -bin-annot -safe-string -I src -I test -I src-care -I src-bin -o src/topkg_test.cmi src/topkg_test.mli
- ocamlfind ocamlc -c -g -bin-annot -safe-string -I src -I test -I src-care -I src-bin -o src/topkg_install.cmi src/topkg_install.mli
- ocamlfind ocamlopt -c -g -bin-annot -safe-string -I src -I test -I src-care -I src-bin -o src/topkg_fexts.cmx src/topkg_fexts.ml
- ocamlfind ocamldep -modules src/topkg_test.ml > src/topkg_test.ml.depends
- ocamlfind ocamlopt -c -g -bin-annot -safe-string -I src -I test -I src-care -I src-bin -o src/topkg_test.cmx src/topkg_test.ml
- ocamlfind ocamldep -modules src/topkg_ipc.ml > src/topkg_ipc.ml.depends
- ocamlfind ocamldep -modules src/topkg_ipc.mli > src/topkg_ipc.mli.depends
- ocamlfind ocamldep -modules src/topkg_pkg.mli > src/topkg_pkg.mli.depends
- ocamlfind ocamldep -modules src/topkg_publish.mli > src/topkg_publish.mli.depends
- ocamlfind ocamlc -c -g -bin-annot -safe-string -I src -I test -I src-care -I src-bin -o src/topkg_publish.cmi src/topkg_publish.mli
- ocamlfind ocamlc -c -g -bin-annot -safe-string -I src -I test -I src-care -I src-bin -o src/topkg_pkg.cmi src/topkg_pkg.mli
- ocamlfind ocamlc -c -g -bin-annot -safe-string -I src -I test -I src-care -I src-bin -o src/topkg_ipc.cmi src/topkg_ipc.mli
- ocamlfind ocamldep -modules src/topkg_pkg.ml > src/topkg_pkg.ml.depends
- ocamlfind ocamlopt -c -g -bin-annot -safe-string -I src -I test -I src-care -I src-bin -o src/topkg_build.cmx src/topkg_build.ml
- ocamlfind ocamlopt -c -g -bin-annot -safe-string -I src -I test -I src-care -I src-bin -o src/topkg_distrib.cmx src/topkg_distrib.ml
- ocamlfind ocamlopt -c -g -bin-annot -safe-string -I src -I test -I src-care -I src-bin -o src/topkg_install.cmx src/topkg_install.ml
- ocamlfind ocamldep -modules src/topkg_publish.ml > src/topkg_publish.ml.depends
- ocamlfind ocamlopt -c -g -bin-annot -safe-string -I src -I test -I src-care -I src-bin -o src/topkg_publish.cmx src/topkg_publish.ml
- ocamlfind ocamlopt -c -g -bin-annot -safe-string -I src -I test -I src-care -I src-bin -o src/topkg_pkg.cmx src/topkg_pkg.ml
- ocamlfind ocamldep -modules src/topkg_main.ml > src/topkg_main.ml.depends
- ocamlfind ocamldep -modules src/topkg_main.mli > src/topkg_main.mli.depends
- ocamlfind ocamlc -c -g -bin-annot -safe-string -I src -I test -I src-care -I src-bin -o src/topkg_main.cmi src/topkg_main.mli
- ocamlfind ocamlopt -c -g -bin-annot -safe-string -I src -I test -I src-care -I src-bin -o src/topkg_ipc.cmx src/topkg_ipc.ml
- ocamlfind ocamlopt -c -g -bin-annot -safe-string -I src -I test -I src-care -I src-bin -o src/topkg_main.cmx src/topkg_main.ml
- ocamlfind ocamlopt -c -g -bin-annot -safe-string -I src -I test -I src-care -I src-bin -o src/topkg.cmx src/topkg.ml
- ocamlfind ocamlopt -a -I src src/topkg_string.cmx src/topkg_fpath.cmx src/topkg_cmd.cmx src/topkg_result.cmx src/topkg_log.cmx src/topkg_os.cmx src/topkg_codec.cmx src/topkg_vcs.cmx src/topkg_conf.cmx src/topkg_build.cmx src/topkg_opam.cmx src/topkg_distrib.cmx src/topkg_fexts.cmx src/topkg_test.cmx src/topkg_install.cmx src/topkg_publish.cmx src/topkg_pkg.cmx src/topkg_ipc.cmx src/topkg_main.cmx src/topkg.cmx -o src/topkg.cmxa
- ocamlfind ocamlc -c -g -bin-annot -safe-string -I src -I test -I src-care -I src-bin -o src/topkg.cmo src/topkg.ml
- ocamlfind ocamlc -c -g -bin-annot -safe-string -I src -I test -I src-care -I src-bin -o src/topkg_build.cmo src/topkg_build.ml
- ocamlfind ocamlc -c -g -bin-annot -safe-string -I src -I test -I src-care -I src-bin -o src/topkg_cmd.cmo src/topkg_cmd.ml
- ocamlfind ocamlc -c -g -bin-annot -safe-string -I src -I test -I src-care -I src-bin -o src/topkg_codec.cmo src/topkg_codec.ml
- ocamlfind ocamlc -c -g -bin-annot -safe-string -I src -I test -I src-care -I src-bin -o src/topkg_conf.cmo src/topkg_conf.ml
- ocamlfind ocamlc -c -g -bin-annot -safe-string -I src -I test -I src-care -I src-bin -o src/topkg_distrib.cmo src/topkg_distrib.ml
- ocamlfind ocamlc -c -g -bin-annot -safe-string -I src -I test -I src-care -I src-bin -o src/topkg_fexts.cmo src/topkg_fexts.ml
- ocamlfind ocamlc -c -g -bin-annot -safe-string -I src -I test -I src-care -I src-bin -o src/topkg_fpath.cmo src/topkg_fpath.ml
- ocamlfind ocamlc -c -g -bin-annot -safe-string -I src -I test -I src-care -I src-bin -o src/topkg_install.cmo src/topkg_install.ml
- ocamlfind ocamlc -c -g -bin-annot -safe-string -I src -I test -I src-care -I src-bin -o src/topkg_ipc.cmo src/topkg_ipc.ml
- ocamlfind ocamlc -c -g -bin-annot -safe-string -I src -I test -I src-care -I src-bin -o src/topkg_log.cmo src/topkg_log.ml
- ocamlfind ocamlc -c -g -bin-annot -safe-string -I src -I test -I src-care -I src-bin -o src/topkg_main.cmo src/topkg_main.ml
- ocamlfind ocamlc -c -g -bin-annot -safe-string -I src -I test -I src-care -I src-bin -o src/topkg_opam.cmo src/topkg_opam.ml
- ocamlfind ocamlc -c -g -bin-annot -safe-string -I src -I test -I src-care -I src-bin -o src/topkg_os.cmo src/topkg_os.ml
- ocamlfind ocamlc -c -g -bin-annot -safe-string -I src -I test -I src-care -I src-bin -o src/topkg_pkg.cmo src/topkg_pkg.ml
- ocamlfind ocamlc -c -g -bin-annot -safe-string -I src -I test -I src-care -I src-bin -o src/topkg_publish.cmo src/topkg_publish.ml
- ocamlfind ocamlc -c -g -bin-annot -safe-string -I src -I test -I src-care -I src-bin -o src/topkg_result.cmo src/topkg_result.ml
- ocamlfind ocamlc -c -g -bin-annot -safe-string -I src -I test -I src-care -I src-bin -o src/topkg_string.cmo src/topkg_string.ml
- ocamlfind ocamlc -c -g -bin-annot -safe-string -I src -I test -I src-care -I src-bin -o src/topkg_test.cmo src/topkg_test.ml
- ocamlfind ocamlc -c -g -bin-annot -safe-string -I src -I test -I src-care -I src-bin -o src/topkg_vcs.cmo src/topkg_vcs.ml
- ocamlfind ocamlc -a -I src src/topkg_string.cmo src/topkg_fpath.cmo src/topkg_cmd.cmo src/topkg_result.cmo src/topkg_log.cmo src/topkg_os.cmo src/topkg_codec.cmo src/topkg_vcs.cmo src/topkg_conf.cmo src/topkg_build.cmo src/topkg_opam.cmo src/topkg_distrib.cmo src/topkg_fexts.cmo src/topkg_test.cmo src/topkg_install.cmo src/topkg_publish.cmo src/topkg_pkg.cmo src/topkg_ipc.cmo src/topkg_main.cmo src/topkg.cmo -o src/topkg.cma
- # Parallel statistics: { count(total): 2(83), max: 20, min: 2, average(total): 11.000(1.241) }
-> compiled  topkg.1.0.5
Processing 104/268: [dune: ocaml bootstrap.ml]
-> installed topkg.1.0.5
Processing 105/268: [dune: ocaml bootstrap.ml]
Processing 106/268: [dune: ocaml bootstrap.ml] [uutf: ocaml build]
Processing 107/268: [dune: ocaml bootstrap.ml] [uutf: ocaml build] [xmlm: ocaml build]
+ /home/opam/.opam/opam-init/hooks/sandbox.sh "build" "ocaml" "pkg/pkg.ml" "build" "--dev-pkg" "false" "--with-cmdliner" "false" (CWD=/home/opam/.opam/5.0+alpha-repo/.opam-switch/build/uutf.1.0.3)
- ocamlfind ocamldep -modules src/uutf.ml > src/uutf.ml.depends
- ocamlfind ocamldep -modules src/uutf.mli > src/uutf.mli.depends
- ocamlfind ocamlc -c -g -bin-annot -safe-string -I src -I test -o src/uutf.cmi src/uutf.mli
- ocamlfind ocamlopt -c -g -bin-annot -safe-string -I src -I test -o src/uutf.cmx src/uutf.ml
- ocamlfind ocamlopt -a -I src src/uutf.cmx -o src/uutf.cmxa
- ocamlfind ocamlc -c -g -bin-annot -safe-string -I src -I test -o src/uutf.cmo src/uutf.ml
- ocamlfind ocamlc -a -I src src/uutf.cmo -o src/uutf.cma
- # No parallelism done
-> compiled  uutf.1.0.3
Processing 107/268: [dune: ocaml bootstrap.ml] [xmlm: ocaml build]
-> installed uutf.1.0.3
Processing 108/268: [dune: ocaml bootstrap.ml] [xmlm: ocaml build]
+ /home/opam/.opam/opam-init/hooks/sandbox.sh "build" "ocaml" "pkg/pkg.ml" "build" "--dev-pkg" "false" (CWD=/home/opam/.opam/5.0+alpha-repo/.opam-switch/build/xmlm.1.4.0)
- ocamlfind ocamldep -modules src/xmlm.ml > src/xmlm.ml.depends
- ocamlfind ocamldep -modules src/xmlm.mli > src/xmlm.mli.depends
- ocamlfind ocamlc -c -g -bin-annot -safe-string -I src -I test -o src/xmlm.cmi src/xmlm.mli
- ocamlfind ocamlopt -c -g -bin-annot -safe-string -I src -I test -o src/xmlm.cmx src/xmlm.ml
- ocamlfind ocamlopt -a -I src src/xmlm.cmx -o src/xmlm.cmxa
- ocamlfind ocamlc -c -g -bin-annot -safe-string -I src -I test -o src/xmlm.cmo src/xmlm.ml
- ocamlfind ocamlc -a -I src src/xmlm.cmo -o src/xmlm.cma
- ocamlfind ocamldep -modules test/xmltrip.ml > test/xmltrip.ml.depends
- ocamlfind ocamldep -modules test/xhtml.ml > test/xhtml.ml.depends
- ocamlfind ocamlc -c -g -bin-annot -safe-string -I test -I src -o test/xhtml.cmo test/xhtml.ml
- ocamlfind ocamlc -c -g -bin-annot -safe-string -I test -I src -o test/xmltrip.cmo test/xmltrip.ml
- ocamlfind ocamlopt -c -g -bin-annot -safe-string -I test -I src -o test/xhtml.cmx test/xhtml.ml
- ocamlfind ocamlopt -c -g -bin-annot -safe-string -I test -I src -o test/xmltrip.cmx test/xmltrip.ml
- ocamlfind ocamlopt -linkpkg -g -I src -I test src/xmlm.cmx test/xhtml.cmx test/xmltrip.cmx -o test/xmltrip.native
- # No parallelism done
-> compiled  xmlm.1.4.0
Processing 108/268: [dune: ocaml bootstrap.ml]
-> installed xmlm.1.4.0
Processing 109/268: [dune: ocaml bootstrap.ml]
+ /home/opam/.opam/opam-init/hooks/sandbox.sh "build" "ocaml" "bootstrap.ml" "-j" "31" (CWD=/home/opam/.opam/5.0+alpha-repo/.opam-switch/build/dune.3.4.1)
- ocamlc -output-complete-exe -w -24 -g -o .duneboot.exe -I boot -I +unix unix.cma boot/libs.ml boot/duneboot.ml
- ./.duneboot.exe -j 31
- cd _boot && /home/opam/.opam/5.0+alpha-repo/bin/ocamlopt.opt -c -g -no-alias-deps -w -49-6 -alert -unstable -I +unix -I +threads build_path_prefix_map.ml
- File "vendor/build_path_prefix_map/src/build_path_prefix_map.ml", line 5, characters 17-31:
- Alert deprecated: Stdlib.Printf.kprintf
- Use Printf.ksprintf instead.
- cd _boot && /home/opam/.opam/5.0+alpha-repo/bin/ocamlopt.opt -c -g -no-alias-deps -w -49-6 -alert -unstable -I +unix -I +threads opamLexer.ml
- File "vendor/opam-file-format/src/opamLexer.mll", line 21, characters 2-16:
- Alert deprecated: Stdlib.Printf.kprintf
- Use Printf.ksprintf instead.
- 

Processing 109/268: [dune: ./dune.exe build]
+ /home/opam/.opam/opam-init/hooks/sandbox.sh "build" "./dune.exe" "build" "dune.install" "--release" "--profile" "dune-bootstrap" "-j" "31" (CWD=/home/opam/.opam/5.0+alpha-repo/.opam-switch/build/dune.3.4.1)
-> compiled  dune.3.4.1
-> installed dune.3.4.1
Processing 111/268: [bigstringaf: dune build]
Processing 112/268: [bigstringaf: dune build] [cppo: dune build]
Processing 113/268: [bigstringaf: dune build] [cppo: dune build] [csexp: dune build]
Processing 114/268: [bigstringaf: dune build] [cppo: dune build] [csexp: dune build] [ezxmlm: dune build]
Processing 115/268: [bigstringaf: dune build] [cppo: dune build] [csexp: dune build] [ezxmlm: dune build] [jane-street-headers: dune build]
Processing 116/268: [bigstringaf: dune build] [cppo: dune build] [csexp: dune build] [ezxmlm: dune build] [jane-street-headers: dune build] [ocaml-compiler-libs: dune build]
Processing 117/268: [bigstringaf: dune build] [cppo: dune build] [csexp: dune build] [ezxmlm: dune build] [jane-street-headers: dune build] [ocaml-compiler-libs: dune build] [ocaml-syntax-shims: dune build]
Processing 118/268: [bigstringaf: dune build] [cppo: dune build] [csexp: dune build] [ezxmlm: dune build] [jane-street-headers: dune build] [ocaml-compiler-libs: dune build] [ocaml-syntax-shims: dune build] [ppx_derivers: dune build]
Processing 119/268: [bigstringaf: dune build] [cppo: dune build] [csexp: dune build] [ezxmlm: dune build] [jane-street-headers: dune build] [ocaml-compiler-libs: dune build] [ocaml-syntax-shims: dune build] [ppx_derivers: dune build] [re: dune build]
Processing 120/268: [bigstringaf: dune build] [cppo: dune build] [csexp: dune build] [ezxmlm: dune build] [jane-street-headers: dune build] [ocaml-compiler-libs: dune build] [ocaml-syntax-shims: dune build] [ppx_derivers: dune build] [re: dune build] [result: dune build]
Processing 121/268: [bigstringaf: dune build] [cppo: dune build] [csexp: dune build] [ezxmlm: dune build] [jane-street-headers: dune build] [ocaml-compiler-libs: dune build] [ocaml-syntax-shims: dune build] [ppx_derivers: dune build] [re: dune build] [result: dune build] [sexplib0: dune build]
Processing 122/268: [bigstringaf: dune build] [cppo: dune build] [csexp: dune build] [ezxmlm: dune build] [jane-street-headers: dune build] [ocaml-compiler-libs: dune build] [ocaml-syntax-shims: dune build] [ppx_derivers: dune build] [re: dune build] [result: dune build] [sexplib0: dune build] [spawn: dune build]
Processing 123/268: [bigstringaf: dune build] [cppo: dune build] [csexp: dune build] [ezxmlm: dune build] [jane-street-headers: dune build] [ocaml-compiler-libs: dune build] [ocaml-syntax-shims: dune build] [ppx_derivers: dune build] [re: dune build] [result: dune build] [sexplib0: dune build] [spawn: dune build] [stdlib-shims: dune build]
Processing 124/268: [bigstringaf: dune build] [cppo: dune build] [csexp: dune build] [ezxmlm: dune build] [jane-street-headers: dune build] [ocaml-compiler-libs: dune build] [ocaml-syntax-shims: dune build] [ppx_derivers: dune build] [re: dune build] [result: dune build] [sexplib0: dune build] [spawn: dune build] [stdlib-shims: dune build] [stringext: dune build]
+ /home/opam/.opam/opam-init/hooks/sandbox.sh "build" "dune" "build" "-p" "bigstringaf" "-j" "31" (CWD=/home/opam/.opam/5.0+alpha-repo/.opam-switch/build/bigstringaf.0.9.0)
- (cd _build/default/lib/freestanding && /usr/bin/gmake)
- touch libbigstringaf_freestanding_stubs.a
-> compiled  bigstringaf.0.9.0
Processing 124/268: [cppo: dune build] [csexp: dune build] [ezxmlm: dune build] [jane-street-headers: dune build] [ocaml-compiler-libs: dune build] [ocaml-syntax-shims: dune build] [ppx_derivers: dune build] [re: dune build] [result: dune build] [sexplib0: dune build] [spawn: dune build] [stdlib-shims: dune build] [stringext: dune build]
-> installed bigstringaf.0.9.0
Processing 125/268: [cppo: dune build] [csexp: dune build] [ezxmlm: dune build] [jane-street-headers: dune build] [ocaml-compiler-libs: dune build] [ocaml-syntax-shims: dune build] [ppx_derivers: dune build] [re: dune build] [result: dune build] [sexplib0: dune build] [spawn: dune build] [stdlib-shims: dune build] [stringext: dune build]
+ /home/opam/.opam/opam-init/hooks/sandbox.sh "build" "dune" "build" "-p" "jane-street-headers" "-j" "31" (CWD=/home/opam/.opam/5.0+alpha-repo/.opam-switch/build/jane-street-headers.v0.15.0)
-> compiled  jane-street-headers.v0.15.0
Processing 125/268: [cppo: dune build] [csexp: dune build] [ezxmlm: dune build] [ocaml-compiler-libs: dune build] [ocaml-syntax-shims: dune build] [ppx_derivers: dune build] [re: dune build] [result: dune build] [sexplib0: dune build] [spawn: dune build] [stdlib-shims: dune build] [stringext: dune build]
-> installed jane-street-headers.v0.15.0
Processing 126/268: [cppo: dune build] [csexp: dune build] [ezxmlm: dune build] [ocaml-compiler-libs: dune build] [ocaml-syntax-shims: dune build] [ppx_derivers: dune build] [re: dune build] [result: dune build] [sexplib0: dune build] [spawn: dune build] [stdlib-shims: dune build] [stringext: dune build]
+ /home/opam/.opam/opam-init/hooks/sandbox.sh "build" "dune" "build" "-p" "csexp" "-j" "31" "@install" (CWD=/home/opam/.opam/5.0+alpha-repo/.opam-switch/build/csexp.1.5.1)
-> compiled  csexp.1.5.1
Processing 126/268: [cppo: dune build] [ezxmlm: dune build] [ocaml-compiler-libs: dune build] [ocaml-syntax-shims: dune build] [ppx_derivers: dune build] [re: dune build] [result: dune build] [sexplib0: dune build] [spawn: dune build] [stdlib-shims: dune build] [stringext: dune build]
-> installed csexp.1.5.1
Processing 127/268: [cppo: dune build] [ezxmlm: dune build] [ocaml-compiler-libs: dune build] [ocaml-syntax-shims: dune build] [ppx_derivers: dune build] [re: dune build] [result: dune build] [sexplib0: dune build] [spawn: dune build] [stdlib-shims: dune build] [stringext: dune build]
Processing 128/268: [cppo: dune build] [dune-configurator: rm] [ezxmlm: dune build] [ocaml-compiler-libs: dune build] [ocaml-syntax-shims: dune build] [ppx_derivers: dune build] [re: dune build] [result: dune build] [sexplib0: dune build] [spawn: dune build] [stdlib-shims: dune build] [stringext: dune build]
+ /home/opam/.opam/opam-init/hooks/sandbox.sh "build" "dune" "build" "-p" "ezxmlm" "-j" "31" (CWD=/home/opam/.opam/5.0+alpha-repo/.opam-switch/build/ezxmlm.1.1.0)
-> compiled  ezxmlm.1.1.0
Processing 128/268: [cppo: dune build] [dune-configurator: rm] [ocaml-compiler-libs: dune build] [ocaml-syntax-shims: dune build] [ppx_derivers: dune build] [re: dune build] [result: dune build] [sexplib0: dune build] [spawn: dune build] [stdlib-shims: dune build] [stringext: dune build]
-> installed ezxmlm.1.1.0
Processing 129/268: [cppo: dune build] [dune-configurator: rm] [ocaml-compiler-libs: dune build] [ocaml-syntax-shims: dune build] [ppx_derivers: dune build] [re: dune build] [result: dune build] [sexplib0: dune build] [spawn: dune build] [stdlib-shims: dune build] [stringext: dune build]
+ /home/opam/.opam/opam-init/hooks/sandbox.sh "build" "dune" "build" "-p" "ppx_derivers" "-j" "31" (CWD=/home/opam/.opam/5.0+alpha-repo/.opam-switch/build/ppx_derivers.1.2.1)
-> compiled  ppx_derivers.1.2.1
Processing 129/268: [cppo: dune build] [dune-configurator: rm] [ocaml-compiler-libs: dune build] [ocaml-syntax-shims: dune build] [re: dune build] [result: dune build] [sexplib0: dune build] [spawn: dune build] [stdlib-shims: dune build] [stringext: dune build]
-> installed ppx_derivers.1.2.1
Processing 130/268: [cppo: dune build] [dune-configurator: rm] [ocaml-compiler-libs: dune build] [ocaml-syntax-shims: dune build] [re: dune build] [result: dune build] [sexplib0: dune build] [spawn: dune build] [stdlib-shims: dune build] [stringext: dune build]
+ /home/opam/.opam/opam-init/hooks/sandbox.sh "build" "dune" "build" "-p" "result" "-j" "31" (CWD=/home/opam/.opam/5.0+alpha-repo/.opam-switch/build/result.1.5)
-> compiled  result.1.5
Processing 130/268: [cppo: dune build] [dune-configurator: rm] [ocaml-compiler-libs: dune build] [ocaml-syntax-shims: dune build] [re: dune build] [sexplib0: dune build] [spawn: dune build] [stdlib-shims: dune build] [stringext: dune build]
-> installed result.1.5
Processing 131/268: [cppo: dune build] [dune-configurator: rm] [ocaml-compiler-libs: dune build] [ocaml-syntax-shims: dune build] [re: dune build] [sexplib0: dune build] [spawn: dune build] [stdlib-shims: dune build] [stringext: dune build]
+ /home/opam/.opam/opam-init/hooks/sandbox.sh "build" "dune" "build" "-p" "spawn" "-j" "31" "@install" (CWD=/home/opam/.opam/5.0+alpha-repo/.opam-switch/build/spawn.v0.15.1)
-> compiled  spawn.v0.15.1
Processing 131/268: [cppo: dune build] [dune-configurator: rm] [ocaml-compiler-libs: dune build] [ocaml-syntax-shims: dune build] [re: dune build] [sexplib0: dune build] [stdlib-shims: dune build] [stringext: dune build]
-> installed spawn.v0.15.1
Processing 132/268: [cppo: dune build] [dune-configurator: rm] [ocaml-compiler-libs: dune build] [ocaml-syntax-shims: dune build] [re: dune build] [sexplib0: dune build] [stdlib-shims: dune build] [stringext: dune build]
+ /home/opam/.opam/opam-init/hooks/sandbox.sh "build" "dune" "build" "-p" "stdlib-shims" "-j" "31" (CWD=/home/opam/.opam/5.0+alpha-repo/.opam-switch/build/stdlib-shims.0.3.0)
-> compiled  stdlib-shims.0.3.0
Processing 132/268: [cppo: dune build] [dune-configurator: rm] [ocaml-compiler-libs: dune build] [ocaml-syntax-shims: dune build] [re: dune build] [sexplib0: dune build] [stringext: dune build]
-> installed stdlib-shims.0.3.0
Processing 133/268: [cppo: dune build] [dune-configurator: rm] [ocaml-compiler-libs: dune build] [ocaml-syntax-shims: dune build] [re: dune build] [sexplib0: dune build] [stringext: dune build]
+ /home/opam/.opam/opam-init/hooks/sandbox.sh "build" "dune" "build" "-p" "stringext" "-j" "31" (CWD=/home/opam/.opam/5.0+alpha-repo/.opam-switch/build/stringext.1.6.0)
-> compiled  stringext.1.6.0
Processing 133/268: [cppo: dune build] [dune-configurator: rm] [ocaml-compiler-libs: dune build] [ocaml-syntax-shims: dune build] [re: dune build] [sexplib0: dune build]
-> installed stringext.1.6.0
Processing 134/268: [cppo: dune build] [dune-configurator: rm] [ocaml-compiler-libs: dune build] [ocaml-syntax-shims: dune build] [re: dune build] [sexplib0: dune build]
+ /home/opam/.opam/opam-init/hooks/sandbox.sh "build" "rm" "-rf" "vendor/csexp" (CWD=/home/opam/.opam/5.0+alpha-repo/.opam-switch/build/dune-configurator.3.4.1)
+ /home/opam/.opam/opam-init/hooks/sandbox.sh "build" "dune" "build" "-p" "sexplib0" "-j" "31" (CWD=/home/opam/.opam/5.0+alpha-repo/.opam-switch/build/sexplib0.v0.15.1)
-> compiled  sexplib0.v0.15.1
Processing 134/268: [cppo: dune build] [dune-configurator: rm] [ocaml-compiler-libs: dune build] [ocaml-syntax-shims: dune build] [re: dune build]
-> installed sexplib0.v0.15.1
Processing 135/268: [cppo: dune build] [dune-configurator: rm] [ocaml-compiler-libs: dune build] [ocaml-syntax-shims: dune build] [re: dune build]
+ /home/opam/.opam/opam-init/hooks/sandbox.sh "build" "rm" "-rf" "vendor/pp" (CWD=/home/opam/.opam/5.0+alpha-repo/.opam-switch/build/dune-configurator.3.4.1)
Processing 135/268: [cppo: dune build] [dune-configurator: dune build] [ocaml-compiler-libs: dune build] [ocaml-syntax-shims: dune build] [re: dune build]
+ /home/opam/.opam/opam-init/hooks/sandbox.sh "build" "dune" "build" "-p" "ocaml-compiler-libs" "-j" "31" "@install" (CWD=/home/opam/.opam/5.0+alpha-repo/.opam-switch/build/ocaml-compiler-libs.v0.12.4)
-> compiled  ocaml-compiler-libs.v0.12.4
Processing 135/268: [cppo: dune build] [dune-configurator: dune build] [ocaml-syntax-shims: dune build] [re: dune build]
-> installed ocaml-compiler-libs.v0.12.4
Processing 136/268: [cppo: dune build] [dune-configurator: dune build] [ocaml-syntax-shims: dune build] [re: dune build]
Processing 137/268: [cppo: dune build] [dune-configurator: dune build] [ocaml-syntax-shims: dune build] [ppxlib: dune build] [re: dune build]
+ /home/opam/.opam/opam-init/hooks/sandbox.sh "build" "dune" "build" "-p" "cppo" "-j" "31" (CWD=/home/opam/.opam/5.0+alpha-repo/.opam-switch/build/cppo.1.6.9)
-> compiled  cppo.1.6.9
Processing 137/268: [dune-configurator: dune build] [ocaml-syntax-shims: dune build] [ppxlib: dune build] [re: dune build]
-> installed cppo.1.6.9
Processing 138/268: [dune-configurator: dune build] [ocaml-syntax-shims: dune build] [ppxlib: dune build] [re: dune build]
Processing 139/268: [dune-configurator: dune build] [ocaml-syntax-shims: dune build] [ocplib-endian: dune build] [ppxlib: dune build] [re: dune build]
+ /home/opam/.opam/opam-init/hooks/sandbox.sh "build" "dune" "build" "-p" "ocplib-endian" "-j" "31" "@install" (CWD=/home/opam/.opam/5.0+alpha-repo/.opam-switch/build/ocplib-endian.1.2)
-> compiled  ocplib-endian.1.2
Processing 139/268: [dune-configurator: dune build] [ocaml-syntax-shims: dune build] [ppxlib: dune build] [re: dune build]
-> installed ocplib-endian.1.2
Processing 140/268: [dune-configurator: dune build] [ocaml-syntax-shims: dune build] [ppxlib: dune build] [re: dune build]
Processing 141/268: [amqp-client: dune build] [dune-configurator: dune build] [ocaml-syntax-shims: dune build] [ppxlib: dune build] [re: dune build]
+ /home/opam/.opam/opam-init/hooks/sandbox.sh "build" "dune" "build" "-p" "ocaml-syntax-shims" "-j" "31" "@install" (CWD=/home/opam/.opam/5.0+alpha-repo/.opam-switch/build/ocaml-syntax-shims.1.0.0)
- (cd _build/default/src && /home/opam/.opam/5.0+alpha-repo/bin/ocaml select-impl 5.0.0+dev6-2022-07-21) > _build/default/src/impl
- File "_none_", line 1:
- Alert ocaml_deprecated_cli: 
- Running ocaml where the first argument is an implicit basename with no
- extension (e.g. ocaml script-file) is deprecated. Either rename the script
- (ocaml script-file.ml) or qualify the basename (ocaml ./script-file)
-> compiled  ocaml-syntax-shims.1.0.0
Processing 141/268: [amqp-client: dune build] [dune-configurator: dune build] [ppxlib: dune build] [re: dune build]
-> installed ocaml-syntax-shims.1.0.0
Processing 142/268: [amqp-client: dune build] [dune-configurator: dune build] [ppxlib: dune build] [re: dune build]
Processing 143/268: [amqp-client: dune build] [angstrom: dune build] [dune-configurator: dune build] [ppxlib: dune build] [re: dune build]
+ /home/opam/.opam/opam-init/hooks/sandbox.sh "build" "dune" "build" "-p" "re" "-j" "31" (CWD=/home/opam/.opam/5.0+alpha-repo/.opam-switch/build/re.1.10.4)
-> compiled  re.1.10.4
Processing 143/268: [amqp-client: dune build] [angstrom: dune build] [dune-configurator: dune build] [ppxlib: dune build]
-> installed re.1.10.4
Processing 144/268: [amqp-client: dune build] [angstrom: dune build] [dune-configurator: dune build] [ppxlib: dune build]
+ /home/opam/.opam/opam-init/hooks/sandbox.sh "build" "dune" "build" "-p" "amqp-client" "-j" "31" (CWD=/home/opam/.opam/5.0+alpha-repo/.opam-switch/build/amqp-client.2.2.2)
- (cd _build/default && /home/opam/.opam/5.0+alpha-repo/bin/ocamlc.opt -w -40 -g -bin-annot -I lib/.amqp_client_lib.objs/byte -I /home/opam/.opam/5.0+alpha-repo/lib/bytes -I /home/opam/.opam/5.0+alpha-repo/lib/ocplib-endian -no-alias-deps -open Amqp_client_lib -o lib/.amqp_client_lib.objs/byte/amqp_client_lib__Io.cmo -c -impl lib/io.ml)
- File "lib/io.ml", line 52, characters 20-28:
- 52 |   let octet = write set_int8 1
-                          ^^^^^^^^
- Alert deprecated: EndianString.BigEndian.set_int8
- Use EndianBytes.set_int8 instead.
- File "lib/io.ml", line 53, characters 20-29:
- 53 |   let short = write set_int16 2
-                          ^^^^^^^^^
- Alert deprecated: EndianString.BigEndian.set_int16
- Use EndianBytes.set_int16 instead.
- File "lib/io.ml", line 58, characters 24-33:
- 58 |       if (t.apply) then set_int16 t.buf offset v
-                              ^^^^^^^^^
- Alert deprecated: EndianString.BigEndian.set_int16
- Use EndianBytes.set_int16 instead.
- File "lib/io.ml", line 60, characters 35-44:
- 60 |   let long = write (fun t pos v -> set_int32 t pos (Int32.of_int v)) 4
-                                         ^^^^^^^^^
- Alert deprecated: EndianString.BigEndian.set_int32
- Use EndianBytes.set_int13 instead.
- File "lib/io.ml", line 61, characters 39-48:
- 61 |   let longlong = write (fun t pos v -> set_int64 t pos (Int64.of_int v)) 8
-                                             ^^^^^^^^^
- Alert deprecated: EndianString.BigEndian.set_int64
- Use EndianBytes.set_int64 instead.
- File "lib/io.ml", line 62, characters 20-29:
- 62 |   let float = write set_float 4
-                          ^^^^^^^^^
- Alert deprecated: EndianString.BigEndian.set_float
- Use EndianBytes.set_float instead.
- File "lib/io.ml", line 63, characters 21-31:
- 63 |   let double = write set_double 8
-                           ^^^^^^^^^^
- Alert deprecated: EndianString.BigEndian.set_double
- Use EndianBytes.set_double instead.
- File "lib/io.ml", line 68, characters 22-31:
- 68 |       if t.apply then set_int32 t.buf offset (Int32.of_int (t.offset - (offset + 4)))
-                            ^^^^^^^^^
- Alert deprecated: EndianString.BigEndian.set_int32
- Use EndianBytes.set_int13 instead.
- (cd _build/default && /home/opam/.opam/5.0+alpha-repo/bin/ocamlopt.opt -w -40 -g -I lib/.amqp_client_lib.objs/byte -I lib/.amqp_client_lib.objs/native -I /home/opam/.opam/5.0+alpha-repo/lib/bytes -I /home/opam/.opam/5.0+alpha-repo/lib/ocplib-endian -intf-suffix .ml -no-alias-deps -open Amqp_client_lib -o lib/.amqp_client_lib.objs/native/amqp_client_lib__Io.cmx -c -impl lib/io.ml)
- File "lib/io.ml", line 52, characters 20-28:
- 52 |   let octet = write set_int8 1
-                          ^^^^^^^^
- Alert deprecated: EndianString.BigEndian.set_int8
- Use EndianBytes.set_int8 instead.
- File "lib/io.ml", line 53, characters 20-29:
- 53 |   let short = write set_int16 2
-                          ^^^^^^^^^
- Alert deprecated: EndianString.BigEndian.set_int16
- Use EndianBytes.set_int16 instead.
- File "lib/io.ml", line 58, characters 24-33:
- 58 |       if (t.apply) then set_int16 t.buf offset v
-                              ^^^^^^^^^
- Alert deprecated: EndianString.BigEndian.set_int16
- Use EndianBytes.set_int16 instead.
- File "lib/io.ml", line 60, characters 35-44:
- 60 |   let long = write (fun t pos v -> set_int32 t pos (Int32.of_int v)) 4
-                                         ^^^^^^^^^
- Alert deprecated: EndianString.BigEndian.set_int32
- Use EndianBytes.set_int13 instead.
- File "lib/io.ml", line 61, characters 39-48:
- 61 |   let longlong = write (fun t pos v -> set_int64 t pos (Int64.of_int v)) 8
-                                             ^^^^^^^^^
- Alert deprecated: EndianString.BigEndian.set_int64
- Use EndianBytes.set_int64 instead.
- File "lib/io.ml", line 62, characters 20-29:
- 62 |   let float = write set_float 4
-                          ^^^^^^^^^
- Alert deprecated: EndianString.BigEndian.set_float
- Use EndianBytes.set_float instead.
- File "lib/io.ml", line 63, characters 21-31:
- 63 |   let double = write set_double 8
-                           ^^^^^^^^^^
- Alert deprecated: EndianString.BigEndian.set_double
- Use EndianBytes.set_double instead.
- File "lib/io.ml", line 68, characters 22-31:
- 68 |       if t.apply then set_int32 t.buf offset (Int32.of_int (t.offset - (offset + 4)))
-                            ^^^^^^^^^
- Alert deprecated: EndianString.BigEndian.set_int32
- Use EndianBytes.set_int13 instead.
-> compiled  amqp-client.2.2.2
Processing 144/268: [angstrom: dune build] [dune-configurator: dune build] [ppxlib: dune build]
-> installed amqp-client.2.2.2
Processing 145/268: [angstrom: dune build] [dune-configurator: dune build] [ppxlib: dune build]
+ /home/opam/.opam/opam-init/hooks/sandbox.sh "build" "dune" "build" "-p" "dune-configurator" "-j" "31" "@install" (CWD=/home/opam/.opam/5.0+alpha-repo/.opam-switch/build/dune-configurator.3.4.1)
-> compiled  dune-configurator.3.4.1
Processing 145/268: [angstrom: dune build] [ppxlib: dune build]
-> installed dune-configurator.3.4.1
Processing 146/268: [angstrom: dune build] [ppxlib: dune build]
Processing 147/268: [angstrom: dune build] [base: dune build] [ppxlib: dune build]
Processing 148/268: [angstrom: dune build] [base: dune build] [ocaml_intrinsics: dune build] [ppxlib: dune build]
+ /home/opam/.opam/opam-init/hooks/sandbox.sh "build" "dune" "build" "-p" "angstrom" "-j" "31" (CWD=/home/opam/.opam/5.0+alpha-repo/.opam-switch/build/angstrom.0.15.0)
-> compiled  angstrom.0.15.0
Processing 148/268: [base: dune build] [ocaml_intrinsics: dune build] [ppxlib: dune build]
-> installed angstrom.0.15.0
Processing 149/268: [base: dune build] [ocaml_intrinsics: dune build] [ppxlib: dune build]
Processing 150/268: [base: dune build] [ocaml_intrinsics: dune build] [ppxlib: dune build] [uri: dune build]
+ /home/opam/.opam/opam-init/hooks/sandbox.sh "build" "dune" "build" "-p" "ocaml_intrinsics" "-j" "31" (CWD=/home/opam/.opam/5.0+alpha-repo/.opam-switch/build/ocaml_intrinsics.v0.15.2)
-> compiled  ocaml_intrinsics.v0.15.2
Processing 150/268: [base: dune build] [ppxlib: dune build] [uri: dune build]
-> installed ocaml_intrinsics.v0.15.2
Processing 151/268: [base: dune build] [ppxlib: dune build] [uri: dune build]
+ /home/opam/.opam/opam-init/hooks/sandbox.sh "build" "dune" "build" "-p" "uri" "-j" "31" (CWD=/home/opam/.opam/5.0+alpha-repo/.opam-switch/build/uri.4.2.0)
-> compiled  uri.4.2.0
Processing 151/268: [base: dune build] [ppxlib: dune build]
-> installed uri.4.2.0
Processing 152/268: [base: dune build] [ppxlib: dune build]
+ /home/opam/.opam/opam-init/hooks/sandbox.sh "build" "dune" "build" "-p" "base" "-j" "31" (CWD=/home/opam/.opam/5.0+alpha-repo/.opam-switch/build/base.v0.15.1~5.0preview)
- (cd _build/default && /home/opam/.opam/5.0+alpha-repo/bin/ocamlopt.opt -w -40 -g -I src/.base.objs/byte -I src/.base.objs/native -I /home/opam/.opam/5.0+alpha-repo/lib/sexplib0 -I compiler-stdlib/src/.caml.objs/byte -I compiler-stdlib/src/.caml.objs/native -I hash_types/src/.base_internalhash_types.objs/byte -I hash_types/src/.base_internalhash_types.objs/native -I shadow-stdlib/src/.shadow_stdlib.objs/byte -I shadow-stdlib/src/.shadow_stdlib.objs/native -intf-suffix .ml -no-alias-deps -open Base__ -o src/.base.objs/native/base__Float.cmx -c -impl src/float.ml)
- File "src/float.ml", line 490, characters 10-52:
- 490 |   let t = (round_nearest [@ocaml.inlined always]) t0 in
-                 ^^^^^^^^^^^^^^^^^^^^^^^^^^^^^^^^^^^^^^^^^^
- Warning 55 [inlining-impossible]: Cannot inline: Function information unavailable
-> compiled  base.v0.15.1~5.0preview
Processing 152/268: [ppxlib: dune build]
-> installed base.v0.15.1~5.0preview
Processing 153/268: [ppxlib: dune build]
Processing 154/268: [fieldslib: dune build] [ppxlib: dune build]
Processing 155/268: [fieldslib: dune build] [parsexp: dune build] [ppxlib: dune build]
Processing 156/268: [fieldslib: dune build] [parsexp: dune build] [ppxlib: dune build] [stdio: dune build]
Processing 157/268: [fieldslib: dune build] [parsexp: dune build] [ppxlib: dune build] [stdio: dune build] [typerep: dune build]
Processing 158/268: [fieldslib: dune build] [parsexp: dune build] [ppxlib: dune build] [stdio: dune build] [typerep: dune build] [variantslib: dune build]
+ /home/opam/.opam/opam-init/hooks/sandbox.sh "build" "dune" "build" "-p" "fieldslib" "-j" "31" (CWD=/home/opam/.opam/5.0+alpha-repo/.opam-switch/build/fieldslib.v0.15.0)
-> compiled  fieldslib.v0.15.0
Processing 158/268: [parsexp: dune build] [ppxlib: dune build] [stdio: dune build] [typerep: dune build] [variantslib: dune build]
-> installed fieldslib.v0.15.0
Processing 159/268: [parsexp: dune build] [ppxlib: dune build] [stdio: dune build] [typerep: dune build] [variantslib: dune build]
+ /home/opam/.opam/opam-init/hooks/sandbox.sh "build" "dune" "build" "-p" "variantslib" "-j" "31" (CWD=/home/opam/.opam/5.0+alpha-repo/.opam-switch/build/variantslib.v0.15.0)
-> compiled  variantslib.v0.15.0
Processing 159/268: [parsexp: dune build] [ppxlib: dune build] [stdio: dune build] [typerep: dune build]
-> installed variantslib.v0.15.0
Processing 160/268: [parsexp: dune build] [ppxlib: dune build] [stdio: dune build] [typerep: dune build]
+ /home/opam/.opam/opam-init/hooks/sandbox.sh "build" "dune" "build" "-p" "stdio" "-j" "31" (CWD=/home/opam/.opam/5.0+alpha-repo/.opam-switch/build/stdio.v0.15.0)
-> compiled  stdio.v0.15.0
Processing 160/268: [parsexp: dune build] [ppxlib: dune build] [typerep: dune build]
-> installed stdio.v0.15.0
Processing 161/268: [parsexp: dune build] [ppxlib: dune build] [typerep: dune build]
+ /home/opam/.opam/opam-init/hooks/sandbox.sh "build" "dune" "build" "-p" "typerep" "-j" "31" (CWD=/home/opam/.opam/5.0+alpha-repo/.opam-switch/build/typerep.v0.15.0)
-> compiled  typerep.v0.15.0
Processing 161/268: [parsexp: dune build] [ppxlib: dune build]
-> installed typerep.v0.15.0
Processing 162/268: [parsexp: dune build] [ppxlib: dune build]
+ /home/opam/.opam/opam-init/hooks/sandbox.sh "build" "dune" "build" "-p" "parsexp" "-j" "31" (CWD=/home/opam/.opam/5.0+alpha-repo/.opam-switch/build/parsexp.v0.15.0)
-> compiled  parsexp.v0.15.0
Processing 162/268: [ppxlib: dune build]
-> installed parsexp.v0.15.0
Processing 163/268: [ppxlib: dune build]
Processing 164/268: [ppxlib: dune build] [sexplib: dune build]
+ /home/opam/.opam/opam-init/hooks/sandbox.sh "build" "dune" "build" "-p" "sexplib" "-j" "31" (CWD=/home/opam/.opam/5.0+alpha-repo/.opam-switch/build/sexplib.v0.15.1)
-> compiled  sexplib.v0.15.1
Processing 164/268: [ppxlib: dune build]
-> installed sexplib.v0.15.1
Processing 165/268: [ppxlib: dune build]
+ /home/opam/.opam/opam-init/hooks/sandbox.sh "build" "dune" "build" "-p" "ppxlib" "-j" "31" "@install" (CWD=/home/opam/.opam/5.0+alpha-repo/.opam-switch/build/ppxlib.0.27.0)
-> compiled  ppxlib.0.27.0
-> installed ppxlib.0.27.0
Processing 167/268: [ppx_cold: dune build]
Processing 168/268: [ppx_cold: dune build] [ppx_compare: dune build]
Processing 169/268: [ppx_cold: dune build] [ppx_compare: dune build] [ppx_disable_unused_warnings: dune build]
Processing 170/268: [ppx_cold: dune build] [ppx_compare: dune build] [ppx_disable_unused_warnings: dune build] [ppx_enumerate: dune build]
Processing 171/268: [ppx_cold: dune build] [ppx_compare: dune build] [ppx_disable_unused_warnings: dune build] [ppx_enumerate: dune build] [ppx_fields_conv: dune build]
Processing 172/268: [ppx_cold: dune build] [ppx_compare: dune build] [ppx_disable_unused_warnings: dune build] [ppx_enumerate: dune build] [ppx_fields_conv: dune build] [ppx_fixed_literal: dune build]
Processing 173/268: [ppx_cold: dune build] [ppx_compare: dune build] [ppx_disable_unused_warnings: dune build] [ppx_enumerate: dune build] [ppx_fields_conv: dune build] [ppx_fixed_literal: dune build] [ppx_here: dune build]
Processing 174/268: [ppx_cold: dune build] [ppx_compare: dune build] [ppx_disable_unused_warnings: dune build] [ppx_enumerate: dune build] [ppx_fields_conv: dune build] [ppx_fixed_literal: dune build] [ppx_here: dune build] [ppx_ignore_instrumentation: dune build]
Processing 175/268: [ppx_cold: dune build] [ppx_compare: dune build] [ppx_disable_unused_warnings: dune build] [ppx_enumerate: dune build] [ppx_fields_conv: dune build] [ppx_fixed_literal: dune build] [ppx_here: dune build] [ppx_ignore_instrumentation: dune build] [ppx_optcomp: dune build]
Processing 176/268: [ppx_cold: dune build] [ppx_compare: dune build] [ppx_disable_unused_warnings: dune build] [ppx_enumerate: dune build] [ppx_fields_conv: dune build] [ppx_fixed_literal: dune build] [ppx_here: dune build] [ppx_ignore_instrumentation: dune build] [ppx_optcomp: dune build] [ppx_optional: dune build]
Processing 177/268: [ppx_cold: dune build] [ppx_compare: dune build] [ppx_disable_unused_warnings: dune build] [ppx_enumerate: dune build] [ppx_fields_conv: dune build] [ppx_fixed_literal: dune build] [ppx_here: dune build] [ppx_ignore_instrumentation: dune build] [ppx_optcomp: dune build] [ppx_optional: dune build] [ppx_pipebang: dune build]
Processing 178/268: [ppx_cold: dune build] [ppx_compare: dune build] [ppx_disable_unused_warnings: dune build] [ppx_enumerate: dune build] [ppx_fields_conv: dune build] [ppx_fixed_literal: dune build] [ppx_here: dune build] [ppx_ignore_instrumentation: dune build] [ppx_optcomp: dune build] [ppx_optional: dune build] [ppx_pipebang: dune build] [ppx_sexp_conv: dune build]
Processing 179/268: [ppx_cold: dune build] [ppx_compare: dune build] [ppx_disable_unused_warnings: dune build] [ppx_enumerate: dune build] [ppx_fields_conv: dune build] [ppx_fixed_literal: dune build] [ppx_here: dune build] [ppx_ignore_instrumentation: dune build] [ppx_optcomp: dune build] [ppx_optional: dune build] [ppx_pipebang: dune build] [ppx_sexp_conv: dune build] [ppx_stable: dune build]
Processing 180/268: [ppx_cold: dune build] [ppx_compare: dune build] [ppx_disable_unused_warnings: dune build] [ppx_enumerate: dune build] [ppx_fields_conv: dune build] [ppx_fixed_literal: dune build] [ppx_here: dune build] [ppx_ignore_instrumentation: dune build] [ppx_optcomp: dune build] [ppx_optional: dune build] [ppx_pipebang: dune build] [ppx_sexp_conv: dune build] [ppx_stable: dune build] [ppx_typerep_conv: dune build]
Processing 181/268: [ppx_cold: dune build] [ppx_compare: dune build] [ppx_disable_unused_warnings: dune build] [ppx_enumerate: dune build] [ppx_fields_conv: dune build] [ppx_fixed_literal: dune build] [ppx_here: dune build] [ppx_ignore_instrumentation: dune build] [ppx_optcomp: dune build] [ppx_optional: dune build] [ppx_pipebang: dune build] [ppx_sexp_conv: dune build] [ppx_stable: dune build] [ppx_typerep_conv: dune build] [ppx_variants_conv: dune build]
+ /home/opam/.opam/opam-init/hooks/sandbox.sh "build" "dune" "build" "-p" "ppx_disable_unused_warnings" "-j" "31" (CWD=/home/opam/.opam/5.0+alpha-repo/.opam-switch/build/ppx_disable_unused_warnings.v0.15.0)
-> compiled  ppx_disable_unused_warnings.v0.15.0
Processing 181/268: [ppx_cold: dune build] [ppx_compare: dune build] [ppx_enumerate: dune build] [ppx_fields_conv: dune build] [ppx_fixed_literal: dune build] [ppx_here: dune build] [ppx_ignore_instrumentation: dune build] [ppx_optcomp: dune build] [ppx_optional: dune build] [ppx_pipebang: dune build] [ppx_sexp_conv: dune build] [ppx_stable: dune build] [ppx_typerep_conv: dune build] [ppx_variants_conv: dune build]
-> installed ppx_disable_unused_warnings.v0.15.0
Processing 182/268: [ppx_cold: dune build] [ppx_compare: dune build] [ppx_enumerate: dune build] [ppx_fields_conv: dune build] [ppx_fixed_literal: dune build] [ppx_here: dune build] [ppx_ignore_instrumentation: dune build] [ppx_optcomp: dune build] [ppx_optional: dune build] [ppx_pipebang: dune build] [ppx_sexp_conv: dune build] [ppx_stable: dune build] [ppx_typerep_conv: dune build] [ppx_variants_conv: dune build]
+ /home/opam/.opam/opam-init/hooks/sandbox.sh "build" "dune" "build" "-p" "ppx_stable" "-j" "31" (CWD=/home/opam/.opam/5.0+alpha-repo/.opam-switch/build/ppx_stable.v0.15.0)
-> compiled  ppx_stable.v0.15.0
Processing 182/268: [ppx_cold: dune build] [ppx_compare: dune build] [ppx_enumerate: dune build] [ppx_fields_conv: dune build] [ppx_fixed_literal: dune build] [ppx_here: dune build] [ppx_ignore_instrumentation: dune build] [ppx_optcomp: dune build] [ppx_optional: dune build] [ppx_pipebang: dune build] [ppx_sexp_conv: dune build] [ppx_typerep_conv: dune build] [ppx_variants_conv: dune build]
-> installed ppx_stable.v0.15.0
Processing 183/268: [ppx_cold: dune build] [ppx_compare: dune build] [ppx_enumerate: dune build] [ppx_fields_conv: dune build] [ppx_fixed_literal: dune build] [ppx_here: dune build] [ppx_ignore_instrumentation: dune build] [ppx_optcomp: dune build] [ppx_optional: dune build] [ppx_pipebang: dune build] [ppx_sexp_conv: dune build] [ppx_typerep_conv: dune build] [ppx_variants_conv: dune build]
+ /home/opam/.opam/opam-init/hooks/sandbox.sh "build" "dune" "build" "-p" "ppx_here" "-j" "31" (CWD=/home/opam/.opam/5.0+alpha-repo/.opam-switch/build/ppx_here.v0.15.0)
-> compiled  ppx_here.v0.15.0
Processing 183/268: [ppx_cold: dune build] [ppx_compare: dune build] [ppx_enumerate: dune build] [ppx_fields_conv: dune build] [ppx_fixed_literal: dune build] [ppx_ignore_instrumentation: dune build] [ppx_optcomp: dune build] [ppx_optional: dune build] [ppx_pipebang: dune build] [ppx_sexp_conv: dune build] [ppx_typerep_conv: dune build] [ppx_variants_conv: dune build]
-> installed ppx_here.v0.15.0
Processing 184/268: [ppx_cold: dune build] [ppx_compare: dune build] [ppx_enumerate: dune build] [ppx_fields_conv: dune build] [ppx_fixed_literal: dune build] [ppx_ignore_instrumentation: dune build] [ppx_optcomp: dune build] [ppx_optional: dune build] [ppx_pipebang: dune build] [ppx_sexp_conv: dune build] [ppx_typerep_conv: dune build] [ppx_variants_conv: dune build]
Processing 185/268: [ppx_cold: dune build] [ppx_compare: dune build] [ppx_enumerate: dune build] [ppx_fields_conv: dune build] [ppx_fixed_literal: dune build] [ppx_ignore_instrumentation: dune build] [ppx_let: dune build] [ppx_optcomp: dune build] [ppx_optional: dune build] [ppx_pipebang: dune build] [ppx_sexp_conv: dune build] [ppx_typerep_conv: dune build] [ppx_variants_conv: dune build]
+ /home/opam/.opam/opam-init/hooks/sandbox.sh "build" "dune" "build" "-p" "ppx_optcomp" "-j" "31" (CWD=/home/opam/.opam/5.0+alpha-repo/.opam-switch/build/ppx_optcomp.v0.15.0)
-> compiled  ppx_optcomp.v0.15.0
Processing 185/268: [ppx_cold: dune build] [ppx_compare: dune build] [ppx_enumerate: dune build] [ppx_fields_conv: dune build] [ppx_fixed_literal: dune build] [ppx_ignore_instrumentation: dune build] [ppx_let: dune build] [ppx_optional: dune build] [ppx_pipebang: dune build] [ppx_sexp_conv: dune build] [ppx_typerep_conv: dune build] [ppx_variants_conv: dune build]
-> installed ppx_optcomp.v0.15.0
Processing 186/268: [ppx_cold: dune build] [ppx_compare: dune build] [ppx_enumerate: dune build] [ppx_fields_conv: dune build] [ppx_fixed_literal: dune build] [ppx_ignore_instrumentation: dune build] [ppx_let: dune build] [ppx_optional: dune build] [ppx_pipebang: dune build] [ppx_sexp_conv: dune build] [ppx_typerep_conv: dune build] [ppx_variants_conv: dune build]
+ /home/opam/.opam/opam-init/hooks/sandbox.sh "build" "dune" "build" "-p" "ppx_cold" "-j" "31" (CWD=/home/opam/.opam/5.0+alpha-repo/.opam-switch/build/ppx_cold.v0.15.0)
-> compiled  ppx_cold.v0.15.0
Processing 186/268: [ppx_compare: dune build] [ppx_enumerate: dune build] [ppx_fields_conv: dune build] [ppx_fixed_literal: dune build] [ppx_ignore_instrumentation: dune build] [ppx_let: dune build] [ppx_optional: dune build] [ppx_pipebang: dune build] [ppx_sexp_conv: dune build] [ppx_typerep_conv: dune build] [ppx_variants_conv: dune build]
-> installed ppx_cold.v0.15.0
Processing 187/268: [ppx_compare: dune build] [ppx_enumerate: dune build] [ppx_fields_conv: dune build] [ppx_fixed_literal: dune build] [ppx_ignore_instrumentation: dune build] [ppx_let: dune build] [ppx_optional: dune build] [ppx_pipebang: dune build] [ppx_sexp_conv: dune build] [ppx_typerep_conv: dune build] [ppx_variants_conv: dune build]
+ /home/opam/.opam/opam-init/hooks/sandbox.sh "build" "dune" "build" "-p" "ppx_typerep_conv" "-j" "31" (CWD=/home/opam/.opam/5.0+alpha-repo/.opam-switch/build/ppx_typerep_conv.v0.15.0)
-> compiled  ppx_typerep_conv.v0.15.0
Processing 187/268: [ppx_compare: dune build] [ppx_enumerate: dune build] [ppx_fields_conv: dune build] [ppx_fixed_literal: dune build] [ppx_ignore_instrumentation: dune build] [ppx_let: dune build] [ppx_optional: dune build] [ppx_pipebang: dune build] [ppx_sexp_conv: dune build] [ppx_variants_conv: dune build]
-> installed ppx_typerep_conv.v0.15.0
Processing 188/268: [ppx_compare: dune build] [ppx_enumerate: dune build] [ppx_fields_conv: dune build] [ppx_fixed_literal: dune build] [ppx_ignore_instrumentation: dune build] [ppx_let: dune build] [ppx_optional: dune build] [ppx_pipebang: dune build] [ppx_sexp_conv: dune build] [ppx_variants_conv: dune build]
+ /home/opam/.opam/opam-init/hooks/sandbox.sh "build" "dune" "build" "-p" "ppx_variants_conv" "-j" "31" (CWD=/home/opam/.opam/5.0+alpha-repo/.opam-switch/build/ppx_variants_conv.v0.15.0)
-> compiled  ppx_variants_conv.v0.15.0
Processing 188/268: [ppx_compare: dune build] [ppx_enumerate: dune build] [ppx_fields_conv: dune build] [ppx_fixed_literal: dune build] [ppx_ignore_instrumentation: dune build] [ppx_let: dune build] [ppx_optional: dune build] [ppx_pipebang: dune build] [ppx_sexp_conv: dune build]
-> installed ppx_variants_conv.v0.15.0
Processing 189/268: [ppx_compare: dune build] [ppx_enumerate: dune build] [ppx_fields_conv: dune build] [ppx_fixed_literal: dune build] [ppx_ignore_instrumentation: dune build] [ppx_let: dune build] [ppx_optional: dune build] [ppx_pipebang: dune build] [ppx_sexp_conv: dune build]
+ /home/opam/.opam/opam-init/hooks/sandbox.sh "build" "dune" "build" "-p" "ppx_enumerate" "-j" "31" (CWD=/home/opam/.opam/5.0+alpha-repo/.opam-switch/build/ppx_enumerate.v0.15.0)
-> compiled  ppx_enumerate.v0.15.0
Processing 189/268: [ppx_compare: dune build] [ppx_fields_conv: dune build] [ppx_fixed_literal: dune build] [ppx_ignore_instrumentation: dune build] [ppx_let: dune build] [ppx_optional: dune build] [ppx_pipebang: dune build] [ppx_sexp_conv: dune build]
-> installed ppx_enumerate.v0.15.0
Processing 190/268: [ppx_compare: dune build] [ppx_fields_conv: dune build] [ppx_fixed_literal: dune build] [ppx_ignore_instrumentation: dune build] [ppx_let: dune build] [ppx_optional: dune build] [ppx_pipebang: dune build] [ppx_sexp_conv: dune build]
+ /home/opam/.opam/opam-init/hooks/sandbox.sh "build" "dune" "build" "-p" "ppx_fixed_literal" "-j" "31" (CWD=/home/opam/.opam/5.0+alpha-repo/.opam-switch/build/ppx_fixed_literal.v0.15.0)
-> compiled  ppx_fixed_literal.v0.15.0
Processing 190/268: [ppx_compare: dune build] [ppx_fields_conv: dune build] [ppx_ignore_instrumentation: dune build] [ppx_let: dune build] [ppx_optional: dune build] [ppx_pipebang: dune build] [ppx_sexp_conv: dune build]
-> installed ppx_fixed_literal.v0.15.0
Processing 191/268: [ppx_compare: dune build] [ppx_fields_conv: dune build] [ppx_ignore_instrumentation: dune build] [ppx_let: dune build] [ppx_optional: dune build] [ppx_pipebang: dune build] [ppx_sexp_conv: dune build]
+ /home/opam/.opam/opam-init/hooks/sandbox.sh "build" "dune" "build" "-p" "ppx_optional" "-j" "31" (CWD=/home/opam/.opam/5.0+alpha-repo/.opam-switch/build/ppx_optional.v0.15.0)
-> compiled  ppx_optional.v0.15.0
Processing 191/268: [ppx_compare: dune build] [ppx_fields_conv: dune build] [ppx_ignore_instrumentation: dune build] [ppx_let: dune build] [ppx_pipebang: dune build] [ppx_sexp_conv: dune build]
-> installed ppx_optional.v0.15.0
Processing 192/268: [ppx_compare: dune build] [ppx_fields_conv: dune build] [ppx_ignore_instrumentation: dune build] [ppx_let: dune build] [ppx_pipebang: dune build] [ppx_sexp_conv: dune build]
+ /home/opam/.opam/opam-init/hooks/sandbox.sh "build" "dune" "build" "-p" "ppx_fields_conv" "-j" "31" (CWD=/home/opam/.opam/5.0+alpha-repo/.opam-switch/build/ppx_fields_conv.v0.15.0)
-> compiled  ppx_fields_conv.v0.15.0
Processing 192/268: [ppx_compare: dune build] [ppx_ignore_instrumentation: dune build] [ppx_let: dune build] [ppx_pipebang: dune build] [ppx_sexp_conv: dune build]
-> installed ppx_fields_conv.v0.15.0
Processing 193/268: [ppx_compare: dune build] [ppx_ignore_instrumentation: dune build] [ppx_let: dune build] [ppx_pipebang: dune build] [ppx_sexp_conv: dune build]
+ /home/opam/.opam/opam-init/hooks/sandbox.sh "build" "dune" "build" "-p" "ppx_compare" "-j" "31" (CWD=/home/opam/.opam/5.0+alpha-repo/.opam-switch/build/ppx_compare.v0.15.0)
-> compiled  ppx_compare.v0.15.0
Processing 193/268: [ppx_ignore_instrumentation: dune build] [ppx_let: dune build] [ppx_pipebang: dune build] [ppx_sexp_conv: dune build]
-> installed ppx_compare.v0.15.0
Processing 194/268: [ppx_ignore_instrumentation: dune build] [ppx_let: dune build] [ppx_pipebang: dune build] [ppx_sexp_conv: dune build]
+ /home/opam/.opam/opam-init/hooks/sandbox.sh "build" "dune" "build" "-p" "ppx_pipebang" "-j" "31" (CWD=/home/opam/.opam/5.0+alpha-repo/.opam-switch/build/ppx_pipebang.v0.15.0)
-> compiled  ppx_pipebang.v0.15.0
Processing 194/268: [ppx_ignore_instrumentation: dune build] [ppx_let: dune build] [ppx_sexp_conv: dune build]
-> installed ppx_pipebang.v0.15.0
Processing 195/268: [ppx_ignore_instrumentation: dune build] [ppx_let: dune build] [ppx_sexp_conv: dune build]
+ /home/opam/.opam/opam-init/hooks/sandbox.sh "build" "dune" "build" "-p" "ppx_ignore_instrumentation" "-j" "31" (CWD=/home/opam/.opam/5.0+alpha-repo/.opam-switch/build/ppx_ignore_instrumentation.v0.15.0)
-> compiled  ppx_ignore_instrumentation.v0.15.0
Processing 195/268: [ppx_let: dune build] [ppx_sexp_conv: dune build]
-> installed ppx_ignore_instrumentation.v0.15.0
Processing 196/268: [ppx_let: dune build] [ppx_sexp_conv: dune build]
+ /home/opam/.opam/opam-init/hooks/sandbox.sh "build" "dune" "build" "-p" "ppx_sexp_conv" "-j" "31" (CWD=/home/opam/.opam/5.0+alpha-repo/.opam-switch/build/ppx_sexp_conv.v0.15.1)
-> compiled  ppx_sexp_conv.v0.15.1
Processing 196/268: [ppx_let: dune build]
-> installed ppx_sexp_conv.v0.15.1
Processing 197/268: [ppx_let: dune build]
Processing 198/268: [ppx_assert: dune build] [ppx_let: dune build]
Processing 199/268: [ppx_assert: dune build] [ppx_custom_printf: dune build] [ppx_let: dune build]
Processing 200/268: [ppx_assert: dune build] [ppx_custom_printf: dune build] [ppx_hash: dune build] [ppx_let: dune build]
Processing 201/268: [ppx_assert: dune build] [ppx_custom_printf: dune build] [ppx_hash: dune build] [ppx_let: dune build] [ppx_sexp_message: dune build]
Processing 202/268: [ppx_assert: dune build] [ppx_custom_printf: dune build] [ppx_hash: dune build] [ppx_let: dune build] [ppx_sexp_message: dune build] [ppx_sexp_value: dune build]
+ /home/opam/.opam/opam-init/hooks/sandbox.sh "build" "dune" "build" "-p" "ppx_let" "-j" "31" (CWD=/home/opam/.opam/5.0+alpha-repo/.opam-switch/build/ppx_let.v0.15.0)
-> compiled  ppx_let.v0.15.0
Processing 202/268: [ppx_assert: dune build] [ppx_custom_printf: dune build] [ppx_hash: dune build] [ppx_sexp_message: dune build] [ppx_sexp_value: dune build]
-> installed ppx_let.v0.15.0
Processing 203/268: [ppx_assert: dune build] [ppx_custom_printf: dune build] [ppx_hash: dune build] [ppx_sexp_message: dune build] [ppx_sexp_value: dune build]
+ /home/opam/.opam/opam-init/hooks/sandbox.sh "build" "dune" "build" "-p" "ppx_hash" "-j" "31" (CWD=/home/opam/.opam/5.0+alpha-repo/.opam-switch/build/ppx_hash.v0.15.0)
-> compiled  ppx_hash.v0.15.0
Processing 203/268: [ppx_assert: dune build] [ppx_custom_printf: dune build] [ppx_sexp_message: dune build] [ppx_sexp_value: dune build]
-> installed ppx_hash.v0.15.0
Processing 204/268: [ppx_assert: dune build] [ppx_custom_printf: dune build] [ppx_sexp_message: dune build] [ppx_sexp_value: dune build]
Processing 205/268: [ppx_assert: dune build] [ppx_base: dune build] [ppx_custom_printf: dune build] [ppx_sexp_message: dune build] [ppx_sexp_value: dune build]
+ /home/opam/.opam/opam-init/hooks/sandbox.sh "build" "dune" "build" "-p" "ppx_assert" "-j" "31" (CWD=/home/opam/.opam/5.0+alpha-repo/.opam-switch/build/ppx_assert.v0.15.0)
-> compiled  ppx_assert.v0.15.0
Processing 205/268: [ppx_base: dune build] [ppx_custom_printf: dune build] [ppx_sexp_message: dune build] [ppx_sexp_value: dune build]
-> installed ppx_assert.v0.15.0
Processing 206/268: [ppx_base: dune build] [ppx_custom_printf: dune build] [ppx_sexp_message: dune build] [ppx_sexp_value: dune build]
Processing 207/268: [jst-config: dune build] [ppx_base: dune build] [ppx_custom_printf: dune build] [ppx_sexp_message: dune build] [ppx_sexp_value: dune build]
+ /home/opam/.opam/opam-init/hooks/sandbox.sh "build" "dune" "build" "-p" "ppx_sexp_message" "-j" "31" (CWD=/home/opam/.opam/5.0+alpha-repo/.opam-switch/build/ppx_sexp_message.v0.15.0)
-> compiled  ppx_sexp_message.v0.15.0
Processing 207/268: [jst-config: dune build] [ppx_base: dune build] [ppx_custom_printf: dune build] [ppx_sexp_value: dune build]
-> installed ppx_sexp_message.v0.15.0
Processing 208/268: [jst-config: dune build] [ppx_base: dune build] [ppx_custom_printf: dune build] [ppx_sexp_value: dune build]
Processing 209/268: [jst-config: dune build] [ppx_base: dune build] [ppx_custom_printf: dune build] [ppx_log: dune build] [ppx_sexp_value: dune build]
+ /home/opam/.opam/opam-init/hooks/sandbox.sh "build" "dune" "build" "-p" "ppx_custom_printf" "-j" "31" (CWD=/home/opam/.opam/5.0+alpha-repo/.opam-switch/build/ppx_custom_printf.v0.15.0)
-> compiled  ppx_custom_printf.v0.15.0
Processing 209/268: [jst-config: dune build] [ppx_base: dune build] [ppx_log: dune build] [ppx_sexp_value: dune build]
-> installed ppx_custom_printf.v0.15.0
Processing 210/268: [jst-config: dune build] [ppx_base: dune build] [ppx_log: dune build] [ppx_sexp_value: dune build]
Processing 211/268: [bin_prot: dune build] [jst-config: dune build] [ppx_base: dune build] [ppx_log: dune build] [ppx_sexp_value: dune build]
+ /home/opam/.opam/opam-init/hooks/sandbox.sh "build" "dune" "build" "-p" "ppx_sexp_value" "-j" "31" (CWD=/home/opam/.opam/5.0+alpha-repo/.opam-switch/build/ppx_sexp_value.v0.15.0)
-> compiled  ppx_sexp_value.v0.15.0
Processing 211/268: [bin_prot: dune build] [jst-config: dune build] [ppx_base: dune build] [ppx_log: dune build]
-> installed ppx_sexp_value.v0.15.0
Processing 212/268: [bin_prot: dune build] [jst-config: dune build] [ppx_base: dune build] [ppx_log: dune build]
+ /home/opam/.opam/opam-init/hooks/sandbox.sh "build" "dune" "build" "-p" "ppx_base" "-j" "31" (CWD=/home/opam/.opam/5.0+alpha-repo/.opam-switch/build/ppx_base.v0.15.0)
-> compiled  ppx_base.v0.15.0
Processing 212/268: [bin_prot: dune build] [jst-config: dune build] [ppx_log: dune build]
-> installed ppx_base.v0.15.0
Processing 213/268: [bin_prot: dune build] [jst-config: dune build] [ppx_log: dune build]
Processing 214/268: [bin_prot: dune build] [jst-config: dune build] [ppx_log: dune build] [ppx_string: dune build]
Processing 215/268: [bin_prot: dune build] [jst-config: dune build] [ppx_log: dune build] [ppx_string: dune build] [sexp_pretty: dune build]
+ /home/opam/.opam/opam-init/hooks/sandbox.sh "build" "dune" "build" "-p" "jst-config" "-j" "31" (CWD=/home/opam/.opam/5.0+alpha-repo/.opam-switch/build/jst-config.v0.15.1)
-> compiled  jst-config.v0.15.1
Processing 215/268: [bin_prot: dune build] [ppx_log: dune build] [ppx_string: dune build] [sexp_pretty: dune build]
-> installed jst-config.v0.15.1
Processing 216/268: [bin_prot: dune build] [ppx_log: dune build] [ppx_string: dune build] [sexp_pretty: dune build]
Processing 217/268: [bin_prot: dune build] [ppx_log: dune build] [ppx_string: dune build] [sexp_pretty: dune build] [time_now: dune build]
+ /home/opam/.opam/opam-init/hooks/sandbox.sh "build" "dune" "build" "-p" "sexp_pretty" "-j" "31" (CWD=/home/opam/.opam/5.0+alpha-repo/.opam-switch/build/sexp_pretty.v0.15.0.1~alpha-repo)
-> compiled  sexp_pretty.v0.15.0.1~alpha-repo
Processing 217/268: [bin_prot: dune build] [ppx_log: dune build] [ppx_string: dune build] [time_now: dune build]
-> installed sexp_pretty.v0.15.0.1~alpha-repo
Processing 218/268: [bin_prot: dune build] [ppx_log: dune build] [ppx_string: dune build] [time_now: dune build]
+ /home/opam/.opam/opam-init/hooks/sandbox.sh "build" "dune" "build" "-p" "ppx_log" "-j" "31" (CWD=/home/opam/.opam/5.0+alpha-repo/.opam-switch/build/ppx_log.v0.15.0)
-> compiled  ppx_log.v0.15.0
Processing 218/268: [bin_prot: dune build] [ppx_string: dune build] [time_now: dune build]
-> installed ppx_log.v0.15.0
Processing 219/268: [bin_prot: dune build] [ppx_string: dune build] [time_now: dune build]
+ /home/opam/.opam/opam-init/hooks/sandbox.sh "build" "dune" "build" "-p" "bin_prot" "-j" "31" (CWD=/home/opam/.opam/5.0+alpha-repo/.opam-switch/build/bin_prot.v0.15.0)
-> compiled  bin_prot.v0.15.0
Processing 219/268: [ppx_string: dune build] [time_now: dune build]
-> installed bin_prot.v0.15.0
Processing 220/268: [ppx_string: dune build] [time_now: dune build]
Processing 221/268: [ppx_bin_prot: dune build] [ppx_string: dune build] [time_now: dune build]
+ /home/opam/.opam/opam-init/hooks/sandbox.sh "build" "dune" "build" "-p" "ppx_string" "-j" "31" (CWD=/home/opam/.opam/5.0+alpha-repo/.opam-switch/build/ppx_string.v0.15.0)
-> compiled  ppx_string.v0.15.0
Processing 221/268: [ppx_bin_prot: dune build] [time_now: dune build]
-> installed ppx_string.v0.15.0
Processing 222/268: [ppx_bin_prot: dune build] [time_now: dune build]
+ /home/opam/.opam/opam-init/hooks/sandbox.sh "build" "dune" "build" "-p" "time_now" "-j" "31" (CWD=/home/opam/.opam/5.0+alpha-repo/.opam-switch/build/time_now.v0.15.0)
-> compiled  time_now.v0.15.0
Processing 222/268: [ppx_bin_prot: dune build]
-> installed time_now.v0.15.0
Processing 223/268: [ppx_bin_prot: dune build]
Processing 224/268: [ppx_bin_prot: dune build] [ppx_inline_test: dune build]
Processing 225/268: [ppx_bin_prot: dune build] [ppx_inline_test: dune build] [ppx_module_timer: dune build]
+ /home/opam/.opam/opam-init/hooks/sandbox.sh "build" "dune" "build" "-p" "ppx_bin_prot" "-j" "31" (CWD=/home/opam/.opam/5.0+alpha-repo/.opam-switch/build/ppx_bin_prot.v0.15.0)
-> compiled  ppx_bin_prot.v0.15.0
Processing 225/268: [ppx_inline_test: dune build] [ppx_module_timer: dune build]
-> installed ppx_bin_prot.v0.15.0
Processing 226/268: [ppx_inline_test: dune build] [ppx_module_timer: dune build]
+ /home/opam/.opam/opam-init/hooks/sandbox.sh "build" "dune" "build" "-p" "ppx_module_timer" "-j" "31" (CWD=/home/opam/.opam/5.0+alpha-repo/.opam-switch/build/ppx_module_timer.v0.15.0)
-> compiled  ppx_module_timer.v0.15.0
Processing 226/268: [ppx_inline_test: dune build]
-> installed ppx_module_timer.v0.15.0
Processing 227/268: [ppx_inline_test: dune build]
+ /home/opam/.opam/opam-init/hooks/sandbox.sh "build" "dune" "build" "-p" "ppx_inline_test" "-j" "31" (CWD=/home/opam/.opam/5.0+alpha-repo/.opam-switch/build/ppx_inline_test.v0.15.0)
-> compiled  ppx_inline_test.v0.15.0
-> installed ppx_inline_test.v0.15.0
Processing 229/268: [ppx_bench: dune build]
Processing 230/268: [ppx_bench: dune build] [ppx_expect: dune build]
+ /home/opam/.opam/opam-init/hooks/sandbox.sh "build" "dune" "build" "-p" "ppx_bench" "-j" "31" (CWD=/home/opam/.opam/5.0+alpha-repo/.opam-switch/build/ppx_bench.v0.15.0)
-> compiled  ppx_bench.v0.15.0
Processing 230/268: [ppx_expect: dune build]
-> installed ppx_bench.v0.15.0
Processing 231/268: [ppx_expect: dune build]
Processing 232/268: [ppx_expect: dune build] [splittable_random: dune build]
+ /home/opam/.opam/opam-init/hooks/sandbox.sh "build" "dune" "build" "-p" "ppx_expect" "-j" "31" (CWD=/home/opam/.opam/5.0+alpha-repo/.opam-switch/build/ppx_expect.v0.15.0.1~alpha-repo)
-> compiled  ppx_expect.v0.15.0.1~alpha-repo
Processing 232/268: [splittable_random: dune build]
-> installed ppx_expect.v0.15.0.1~alpha-repo
Processing 233/268: [splittable_random: dune build]
+ /home/opam/.opam/opam-init/hooks/sandbox.sh "build" "dune" "build" "-p" "splittable_random" "-j" "31" (CWD=/home/opam/.opam/5.0+alpha-repo/.opam-switch/build/splittable_random.v0.15.0)
-> compiled  splittable_random.v0.15.0
-> installed splittable_random.v0.15.0
Processing 235/268: [base_quickcheck: dune build]
+ /home/opam/.opam/opam-init/hooks/sandbox.sh "build" "dune" "build" "-p" "base_quickcheck" "-j" "31" (CWD=/home/opam/.opam/5.0+alpha-repo/.opam-switch/build/base_quickcheck.v0.15.0)
-> compiled  base_quickcheck.v0.15.0
-> installed base_quickcheck.v0.15.0
Processing 237/268: [ppx_jane: dune build]
+ /home/opam/.opam/opam-init/hooks/sandbox.sh "build" "dune" "build" "-p" "ppx_jane" "-j" "31" (CWD=/home/opam/.opam/5.0+alpha-repo/.opam-switch/build/ppx_jane.v0.15.0)
-> compiled  ppx_jane.v0.15.0
-> installed ppx_jane.v0.15.0
Processing 239/268: [int_repr: dune build]
+ /home/opam/.opam/opam-init/hooks/sandbox.sh "build" "dune" "build" "-p" "int_repr" "-j" "31" (CWD=/home/opam/.opam/5.0+alpha-repo/.opam-switch/build/int_repr.v0.15.0)
-> compiled  int_repr.v0.15.0
-> installed int_repr.v0.15.0
Processing 241/268: [base_bigstring: dune build]
+ /home/opam/.opam/opam-init/hooks/sandbox.sh "build" "dune" "build" "-p" "base_bigstring" "-j" "31" (CWD=/home/opam/.opam/5.0+alpha-repo/.opam-switch/build/base_bigstring.v0.15.0)
-> compiled  base_bigstring.v0.15.0
-> installed base_bigstring.v0.15.0
Processing 243/268: [core: dune build]
+ /home/opam/.opam/opam-init/hooks/sandbox.sh "build" "dune" "build" "-p" "core" "-j" "31" (CWD=/home/opam/.opam/5.0+alpha-repo/.opam-switch/build/core.v0.15.0.1~alpha-repo)
- (cd _build/default/core/src && /usr/bin/gcc -O2 -fno-strict-aliasing -fwrapv -pthread -fPIC -D_FILE_OFFSET_BITS=64 -O2 -fno-strict-aliasing -fwrapv -pthread -fPIC -D_LARGEFILE64_SOURCE -g -I /home/opam/.opam/5.0+alpha-repo/lib/ocaml -I /home/opam/.opam/5.0+alpha-repo/lib/base -I /home/opam/.opam/5.0+alpha-repo/lib/base/base_internalhash_types -I /home/opam/.opam/5.0+alpha-repo/lib/base/caml -I /home/opam/.opam/5.0+alpha-repo/lib/base/md5 -I /home/opam/.opam/5.0+alpha-repo/lib/base/shadow_stdlib -I /home/opam/.opam/5.0+alpha-repo/lib/base_bigstring -I /home/opam/.opam/5.0+alpha-repo/lib/base_quickcheck -I /home/opam/.opam/5.0+alpha-repo/lib/base_quickcheck/ppx_quickcheck/runtime -I /home/opam/.opam/5.0+alpha-repo/lib/bin_prot -I /home/opam/.opam/5.0+alpha-repo/lib/bin_prot/shape -I /home/opam/.opam/5.0+alpha-repo/lib/fieldslib -I /home/opam/.opam/5.0+alpha-repo/lib/int_repr -I /home/opam/.opam/5.0+alpha-repo/lib/jane-street-headers -I /home/opam/.opam/5.0+alpha-repo/lib/parsexp -I /home/opam/.opam/5.0+alpha-repo/lib/ppx_assert/runtime-lib -I /home/opam/.opam/5.0+alpha-repo/lib/ppx_bench/runtime-lib -I /home/opam/.opam/5.0+alpha-repo/lib/ppx_compare/runtime-lib -I /home/opam/.opam/5.0+alpha-repo/lib/ppx_enumerate/runtime-lib -I /home/opam/.opam/5.0+alpha-repo/lib/ppx_expect/collector -I /home/opam/.opam/5.0+alpha-repo/lib/ppx_expect/common -I /home/opam/.opam/5.0+alpha-repo/lib/ppx_expect/config -I /home/opam/.opam/5.0+alpha-repo/lib/ppx_expect/config_types -I /home/opam/.opam/5.0+alpha-repo/lib/ppx_hash/runtime-lib -I /home/opam/.opam/5.0+alpha-repo/lib/ppx_here/runtime-lib -I /home/opam/.opam/5.0+alpha-repo/lib/ppx_inline_test/config -I /home/opam/.opam/5.0+alpha-repo/lib/ppx_inline_test/runtime-lib -I /home/opam/.opam/5.0+alpha-repo/lib/ppx_log/types -I /home/opam/.opam/5.0+alpha-repo/lib/ppx_module_timer/runtime -I /home/opam/.opam/5.0+alpha-repo/lib/ppx_sexp_conv/runtime-lib -I /home/opam/.opam/5.0+alpha-repo/lib/sexplib -I /home/opam/.opam/5.0+alpha-repo/lib/sexplib0 -I /home/opam/.opam/5.0+alpha-repo/lib/splittable_random -I /home/opam/.opam/5.0+alpha-repo/lib/stdio -I /home/opam/.opam/5.0+alpha-repo/lib/time_now -I /home/opam/.opam/5.0+alpha-repo/lib/typerep -I /home/opam/.opam/5.0+alpha-repo/lib/variantslib -I ../../base_for_tests/src -I ../../validate/src -o array_stubs.o -c array_stubs.c)
- array_stubs.c: In function 'core_array_unsafe_int_blit':
- array_stubs.c:14:11: warning: passing argument 1 of 'memmove' discards 'volatile' qualifier from pointer target type [-Wdiscarded-qualifiers]
-    14 |   memmove(&Field(dst, Long_val(dst_pos)),
- In file included from array_stubs.c:2:
- /usr/include/string.h:47:29: note: expected 'void *' but argument is of type 'volatile value *' {aka 'volatile long int *'}
-    47 | extern void *memmove (void *__dest, const void *__src, size_t __n)
-       |                       ~~~~~~^~~~~~
- array_stubs.c:15:11: warning: passing argument 2 of 'memmove' discards 'volatile' qualifier from pointer target type [-Wdiscarded-qualifiers]
-    15 |           &Field(src, Long_val(src_pos)),
- /usr/include/string.h:47:49: note: expected 'const void *' but argument is of type 'volatile value *' {aka 'volatile long int *'}
-    47 | extern void *memmove (void *__dest, const void *__src, size_t __n)
-       |                                     ~~~~~~~~~~~~^~~~~
- (cd _build/default/core/src && /usr/bin/gcc -O2 -fno-strict-aliasing -fwrapv -pthread -fPIC -D_FILE_OFFSET_BITS=64 -O2 -fno-strict-aliasing -fwrapv -pthread -fPIC -D_LARGEFILE64_SOURCE -g -I /home/opam/.opam/5.0+alpha-repo/lib/ocaml -I /home/opam/.opam/5.0+alpha-repo/lib/base -I /home/opam/.opam/5.0+alpha-repo/lib/base/base_internalhash_types -I /home/opam/.opam/5.0+alpha-repo/lib/base/caml -I /home/opam/.opam/5.0+alpha-repo/lib/base/md5 -I /home/opam/.opam/5.0+alpha-repo/lib/base/shadow_stdlib -I /home/opam/.opam/5.0+alpha-repo/lib/base_bigstring -I /home/opam/.opam/5.0+alpha-repo/lib/base_quickcheck -I /home/opam/.opam/5.0+alpha-repo/lib/base_quickcheck/ppx_quickcheck/runtime -I /home/opam/.opam/5.0+alpha-repo/lib/bin_prot -I /home/opam/.opam/5.0+alpha-repo/lib/bin_prot/shape -I /home/opam/.opam/5.0+alpha-repo/lib/fieldslib -I /home/opam/.opam/5.0+alpha-repo/lib/int_repr -I /home/opam/.opam/5.0+alpha-repo/lib/jane-street-headers -I /home/opam/.opam/5.0+alpha-repo/lib/parsexp -I /home/opam/.opam/5.0+alpha-repo/lib/ppx_assert/runtime-lib -I /home/opam/.opam/5.0+alpha-repo/lib/ppx_bench/runtime-lib -I /home/opam/.opam/5.0+alpha-repo/lib/ppx_compare/runtime-lib -I /home/opam/.opam/5.0+alpha-repo/lib/ppx_enumerate/runtime-lib -I /home/opam/.opam/5.0+alpha-repo/lib/ppx_expect/collector -I /home/opam/.opam/5.0+alpha-repo/lib/ppx_expect/common -I /home/opam/.opam/5.0+alpha-repo/lib/ppx_expect/config -I /home/opam/.opam/5.0+alpha-repo/lib/ppx_expect/config_types -I /home/opam/.opam/5.0+alpha-repo/lib/ppx_hash/runtime-lib -I /home/opam/.opam/5.0+alpha-repo/lib/ppx_here/runtime-lib -I /home/opam/.opam/5.0+alpha-repo/lib/ppx_inline_test/config -I /home/opam/.opam/5.0+alpha-repo/lib/ppx_inline_test/runtime-lib -I /home/opam/.opam/5.0+alpha-repo/lib/ppx_log/types -I /home/opam/.opam/5.0+alpha-repo/lib/ppx_module_timer/runtime -I /home/opam/.opam/5.0+alpha-repo/lib/ppx_sexp_conv/runtime-lib -I /home/opam/.opam/5.0+alpha-repo/lib/sexplib -I /home/opam/.opam/5.0+alpha-repo/lib/sexplib0 -I /home/opam/.opam/5.0+alpha-repo/lib/splittable_random -I /home/opam/.opam/5.0+alpha-repo/lib/stdio -I /home/opam/.opam/5.0+alpha-repo/lib/time_now -I /home/opam/.opam/5.0+alpha-repo/lib/typerep -I /home/opam/.opam/5.0+alpha-repo/lib/variantslib -I ../../base_for_tests/src -I ../../validate/src -o bigstring_stubs.o -c bigstring_stubs.c)
- In file included from bigstring_stubs.c:54:
- bigstring_stubs.c: In function 'core_bigstring_destroy':
- /home/opam/.opam/5.0+alpha-repo/lib/ocaml/caml/custom.h:48:27: warning: initialization discards 'const' qualifier from pointer target type [-Wdiscarded-qualifiers]
-    48 | #define Custom_ops_val(v) (*((const struct custom_operations **) (v)))
-       |                           ^
- bigstring_stubs.c:116:35: note: in expansion of macro 'Custom_ops_val'
-   116 |   struct custom_operations* ops = Custom_ops_val(v);
-       |                                   ^~~~~~~~~~~~~~
-> compiled  core.v0.15.0.1~alpha-repo
-> installed core.v0.15.0.1~alpha-repo
Processing 245/268: [core_kernel: dune build]
Processing 246/268: [core_kernel: dune build] [expect_test_helpers_core: dune build]
Processing 247/268: [core_kernel: dune build] [expect_test_helpers_core: dune build] [protocol_version_header: dune build]
Processing 248/268: [core_kernel: dune build] [expect_test_helpers_core: dune build] [protocol_version_header: dune build] [textutils_kernel: dune build]
Processing 249/268: [core_kernel: dune build] [expect_test_helpers_core: dune build] [protocol_version_header: dune build] [textutils_kernel: dune build] [timezone: dune build]
+ /home/opam/.opam/opam-init/hooks/sandbox.sh "build" "dune" "build" "-p" "protocol_version_header" "-j" "31" (CWD=/home/opam/.opam/5.0+alpha-repo/.opam-switch/build/protocol_version_header.v0.15.0)
-> compiled  protocol_version_header.v0.15.0
Processing 249/268: [core_kernel: dune build] [expect_test_helpers_core: dune build] [textutils_kernel: dune build] [timezone: dune build]
-> installed protocol_version_header.v0.15.0
Processing 250/268: [core_kernel: dune build] [expect_test_helpers_core: dune build] [textutils_kernel: dune build] [timezone: dune build]
+ /home/opam/.opam/opam-init/hooks/sandbox.sh "build" "dune" "build" "-p" "textutils_kernel" "-j" "31" (CWD=/home/opam/.opam/5.0+alpha-repo/.opam-switch/build/textutils_kernel.v0.15.0)
-> compiled  textutils_kernel.v0.15.0
Processing 250/268: [core_kernel: dune build] [expect_test_helpers_core: dune build] [timezone: dune build]
-> installed textutils_kernel.v0.15.0
Processing 251/268: [core_kernel: dune build] [expect_test_helpers_core: dune build] [timezone: dune build]
+ /home/opam/.opam/opam-init/hooks/sandbox.sh "build" "dune" "build" "-p" "timezone" "-j" "31" (CWD=/home/opam/.opam/5.0+alpha-repo/.opam-switch/build/timezone.v0.15.0)
-> compiled  timezone.v0.15.0
Processing 251/268: [core_kernel: dune build] [expect_test_helpers_core: dune build]
-> installed timezone.v0.15.0
Processing 252/268: [core_kernel: dune build] [expect_test_helpers_core: dune build]
+ /home/opam/.opam/opam-init/hooks/sandbox.sh "build" "dune" "build" "-p" "expect_test_helpers_core" "-j" "31" (CWD=/home/opam/.opam/5.0+alpha-repo/.opam-switch/build/expect_test_helpers_core.v0.15.0)
-> compiled  expect_test_helpers_core.v0.15.0
Processing 252/268: [core_kernel: dune build]
-> installed expect_test_helpers_core.v0.15.0
Processing 253/268: [core_kernel: dune build]
+ /home/opam/.opam/opam-init/hooks/sandbox.sh "build" "dune" "build" "-p" "core_kernel" "-j" "31" (CWD=/home/opam/.opam/5.0+alpha-repo/.opam-switch/build/core_kernel.v0.15.0)
-> compiled  core_kernel.v0.15.0
-> installed core_kernel.v0.15.0
Processing 255/268: [async_kernel: dune build]
Processing 256/268: [async_kernel: dune build] [core_unix: dune build]
+ /home/opam/.opam/opam-init/hooks/sandbox.sh "build" "dune" "build" "-p" "async_kernel" "-j" "31" (CWD=/home/opam/.opam/5.0+alpha-repo/.opam-switch/build/async_kernel.v0.15.0)
-> compiled  async_kernel.v0.15.0
Processing 256/268: [core_unix: dune build]
-> installed async_kernel.v0.15.0
Processing 257/268: [core_unix: dune build]
Processing 258/268: [async_rpc_kernel: dune build] [core_unix: dune build]
+ /home/opam/.opam/opam-init/hooks/sandbox.sh "build" "dune" "build" "-p" "core_unix" "-j" "31" (CWD=/home/opam/.opam/5.0+alpha-repo/.opam-switch/build/core_unix.v0.15.0.1~alpha-repo)
- (cd _build/default/bigstring_unix/src && /usr/bin/gcc -O2 -fno-strict-aliasing -fwrapv -pthread -fPIC -D_FILE_OFFSET_BITS=64 -O2 -fno-strict-aliasing -fwrapv -pthread -fPIC -g -I /home/opam/.opam/5.0+alpha-repo/lib/ocaml -I /home/opam/.opam/5.0+alpha-repo/lib/base -I /home/opam/.opam/5.0+alpha-repo/lib/base/base_internalhash_types -I /home/opam/.opam/5.0+alpha-repo/lib/base/caml -I /home/opam/.opam/5.0+alpha-repo/lib/base/md5 -I /home/opam/.opam/5.0+alpha-repo/lib/base/shadow_stdlib -I /home/opam/.opam/5.0+alpha-repo/lib/base_bigstring -I /home/opam/.opam/5.0+alpha-repo/lib/base_quickcheck -I /home/opam/.opam/5.0+alpha-repo/lib/base_quickcheck/ppx_quickcheck/runtime -I /home/opam/.opam/5.0+alpha-repo/lib/bin_prot -I /home/opam/.opam/5.0+alpha-repo/lib/bin_prot/shape -I /home/opam/.opam/5.0+alpha-repo/lib/core -I /home/opam/.opam/5.0+alpha-repo/lib/core/base_for_tests -I /home/opam/.opam/5.0+alpha-repo/lib/core/validate -I /home/opam/.opam/5.0+alpha-repo/lib/core_kernel/caml_threads -I /home/opam/.opam/5.0+alpha-repo/lib/core_kernel/caml_unix -I /home/opam/.opam/5.0+alpha-repo/lib/core_kernel/flags -I /home/opam/.opam/5.0+alpha-repo/lib/fieldslib -I /home/opam/.opam/5.0+alpha-repo/lib/int_repr -I /home/opam/.opam/5.0+alpha-repo/lib/jane-street-headers -I /home/opam/.opam/5.0+alpha-repo/lib/ocaml/threads -I /home/opam/.opam/5.0+alpha-repo/lib/ocaml/unix -I /home/opam/.opam/5.0+alpha-repo/lib/parsexp -I /home/opam/.opam/5.0+alpha-repo/lib/ppx_assert/runtime-lib -I /home/opam/.opam/5.0+alpha-repo/lib/ppx_bench/runtime-lib -I /home/opam/.opam/5.0+alpha-repo/lib/ppx_compare/runtime-lib -I /home/opam/.opam/5.0+alpha-repo/lib/ppx_enumerate/runtime-lib -I /home/opam/.opam/5.0+alpha-repo/lib/ppx_expect/collector -I /home/opam/.opam/5.0+alpha-repo/lib/ppx_expect/common -I /home/opam/.opam/5.0+alpha-repo/lib/ppx_expect/config -I /home/opam/.opam/5.0+alpha-repo/lib/ppx_expect/config_types -I /home/opam/.opam/5.0+alpha-repo/lib/ppx_hash/runtime-lib -I /home/opam/.opam/5.0+alpha-repo/lib/ppx_here/runtime-lib -I /home/opam/.opam/5.0+alpha-repo/lib/ppx_inline_test/config -I /home/opam/.opam/5.0+alpha-repo/lib/ppx_inline_test/runtime-lib -I /home/opam/.opam/5.0+alpha-repo/lib/ppx_log/types -I /home/opam/.opam/5.0+alpha-repo/lib/ppx_module_timer/runtime -I /home/opam/.opam/5.0+alpha-repo/lib/ppx_sexp_conv/runtime-lib -I /home/opam/.opam/5.0+alpha-repo/lib/sexplib -I /home/opam/.opam/5.0+alpha-repo/lib/sexplib/unix -I /home/opam/.opam/5.0+alpha-repo/lib/sexplib0 -I /home/opam/.opam/5.0+alpha-repo/lib/spawn -I /home/opam/.opam/5.0+alpha-repo/lib/splittable_random -I /home/opam/.opam/5.0+alpha-repo/lib/stdio -I /home/opam/.opam/5.0+alpha-repo/lib/time_now -I /home/opam/.opam/5.0+alpha-repo/lib/typerep -I /home/opam/.opam/5.0+alpha-repo/lib/variantslib -I ../../core_unix/src -I ../../error_checking_mutex/src -I ../../ocaml_c_utils/src -I ../../signal_unix/src -o bigstring_unix_stubs.o -c bigstring_unix_stubs.c)
- In file included from /home/opam/.opam/5.0+alpha-repo/lib/ocaml/caml/io.h:26,
-                  from bigstring_unix_stubs.c:267:
- /home/opam/.opam/5.0+alpha-repo/lib/ocaml/caml/platform.h: In function 'atomic_load_wait_nonzero':
- /home/opam/.opam/5.0+alpha-repo/lib/ocaml/caml/platform.h:87:12: warning: implicit declaration of function 'CAMLlikely' [-Wimplicit-function-declaration]
-    87 |            CAMLlikely(GENSYM(caml__spins) < Max_spins) ?                \
-       |            ^~~~~~~~~~
- /home/opam/.opam/5.0+alpha-repo/lib/ocaml/caml/platform.h:93:3: note: in expansion of macro 'SPIN_WAIT'
-    93 |   SPIN_WAIT {
-       |   ^~~~~~~~~
- (cd _build/default && /home/opam/.opam/5.0+alpha-repo/bin/ocamlc.opt -w -40 -g -bin-annot -I core_thread/src/.core_thread.objs/byte -I /home/opam/.opam/5.0+alpha-repo/lib/base -I /home/opam/.opam/5.0+alpha-repo/lib/base/base_internalhash_types -I /home/opam/.opam/5.0+alpha-repo/lib/base/caml -I /home/opam/.opam/5.0+alpha-repo/lib/base/md5 -I /home/opam/.opam/5.0+alpha-repo/lib/base/shadow_stdlib -I /home/opam/.opam/5.0+alpha-repo/lib/base_bigstring -I /home/opam/.opam/5.0+alpha-repo/lib/base_quickcheck -I /home/opam/.opam/5.0+alpha-repo/lib/base_quickcheck/ppx_quickcheck/runtime -I /home/opam/.opam/5.0+alpha-repo/lib/bin_prot -I /home/opam/.opam/5.0+alpha-repo/lib/bin_prot/shape -I /home/opam/.opam/5.0+alpha-repo/lib/core -I /home/opam/.opam/5.0+alpha-repo/lib/core/base_for_tests -I /home/opam/.opam/5.0+alpha-repo/lib/core/validate -I /home/opam/.opam/5.0+alpha-repo/lib/core_kernel/caml_threads -I /home/opam/.opam/5.0+alpha-repo/lib/core_kernel/caml_unix -I /home/opam/.opam/5.0+alpha-repo/lib/fieldslib -I /home/opam/.opam/5.0+alpha-repo/lib/int_repr -I /home/opam/.opam/5.0+alpha-repo/lib/jane-street-headers -I /home/opam/.opam/5.0+alpha-repo/lib/ocaml/threads -I /home/opam/.opam/5.0+alpha-repo/lib/ocaml/unix -I /home/opam/.opam/5.0+alpha-repo/lib/parsexp -I /home/opam/.opam/5.0+alpha-repo/lib/ppx_assert/runtime-lib -I /home/opam/.opam/5.0+alpha-repo/lib/ppx_bench/runtime-lib -I /home/opam/.opam/5.0+alpha-repo/lib/ppx_compare/runtime-lib -I /home/opam/.opam/5.0+alpha-repo/lib/ppx_enumerate/runtime-lib -I /home/opam/.opam/5.0+alpha-repo/lib/ppx_expect/collector -I /home/opam/.opam/5.0+alpha-repo/lib/ppx_expect/common -I /home/opam/.opam/5.0+alpha-repo/lib/ppx_expect/config -I /home/opam/.opam/5.0+alpha-repo/lib/ppx_expect/config_types -I /home/opam/.opam/5.0+alpha-repo/lib/ppx_hash/runtime-lib -I /home/opam/.opam/5.0+alpha-repo/lib/ppx_here/runtime-lib -I /home/opam/.opam/5.0+alpha-repo/lib/ppx_inline_test/config -I /home/opam/.opam/5.0+alpha-repo/lib/ppx_inline_test/runtime-lib -I /home/opam/.opam/5.0+alpha-repo/lib/ppx_log/types -I /home/opam/.opam/5.0+alpha-repo/lib/ppx_module_timer/runtime -I /home/opam/.opam/5.0+alpha-repo/lib/ppx_sexp_conv/runtime-lib -I /home/opam/.opam/5.0+alpha-repo/lib/sexplib -I /home/opam/.opam/5.0+alpha-repo/lib/sexplib0 -I /home/opam/.opam/5.0+alpha-repo/lib/splittable_random -I /home/opam/.opam/5.0+alpha-repo/lib/stdio -I /home/opam/.opam/5.0+alpha-repo/lib/time_now -I /home/opam/.opam/5.0+alpha-repo/lib/typerep -I /home/opam/.opam/5.0+alpha-repo/lib/variantslib -I signal_unix/src/.signal_unix.objs/byte -intf-suffix .ml -no-alias-deps -open Core_thread__ -o core_thread/src/.core_thread.objs/byte/core_thread.cmo -c -impl core_thread/src/core_thread.pp.ml)
- File "core_thread/src/core_thread.pp.ml", line 1:
- Alert deprecated: exit
- Use 'raise Thread.Exit' instead.
- File "thread.mli", lines 54-55, characters 0-55:
-   Definition
- File "core_thread/src/core_thread.mli", line 38, characters 0-23:
-   Expected signature
- File "core_thread/src/core_thread.pp.ml", line 1:
- Alert deprecated: wait_timed_read
- Use Unix.select instead.
- File "thread.mli", lines 95-96, characters 0-47:
-   Definition
- File "core_thread/src/core_thread.mli", line 63, characters 0-54:
-   Expected signature
- File "core_thread/src/core_thread.pp.ml", line 1:
- Alert deprecated: wait_timed_write
- Use Unix.select instead.
- File "thread.mli", lines 99-100, characters 0-47:
-   Definition
- File "core_thread/src/core_thread.mli", line 66, characters 0-55:
-   Expected signature
- (cd _build/default && /home/opam/.opam/5.0+alpha-repo/bin/ocamlopt.opt -w -40 -g -I core_thread/src/.core_thread.objs/byte -I core_thread/src/.core_thread.objs/native -I /home/opam/.opam/5.0+alpha-repo/lib/base -I /home/opam/.opam/5.0+alpha-repo/lib/base/base_internalhash_types -I /home/opam/.opam/5.0+alpha-repo/lib/base/caml -I /home/opam/.opam/5.0+alpha-repo/lib/base/md5 -I /home/opam/.opam/5.0+alpha-repo/lib/base/shadow_stdlib -I /home/opam/.opam/5.0+alpha-repo/lib/base_bigstring -I /home/opam/.opam/5.0+alpha-repo/lib/base_quickcheck -I /home/opam/.opam/5.0+alpha-repo/lib/base_quickcheck/ppx_quickcheck/runtime -I /home/opam/.opam/5.0+alpha-repo/lib/bin_prot -I /home/opam/.opam/5.0+alpha-repo/lib/bin_prot/shape -I /home/opam/.opam/5.0+alpha-repo/lib/core -I /home/opam/.opam/5.0+alpha-repo/lib/core/base_for_tests -I /home/opam/.opam/5.0+alpha-repo/lib/core/validate -I /home/opam/.opam/5.0+alpha-repo/lib/core_kernel/caml_threads -I /home/opam/.opam/5.0+alpha-repo/lib/core_kernel/caml_unix -I /home/opam/.opam/5.0+alpha-repo/lib/fieldslib -I /home/opam/.opam/5.0+alpha-repo/lib/int_repr -I /home/opam/.opam/5.0+alpha-repo/lib/jane-street-headers -I /home/opam/.opam/5.0+alpha-repo/lib/ocaml/threads -I /home/opam/.opam/5.0+alpha-repo/lib/ocaml/unix -I /home/opam/.opam/5.0+alpha-repo/lib/parsexp -I /home/opam/.opam/5.0+alpha-repo/lib/ppx_assert/runtime-lib -I /home/opam/.opam/5.0+alpha-repo/lib/ppx_bench/runtime-lib -I /home/opam/.opam/5.0+alpha-repo/lib/ppx_compare/runtime-lib -I /home/opam/.opam/5.0+alpha-repo/lib/ppx_enumerate/runtime-lib -I /home/opam/.opam/5.0+alpha-repo/lib/ppx_expect/collector -I /home/opam/.opam/5.0+alpha-repo/lib/ppx_expect/common -I /home/opam/.opam/5.0+alpha-repo/lib/ppx_expect/config -I /home/opam/.opam/5.0+alpha-repo/lib/ppx_expect/config_types -I /home/opam/.opam/5.0+alpha-repo/lib/ppx_hash/runtime-lib -I /home/opam/.opam/5.0+alpha-repo/lib/ppx_here/runtime-lib -I /home/opam/.opam/5.0+alpha-repo/lib/ppx_inline_test/config -I /home/opam/.opam/5.0+alpha-repo/lib/ppx_inline_test/runtime-lib -I /home/opam/.opam/5.0+alpha-repo/lib/ppx_log/types -I /home/opam/.opam/5.0+alpha-repo/lib/ppx_module_timer/runtime -I /home/opam/.opam/5.0+alpha-repo/lib/ppx_sexp_conv/runtime-lib -I /home/opam/.opam/5.0+alpha-repo/lib/sexplib -I /home/opam/.opam/5.0+alpha-repo/lib/sexplib0 -I /home/opam/.opam/5.0+alpha-repo/lib/splittable_random -I /home/opam/.opam/5.0+alpha-repo/lib/stdio -I /home/opam/.opam/5.0+alpha-repo/lib/time_now -I /home/opam/.opam/5.0+alpha-repo/lib/typerep -I /home/opam/.opam/5.0+alpha-repo/lib/variantslib -I signal_unix/src/.signal_unix.objs/byte -I signal_unix/src/.signal_unix.objs/native -intf-suffix .ml -no-alias-deps -open Core_thread__ -o core_thread/src/.core_thread.objs/native/core_thread.cmx -c -impl core_thread/src/core_thread.pp.ml)
- File "core_thread/src/core_thread.pp.ml", line 1:
- Alert deprecated: exit
- Use 'raise Thread.Exit' instead.
- File "thread.mli", lines 54-55, characters 0-55:
-   Definition
- File "core_thread/src/core_thread.mli", line 38, characters 0-23:
-   Expected signature
- File "core_thread/src/core_thread.pp.ml", line 1:
- Alert deprecated: wait_timed_read
- Use Unix.select instead.
- File "thread.mli", lines 95-96, characters 0-47:
-   Definition
- File "core_thread/src/core_thread.mli", line 63, characters 0-54:
-   Expected signature
- File "core_thread/src/core_thread.pp.ml", line 1:
- Alert deprecated: wait_timed_write
- Use Unix.select instead.
- File "thread.mli", lines 99-100, characters 0-47:
-   Definition
- File "core_thread/src/core_thread.mli", line 66, characters 0-55:
-   Expected signature
- (cd _build/default && /home/opam/.opam/5.0+alpha-repo/bin/ocamlc.opt -w -40 -g -bin-annot -I core_unix/src/.core_unix.objs/byte -I /home/opam/.opam/5.0+alpha-repo/lib/base -I /home/opam/.opam/5.0+alpha-repo/lib/base/base_internalhash_types -I /home/opam/.opam/5.0+alpha-repo/lib/base/caml -I /home/opam/.opam/5.0+alpha-repo/lib/base/md5 -I /home/opam/.opam/5.0+alpha-repo/lib/base/shadow_stdlib -I /home/opam/.opam/5.0+alpha-repo/lib/base_bigstring -I /home/opam/.opam/5.0+alpha-repo/lib/base_quickcheck -I /home/opam/.opam/5.0+alpha-repo/lib/base_quickcheck/ppx_quickcheck/runtime -I /home/opam/.opam/5.0+alpha-repo/lib/bin_prot -I /home/opam/.opam/5.0+alpha-repo/lib/bin_prot/shape -I /home/opam/.opam/5.0+alpha-repo/lib/core -I /home/opam/.opam/5.0+alpha-repo/lib/core/base_for_tests -I /home/opam/.opam/5.0+alpha-repo/lib/core/validate -I /home/opam/.opam/5.0+alpha-repo/lib/core_kernel/caml_threads -I /home/opam/.opam/5.0+alpha-repo/lib/core_kernel/caml_unix -I /home/opam/.opam/5.0+alpha-repo/lib/core_kernel/flags -I /home/opam/.opam/5.0+alpha-repo/lib/fieldslib -I /home/opam/.opam/5.0+alpha-repo/lib/int_repr -I /home/opam/.opam/5.0+alpha-repo/lib/jane-street-headers -I /home/opam/.opam/5.0+alpha-repo/lib/ocaml/threads -I /home/opam/.opam/5.0+alpha-repo/lib/ocaml/unix -I /home/opam/.opam/5.0+alpha-repo/lib/parsexp -I /home/opam/.opam/5.0+alpha-repo/lib/ppx_assert/runtime-lib -I /home/opam/.opam/5.0+alpha-repo/lib/ppx_bench/runtime-lib -I /home/opam/.opam/5.0+alpha-repo/lib/ppx_compare/runtime-lib -I /home/opam/.opam/5.0+alpha-repo/lib/ppx_enumerate/runtime-lib -I /home/opam/.opam/5.0+alpha-repo/lib/ppx_expect/collector -I /home/opam/.opam/5.0+alpha-repo/lib/ppx_expect/common -I /home/opam/.opam/5.0+alpha-repo/lib/ppx_expect/config -I /home/opam/.opam/5.0+alpha-repo/lib/ppx_expect/config_types -I /home/opam/.opam/5.0+alpha-repo/lib/ppx_hash/runtime-lib -I /home/opam/.opam/5.0+alpha-repo/lib/ppx_here/runtime-lib -I /home/opam/.opam/5.0+alpha-repo/lib/ppx_inline_test/config -I /home/opam/.opam/5.0+alpha-repo/lib/ppx_inline_test/runtime-lib -I /home/opam/.opam/5.0+alpha-repo/lib/ppx_log/types -I /home/opam/.opam/5.0+alpha-repo/lib/ppx_module_timer/runtime -I /home/opam/.opam/5.0+alpha-repo/lib/ppx_sexp_conv/runtime-lib -I /home/opam/.opam/5.0+alpha-repo/lib/sexplib -I /home/opam/.opam/5.0+alpha-repo/lib/sexplib/unix -I /home/opam/.opam/5.0+alpha-repo/lib/sexplib0 -I /home/opam/.opam/5.0+alpha-repo/lib/spawn -I /home/opam/.opam/5.0+alpha-repo/lib/splittable_random -I /home/opam/.opam/5.0+alpha-repo/lib/stdio -I /home/opam/.opam/5.0+alpha-repo/lib/time_now -I /home/opam/.opam/5.0+alpha-repo/lib/typerep -I /home/opam/.opam/5.0+alpha-repo/lib/variantslib -I error_checking_mutex/src/.error_checking_mutex.objs/byte -I signal_unix/src/.signal_unix.objs/byte -intf-suffix .ml -no-alias-deps -open Core_unix__ -o core_unix/src/.core_unix.objs/byte/core_unix.cmo -c -impl core_unix/src/core_unix.pp.ml)
- File "core_unix/src/core_unix.ml", lines 2665-2672, characters 0-17:
- 2665 | type socket_int_option = Unix.socket_int_option =
- 2666 |   | SO_SNDBUF
- 2667 |   | SO_RCVBUF
- 2668 |   | SO_ERROR
- 2669 |   | SO_TYPE
- 2670 |   | SO_RCVLOWAT
- 2671 |   | SO_SNDLOWAT
- 2672 | [@@deriving sexp]
- Alert deprecated: SO_ERROR
- Use Unix.getsockopt_error instead.
- File "unixLabels.mli", lines 1552-1553, characters 2-60:
-   Definition
- File "core_unix/src/core_unix.ml", line 2668, characters 2-12:
- 2668 |   | SO_ERROR
-          ^^^^^^^^^^
-   Expected signature
- (cd _build/default && /home/opam/.opam/5.0+alpha-repo/bin/ocamlopt.opt -w -40 -g -I core_unix/src/.core_unix.objs/byte -I core_unix/src/.core_unix.objs/native -I /home/opam/.opam/5.0+alpha-repo/lib/base -I /home/opam/.opam/5.0+alpha-repo/lib/base/base_internalhash_types -I /home/opam/.opam/5.0+alpha-repo/lib/base/caml -I /home/opam/.opam/5.0+alpha-repo/lib/base/md5 -I /home/opam/.opam/5.0+alpha-repo/lib/base/shadow_stdlib -I /home/opam/.opam/5.0+alpha-repo/lib/base_bigstring -I /home/opam/.opam/5.0+alpha-repo/lib/base_quickcheck -I /home/opam/.opam/5.0+alpha-repo/lib/base_quickcheck/ppx_quickcheck/runtime -I /home/opam/.opam/5.0+alpha-repo/lib/bin_prot -I /home/opam/.opam/5.0+alpha-repo/lib/bin_prot/shape -I /home/opam/.opam/5.0+alpha-repo/lib/core -I /home/opam/.opam/5.0+alpha-repo/lib/core/base_for_tests -I /home/opam/.opam/5.0+alpha-repo/lib/core/validate -I /home/opam/.opam/5.0+alpha-repo/lib/core_kernel/caml_threads -I /home/opam/.opam/5.0+alpha-repo/lib/core_kernel/caml_unix -I /home/opam/.opam/5.0+alpha-repo/lib/core_kernel/flags -I /home/opam/.opam/5.0+alpha-repo/lib/fieldslib -I /home/opam/.opam/5.0+alpha-repo/lib/int_repr -I /home/opam/.opam/5.0+alpha-repo/lib/jane-street-headers -I /home/opam/.opam/5.0+alpha-repo/lib/ocaml/threads -I /home/opam/.opam/5.0+alpha-repo/lib/ocaml/unix -I /home/opam/.opam/5.0+alpha-repo/lib/parsexp -I /home/opam/.opam/5.0+alpha-repo/lib/ppx_assert/runtime-lib -I /home/opam/.opam/5.0+alpha-repo/lib/ppx_bench/runtime-lib -I /home/opam/.opam/5.0+alpha-repo/lib/ppx_compare/runtime-lib -I /home/opam/.opam/5.0+alpha-repo/lib/ppx_enumerate/runtime-lib -I /home/opam/.opam/5.0+alpha-repo/lib/ppx_expect/collector -I /home/opam/.opam/5.0+alpha-repo/lib/ppx_expect/common -I /home/opam/.opam/5.0+alpha-repo/lib/ppx_expect/config -I /home/opam/.opam/5.0+alpha-repo/lib/ppx_expect/config_types -I /home/opam/.opam/5.0+alpha-repo/lib/ppx_hash/runtime-lib -I /home/opam/.opam/5.0+alpha-repo/lib/ppx_here/runtime-lib -I /home/opam/.opam/5.0+alpha-repo/lib/ppx_inline_test/config -I /home/opam/.opam/5.0+alpha-repo/lib/ppx_inline_test/runtime-lib -I /home/opam/.opam/5.0+alpha-repo/lib/ppx_log/types -I /home/opam/.opam/5.0+alpha-repo/lib/ppx_module_timer/runtime -I /home/opam/.opam/5.0+alpha-repo/lib/ppx_sexp_conv/runtime-lib -I /home/opam/.opam/5.0+alpha-repo/lib/sexplib -I /home/opam/.opam/5.0+alpha-repo/lib/sexplib/unix -I /home/opam/.opam/5.0+alpha-repo/lib/sexplib0 -I /home/opam/.opam/5.0+alpha-repo/lib/spawn -I /home/opam/.opam/5.0+alpha-repo/lib/splittable_random -I /home/opam/.opam/5.0+alpha-repo/lib/stdio -I /home/opam/.opam/5.0+alpha-repo/lib/time_now -I /home/opam/.opam/5.0+alpha-repo/lib/typerep -I /home/opam/.opam/5.0+alpha-repo/lib/variantslib -I error_checking_mutex/src/.error_checking_mutex.objs/byte -I error_checking_mutex/src/.error_checking_mutex.objs/native -I signal_unix/src/.signal_unix.objs/byte -I signal_unix/src/.signal_unix.objs/native -intf-suffix .ml -no-alias-deps -open Core_unix__ -o core_unix/src/.core_unix.objs/native/core_unix.cmx -c -impl core_unix/src/core_unix.pp.ml)
- File "core_unix/src/core_unix.ml", lines 2665-2672, characters 0-17:
- 2665 | type socket_int_option = Unix.socket_int_option =
- 2666 |   | SO_SNDBUF
- 2667 |   | SO_RCVBUF
- 2668 |   | SO_ERROR
- 2669 |   | SO_TYPE
- 2670 |   | SO_RCVLOWAT
- 2671 |   | SO_SNDLOWAT
- 2672 | [@@deriving sexp]
- Alert deprecated: SO_ERROR
- Use Unix.getsockopt_error instead.
- File "unixLabels.mli", lines 1552-1553, characters 2-60:
-   Definition
- File "core_unix/src/core_unix.ml", line 2668, characters 2-12:
- 2668 |   | SO_ERROR
-          ^^^^^^^^^^
-   Expected signature
-> compiled  core_unix.v0.15.0.1~alpha-repo
Processing 258/268: [async_rpc_kernel: dune build]
-> installed core_unix.v0.15.0.1~alpha-repo
Processing 259/268: [async_rpc_kernel: dune build]
Processing 260/268: [async_rpc_kernel: dune build] [async_unix: dune build]
Processing 261/268: [async_rpc_kernel: dune build] [async_unix: dune build] [textutils: dune build]
+ /home/opam/.opam/opam-init/hooks/sandbox.sh "build" "dune" "build" "-p" "async_rpc_kernel" "-j" "31" (CWD=/home/opam/.opam/5.0+alpha-repo/.opam-switch/build/async_rpc_kernel.v0.15.0)
-> compiled  async_rpc_kernel.v0.15.0
Processing 261/268: [async_unix: dune build] [textutils: dune build]
-> installed async_rpc_kernel.v0.15.0
Processing 262/268: [async_unix: dune build] [textutils: dune build]
+ /home/opam/.opam/opam-init/hooks/sandbox.sh "build" "dune" "build" "-p" "textutils" "-j" "31" (CWD=/home/opam/.opam/5.0+alpha-repo/.opam-switch/build/textutils.v0.15.0)
-> compiled  textutils.v0.15.0
Processing 262/268: [async_unix: dune build]
-> installed textutils.v0.15.0
Processing 263/268: [async_unix: dune build]
+ /home/opam/.opam/opam-init/hooks/sandbox.sh "build" "dune" "build" "-p" "async_unix" "-j" "31" (CWD=/home/opam/.opam/5.0+alpha-repo/.opam-switch/build/async_unix.v0.15.0)
-> compiled  async_unix.v0.15.0
-> installed async_unix.v0.15.0
Processing 265/268: [async: dune build]
+ /home/opam/.opam/opam-init/hooks/sandbox.sh "build" "dune" "build" "-p" "async" "-j" "31" (CWD=/home/opam/.opam/5.0+alpha-repo/.opam-switch/build/async.v0.15.0)
-> compiled  async.v0.15.0
-> installed async.v0.15.0

#=== ERROR while installing xml-light.2.4 =====================================#
# context              2.2.0~alpha~dev | linux/x86_64 | ocaml-variants.5.0.0+trunk | file:///home/opam/opam-repository
# path                 ~/.opam/5.0+alpha-repo/.opam-switch/build/xml-light.2.4
# command              ~/.opam/opam-init/hooks/sandbox.sh install make install_ocamlfind
# exit-code            2
# env-file             ~/.opam/log/xml-light-9-8b0581.env
# output-file          ~/.opam/log/xml-light-9-8b0581.out
### output ###
# ocamlyacc xml_parser.mly
# ocamlc  xml.mli
# ocamlc  dtd.mli
# ocamlc  xml_parser.mli
# ocamlc  -c xml_parser.ml
# ocamllex xml_lexer.mll
# 248 states, 1238 transitions, table size 6440 bytes
# ocamlc  xml_lexer.mli
# ocamlc  -c xml_lexer.ml
# File "xml_lexer.mll", line 279, characters 25-41:
# Error: Unbound value String.lowercase
# make: *** [Makefile:102: xml_lexer.cmo] Error 2



<><> Error report <><><><><><><><><><><><><><><><><><><><><><><><><><><><><><><>
+- The following actions were aborted
| - install amqp-client-async 2.2.2
+- 
+- The following actions failed
| - install xml-light 2.4
+- 
+- The following changes have been performed (the rest was aborted)
| - install amqp-client                 2.2.2
| - install angstrom                    0.15.0
| - install async                       v0.15.0
| - install async_kernel                v0.15.0
| - install async_rpc_kernel            v0.15.0
| - install async_unix                  v0.15.0
| - install base                        v0.15.1~5.0preview
| - install base-bytes                  base
| - install base_bigstring              v0.15.0
| - install base_quickcheck             v0.15.0
| - install bigstringaf                 0.9.0
| - install bin_prot                    v0.15.0
| - install conf-pkg-config             2
| - install core                        v0.15.0.1~alpha-repo
| - install core_kernel                 v0.15.0
| - install core_unix                   v0.15.0.1~alpha-repo
| - install cppo                        1.6.9
| - install csexp                       1.5.1
| - install dune                        3.4.1
| - install dune-configurator           3.4.1
| - install expect_test_helpers_core    v0.15.0
| - install ezxmlm                      1.1.0
| - install fieldslib                   v0.15.0
| - install int_repr                    v0.15.0
| - install jane-street-headers         v0.15.0
| - install jst-config                  v0.15.1
| - install num                         1.4
| - install ocaml-compiler-libs         v0.12.4
| - install ocaml-syntax-shims          1.0.0
| - install ocaml_intrinsics            v0.15.2
| - install ocamlbuild                  0.14.1
| - install ocamlfind                   1.9.5
| - install ocplib-endian               1.2
| - install parsexp                     v0.15.0
| - install ppx_assert                  v0.15.0
| - install ppx_base                    v0.15.0
| - install ppx_bench                   v0.15.0
| - install ppx_bin_prot                v0.15.0
| - install ppx_cold                    v0.15.0
| - install ppx_compare                 v0.15.0
| - install ppx_custom_printf           v0.15.0
| - install ppx_derivers                1.2.1
| - install ppx_disable_unused_warnings v0.15.0
| - install ppx_enumerate               v0.15.0
| - install ppx_expect                  v0.15.0.1~alpha-repo
| - install ppx_fields_conv             v0.15.0
| - install ppx_fixed_literal           v0.15.0
| - install ppx_hash                    v0.15.0
| - install ppx_here                    v0.15.0
| - install ppx_ignore_instrumentation  v0.15.0
| - install ppx_inline_test             v0.15.0
| - install ppx_jane                    v0.15.0
| - install ppx_let                     v0.15.0
| - install ppx_log                     v0.15.0
| - install ppx_module_timer            v0.15.0
| - install ppx_optcomp                 v0.15.0
| - install ppx_optional                v0.15.0
| - install ppx_pipebang                v0.15.0
| - install ppx_sexp_conv               v0.15.1
| - install ppx_sexp_message            v0.15.0
| - install ppx_sexp_value              v0.15.0
| - install ppx_stable                  v0.15.0
| - install ppx_string                  v0.15.0
| - install ppx_typerep_conv            v0.15.0
| - install ppx_variants_conv           v0.15.0
| - install ppxlib                      0.27.0
| - install protocol_version_header     v0.15.0
| - install re                          1.10.4
| - install result                      1.5
| - install seq                         base
| - install sexp_pretty                 v0.15.0.1~alpha-repo
| - install sexplib                     v0.15.1
| - install sexplib0                    v0.15.1
| - install spawn                       v0.15.1
| - install splittable_random           v0.15.0
| - install stdio                       v0.15.0
| - install stdlib-shims                0.3.0
| - install stringext                   1.6.0
| - install textutils                   v0.15.0
| - install textutils_kernel            v0.15.0
| - install time_now                    v0.15.0
| - install timezone                    v0.15.0
| - install topkg                       1.0.5
| - install typerep                     v0.15.0
| - install uri                         4.2.0
| - install uutf                        1.0.3
| - install variantslib                 v0.15.0
| - install xmlm                        1.4.0
+- 
# Run eval $(opam env) to update the current shell environment

The former state can be restored with:
    /usr/bin/opam switch import "/home/opam/.opam/5.0+alpha-repo/.opam-switch/backup/state-20220902114411.export"
'opam install -vy amqp-client-async.2.2.2' failed.
"/bin/bash" "-c"
"
opam remove -y "amqp-client-async.2.2.2"
opam install -vy "amqp-client-async.2.2.2"
res=$?
if [ $res = 31 ]; then
    if opam show -f x-ci-accept-failures: "amqp-client-async.2.2.2" | grep -q '"debian-unstable"'; then
        echo "This package failed and has been disabled for CI using the 'x-ci-accept-failures' field."
        exit 69
    fi
fi


exit $res
" failed with exit status 31
Failed: Build failed