OCamllabs icon Home|Differences with the last checks|Previous runs


Building on x86-bm-6.ocamllabs.io

(from ocaml/opam:debian-unstable@sha256:a20618cee40a09b4c7604919411db28c4ae473b9780730085f91824e8dd5f205)
2022-09-02 11:28.57 ---> using "00583e82ec888c922d57db664b8acb62b642829c5a4a94b17a44e5693b1db2de" from cache

/: (user (uid 1000) (gid 1000))

/: (env OPAMPRECISETRACKING 1)

/: (env OPAMUTF8 never)

/: (env OPAMEXTERNALSOLVER builtin-0install)

/: (env OPAMCRITERIA +removed)

/: (run (shell "sudo ln -f /usr/bin/opam-dev /usr/bin/opam"))
2022-09-02 11:28.57 ---> using "f816199fc982412d3ea70ae1ae1bab135eea82bc7670ac5d731bc57d0733e3c4" from cache

/: (run (network host)
        (shell "rm -rf ~/opam-repository && git clone -q 'https://github.com/ocaml/opam-repository' ~/opam-repository && git -C ~/opam-repository checkout -q 418227c38ed4e28a0827786e5e9e50b9547c0b27"))
2022-09-02 11:28.57 ---> using "4cabcce7a0cb6de31986471b51abc9f1f3fec6a75be6e83e549da867c7605e5a" from cache

/: (run (shell "rm -rf ~/.opam && opam init -ya --bare --config ~/.opamrc-sandbox ~/opam-repository"))
Configuring from /home/opam/.opamrc-sandbox, then /home/opam/.opamrc, and finally from built-in defaults.
Checking for available remotes: rsync and local, git.
  - you won't be able to use mercurial repositories unless you install the hg command on your system.
  - you won't be able to use darcs repositories unless you install the darcs command on your system.


<><> Fetching repository information ><><><><><><><><><><><><><><><><><><><><><>
[default] Initialised

User configuration:
  ~/.profile is already up-to-date.
[NOTE] Make sure that ~/.profile is well sourced in your ~/.bashrc.

2022-09-02 11:28.57 ---> using "d451da695ab21573c7bdead4176eec083b0218f568c4ccf5f5b38b162d64d4d7" from cache

/: (run (cache (opam-archives (target /home/opam/.opam/download-cache)))
        (network host)
        (shell "opam switch create --repositories=default '4.09' '4.09.1'"))

<><> Installing new switch packages <><><><><><><><><><><><><><><><><><><><><><>
Switch invariant: ["ocaml-base-compiler" {= "4.09.1"} | "ocaml-system" {= "4.09.1"}]

<><> Processing actions <><><><><><><><><><><><><><><><><><><><><><><><><><><><>
-> installed base-bigarray.base
-> installed base-threads.base
-> installed base-unix.base
-> retrieved ocaml-base-compiler.4.09.1  (https://github.com/ocaml/ocaml/archive/4.09.1.tar.gz)
-> installed ocaml-base-compiler.4.09.1
-> installed ocaml-config.1
-> installed ocaml.4.09.1
Done.
# Run eval $(opam env --switch=4.09) to update the current shell environment
2022-09-02 11:28.57 ---> using "6ae44eda2d40b042b5058a752b0cc7277fe90db6f356e2baaad3cd08d0b0aed3" from cache

/: (run (network host)
        (shell "opam update --depexts"))
+ /usr/bin/sudo "apt-get" "update"
- Get:1 http://deb.debian.org/debian unstable InRelease [192 kB]
- Get:2 http://deb.debian.org/debian unstable/main amd64 Packages.diff/Index [63.6 kB]
- Get:3 http://deb.debian.org/debian unstable/main amd64 Packages T-2022-09-02-0804.09-F-2022-08-29-1405.22.pdiff [252 kB]
- Get:3 http://deb.debian.org/debian unstable/main amd64 Packages T-2022-09-02-0804.09-F-2022-08-29-1405.22.pdiff [252 kB]
- Fetched 508 kB in 2s (287 kB/s)
- Reading package lists...
- 
2022-09-02 11:28.57 ---> using "6c9005c49d6ac2c7d897e8ab081679aa78ba5691640ba7636637df5dd55a9103" from cache

/: (run (cache (opam-archives (target /home/opam/.opam/download-cache)))
        (network host)
        (shell  "\
               \nopam remove -y \"ahrocksdb.0.2.2\"\
               \nopam install -vy \"ahrocksdb.0.2.2\"\
               \nres=$?\
               \nif [ $res = 31 ]; then\
               \n    if opam show -f x-ci-accept-failures: \"ahrocksdb.0.2.2\" | grep -q '\"debian-unstable\"'; then\
               \n        echo \"This package failed and has been disabled for CI using the 'x-ci-accept-failures' field.\"\
               \n        exit 69\
               \n    fi\
               \nfi\
               \n\
               \n\
               \nexit $res\
               \n"))
Nothing to do.
[NOTE] ahrocksdb.0.2.2 is not installed.

The following actions will be performed:
=== install 14 packages
  - install ahrocksdb         0.2.2
  - install astring           0.8.5  [required by ahrocksdb]
  - install bigarray-compat   1.1.0  [required by ctypes]
  - install conf-rocksdb      1      [required by ahrocksdb]
  - install csexp             1.5.1  [required by dune-configurator]
  - install ctypes            0.20.1 [required by ahrocksdb]
  - install dune              3.4.1  [required by ahrocksdb]
  - install dune-configurator 3.4.1  [required by ahrocksdb]
  - install integers          0.7.0  [required by ctypes]
  - install ocamlbuild        0.14.1 [required by astring, rresult]
  - install ocamlfind         1.9.5  [required by ctypes, astring, rresult]
  - install rresult           0.7.0  [required by ahrocksdb]
  - install stdlib-shims      0.3.0  [required by integers]
  - install topkg             1.0.5  [required by astring, rresult]

The following system packages will first need to be installed:
    librocksdb-dev

<><> Handling external dependencies <><><><><><><><><><><><><><><><><><><><><><>

opam believes some required external dependencies are missing. opam can:
> 1. Run apt-get to install them (may need root/sudo access)
  2. Display the recommended apt-get command and wait while you run it manually (e.g. in another terminal)
  3. Attempt installation anyway, and permanently register that this external dependency is present, but not detectable
  4. Abort the installation

[1/2/3/4] 1
+ /usr/bin/sudo "apt-get" "install" "-qq" "-yy" "librocksdb-dev"
- debconf: delaying package configuration, since apt-utils is not installed
- Selecting previously unselected package bzip2-doc.
- (Reading database ... 
(Reading database ... 5%
(Reading database ... 10%
(Reading database ... 15%
(Reading database ... 20%
(Reading database ... 25%
(Reading database ... 30%
(Reading database ... 35%
(Reading database ... 40%
(Reading database ... 45%
(Reading database ... 50%
(Reading database ... 55%
(Reading database ... 60%
(Reading database ... 65%
(Reading database ... 70%
(Reading database ... 75%
(Reading database ... 80%
(Reading database ... 85%
(Reading database ... 90%
(Reading database ... 95%
(Reading database ... 100%
(Reading database ... 19664 files and directories currently installed.)
- Preparing to unpack .../00-bzip2-doc_1.0.8-5_all.deb ...
- Unpacking bzip2-doc (1.0.8-5) ...
- Selecting previously unselected package libbz2-dev:amd64.
- Preparing to unpack .../01-libbz2-dev_1.0.8-5_amd64.deb ...
- Unpacking libbz2-dev:amd64 (1.0.8-5) ...
- Selecting previously unselected package libgflags2.2.
- Preparing to unpack .../02-libgflags2.2_2.2.2-2_amd64.deb ...
- Unpacking libgflags2.2 (2.2.2-2) ...
- Selecting previously unselected package libgflags-dev.
- Preparing to unpack .../03-libgflags-dev_2.2.2-2_amd64.deb ...
- Unpacking libgflags-dev (2.2.2-2) ...
- Selecting previously unselected package liblz4-dev:amd64.
- Preparing to unpack .../04-liblz4-dev_1.9.4-1_amd64.deb ...
- Unpacking liblz4-dev:amd64 (1.9.4-1) ...
- Selecting previously unselected package libsnappy1v5:amd64.
- Preparing to unpack .../05-libsnappy1v5_1.1.9-2_amd64.deb ...
- Unpacking libsnappy1v5:amd64 (1.1.9-2) ...
- Selecting previously unselected package librocksdb7.3.
- Preparing to unpack .../06-librocksdb7.3_7.3.1-2_amd64.deb ...
- Unpacking librocksdb7.3 (7.3.1-2) ...
- Selecting previously unselected package libsnappy-dev:amd64.
- Preparing to unpack .../07-libsnappy-dev_1.1.9-2_amd64.deb ...
- Unpacking libsnappy-dev:amd64 (1.1.9-2) ...
- Selecting previously unselected package zlib1g-dev:amd64.
- Preparing to unpack .../08-zlib1g-dev_1%3a1.2.11.dfsg-4.1_amd64.deb ...
- Unpacking zlib1g-dev:amd64 (1:1.2.11.dfsg-4.1) ...
- Selecting previously unselected package libzstd-dev:amd64.
- Preparing to unpack .../09-libzstd-dev_1.5.2+dfsg-1_amd64.deb ...
- Unpacking libzstd-dev:amd64 (1.5.2+dfsg-1) ...
- Selecting previously unselected package librocksdb-dev.
- Preparing to unpack .../10-librocksdb-dev_7.3.1-2_amd64.deb ...
- Unpacking librocksdb-dev (7.3.1-2) ...
- Setting up bzip2-doc (1.0.8-5) ...
- Setting up libzstd-dev:amd64 (1.5.2+dfsg-1) ...
- Setting up libsnappy1v5:amd64 (1.1.9-2) ...
- Setting up liblz4-dev:amd64 (1.9.4-1) ...
- Setting up zlib1g-dev:amd64 (1:1.2.11.dfsg-4.1) ...
- Setting up libgflags2.2 (2.2.2-2) ...
- Setting up libbz2-dev:amd64 (1.0.8-5) ...
- Setting up librocksdb7.3 (7.3.1-2) ...
- Setting up libsnappy-dev:amd64 (1.1.9-2) ...
- Setting up libgflags-dev (2.2.2-2) ...
- Setting up librocksdb-dev (7.3.1-2) ...
- Processing triggers for libc-bin (2.34-7) ...

<><> Processing actions <><><><><><><><><><><><><><><><><><><><><><><><><><><><>
Processing  1/41: [ahrocksdb.0.2.2: http]
Processing  2/41: [ahrocksdb.0.2.2: http]
Processing  3/41: [ahrocksdb.0.2.2: http]
-> retrieved bigarray-compat.1.1.0  (cached)
Processing  4/41: [ahrocksdb.0.2.2: http]
Processing  5/41: [ahrocksdb.0.2.2: http]
Processing  6/41: [ahrocksdb.0.2.2: http] [conf-rocksdb: cc main.c]
-> retrieved csexp.1.5.1  (cached)
Processing  7/41: [ahrocksdb.0.2.2: http] [conf-rocksdb: cc main.c]
-> retrieved astring.0.8.5  (cached)
Processing  8/41: [ahrocksdb.0.2.2: http] [conf-rocksdb: cc main.c]
-> retrieved ctypes.0.20.1  (cached)
Processing  9/41: [ahrocksdb.0.2.2: http] [conf-rocksdb: cc main.c]
-> retrieved integers.0.7.0  (cached)
Processing 10/41: [ahrocksdb.0.2.2: http] [conf-rocksdb: cc main.c]
+ /home/opam/.opam/opam-init/hooks/sandbox.sh "build" "cc" "-lrocksdb" "main.c" (CWD=/home/opam/.opam/4.09/.opam-switch/build/conf-rocksdb.1)
-> compiled  conf-rocksdb.1
Processing 10/41: [ahrocksdb.0.2.2: http]
-> installed conf-rocksdb.1
Processing 11/41: [ahrocksdb.0.2.2: http]
-> retrieved ocamlbuild.0.14.1  (cached)
Processing 12/41: [ahrocksdb.0.2.2: http]
Processing 13/41: [ahrocksdb.0.2.2: http] [ocamlbuild: make configure.make]
-> retrieved ocamlfind.1.9.5  (cached)
Processing 14/41: [ahrocksdb.0.2.2: http] [ocamlbuild: make configure.make]
[ocamlfind: patch] applying 0001-Fix-bug-when-installing-with-a-system-compiler.patch
Processing 15/41: [ahrocksdb.0.2.2: http] [ocamlbuild: make configure.make] [ocamlfind: patch]
-> retrieved rresult.0.7.0  (cached)
Processing 16/41: [ahrocksdb.0.2.2: http] [ocamlbuild: make configure.make] [ocamlfind: patch]
Processing 16/41: [ahrocksdb.0.2.2: http] [ocamlbuild: make configure.make] [ocamlfind: ./configure]
-> retrieved stdlib-shims.0.3.0  (cached)
Processing 17/41: [ahrocksdb.0.2.2: http] [ocamlbuild: make configure.make] [ocamlfind: ./configure]
-> retrieved topkg.1.0.5  (cached)
+ /home/opam/.opam/opam-init/hooks/sandbox.sh "build" "make" "-f" "configure.make" "all" "OCAMLBUILD_PREFIX=/home/opam/.opam/4.09" "OCAMLBUILD_BINDIR=/home/opam/.opam/4.09/bin" "OCAMLBUILD_LIBDIR=/home/opam/.opam/4.09/lib" "OCAMLBUILD_MANDIR=/home/opam/.opam/4.09/man" "OCAML_NATIVE=true" "OCAML_NATIVE_TOOLS=true" (CWD=/home/opam/.opam/4.09/.opam-switch/build/ocamlbuild.0.14.1)
- (echo "# This file was generated from configure.make"; \
- echo ;\
- echo "OCAML_PREFIX="; \
- echo "OCAML_BINDIR=/home/opam/.opam/4.09/bin"; \
- echo "OCAML_LIBDIR=/home/opam/.opam/4.09/lib/ocaml"; \
- echo "OCAML_MANDIR=/home/opam/.opam/4.09/man"; \
- echo ;\
- echo "EXT_OBJ=.o"; \
- echo "EXT_ASM=.s"; \
- echo "EXT_LIB=.a"; \
- echo "EXT_DLL=.so"; \
- echo "EXE="; \
- echo ;\
- echo "OCAML_NATIVE=true"; \
- echo "OCAML_NATIVE_TOOLS=true"; \
- echo "NATDYNLINK=true"; \
- echo "SUPPORT_SHARED_LIBRARIES=true"; \
- echo ;\
- echo "PREFIX=/home/opam/.opam/4.09"; \
- echo "BINDIR=/home/opam/.opam/4.09/bin"; \
- echo "LIBDIR=/home/opam/.opam/4.09/lib"; \
- echo "MANDIR=/home/opam/.opam/4.09/man"; \
- ) > Makefile.config
- (echo "(* This file was generated from ../configure.make *)"; \
- echo ;\
- echo 'let bindir = "/home/opam/.opam/4.09/bin"'; \
- echo 'let libdir = "/home/opam/.opam/4.09/lib"'; \
- echo 'let ocaml_libdir = "/home/opam/.opam/4.09/lib/ocaml"'; \
- echo 'let libdir_abs = "/home/opam/.opam/4.09/lib"'; \
- echo 'let ocaml_native = true'; \
- echo 'let ocaml_native_tools = true'; \
- echo 'let supports_shared_libraries = true';\
- echo 'let a = "a"'; \
- echo 'let o = "o"'; \
- echo 'let so = "so"'; \
- echo 'let ext_dll = ".so"'; \
- echo 'let exe = ""'; \
- echo 'let version = "0.14.1"'; \
- ) > src/ocamlbuild_config.ml
Processing 17/41: [ahrocksdb.0.2.2: http] [ocamlbuild: make check-if-preinstalled] [ocamlfind: ./configure]
Processing 17/41: [ocamlbuild: make check-if-preinstalled] [ocamlfind: ./configure]
-> retrieved dune.3.4.1, dune-configurator.3.4.1  (cached)
Processing 18/41: [dune: ocaml bootstrap.ml] [ocamlbuild: make check-if-preinstalled] [ocamlfind: ./configure]
+ /home/opam/.opam/opam-init/hooks/sandbox.sh "build" "./configure" "-bindir" "/home/opam/.opam/4.09/bin" "-sitelib" "/home/opam/.opam/4.09/lib" "-mandir" "/home/opam/.opam/4.09/man" "-config" "/home/opam/.opam/4.09/lib/findlib.conf" "-no-custom" "-no-camlp4" (CWD=/home/opam/.opam/4.09/.opam-switch/build/ocamlfind.1.9.5)
- Welcome to findlib version 1.9.5
- Configuring core...
- Checking for #remove_directory...
- Testing threading model...
- systhread_supported: true
- Testing DLLs...
- Testing whether ppxopt can be supported...
- Checking for ocamlc -opaque...
- Querying installation: META list not found
- make install will double-check installed META files
- Configuring libraries...
- unix: found
- dynlink: found
- bigarray: found
- compiler-libs: found
- dbm: not present (normal since 4.00)
- graphics: not present (normal since 4.09)
- num: not present (normal since 4.06)
- ocamlbuild: not present (normal since 4.03)
- ocamldoc: found (in +ocamldoc)
- raw_spacetime: found
- threads: found (in +threads)
- runtime_events: not present
- str: found
- labltk: not present (normal since 4.02)
- native dynlink: found
- camlp4: disabled
- bytes: found, installing fake library
- Configuration for stdlib written to site-lib-src/stdlib/META
- Configuration for unix written to site-lib-src/unix/META
- Configuration for dynlink written to site-lib-src/dynlink/META
- Configuration for bigarray written to site-lib-src/bigarray/META
- Configuration for compiler-libs written to site-lib-src/compiler-libs/META
- Configuration for ocamldoc written to site-lib-src/ocamldoc/META
- Configuration for raw_spacetime written to site-lib-src/raw_spacetime/META
- Configuration for threads written to site-lib-src/threads/META
- Configuration for str written to site-lib-src/str/META
- Configuration for bytes written to site-lib-src/bytes/META
- Detecting compiler arguments: (extractor built) ok
- 
- About the OCAML core installation:
-     Standard library:      /home/opam/.opam/4.09/lib/ocaml
-     Binaries:              /home/opam/.opam/4.09/bin
-     Manual pages:          /home/opam/.opam/4.09/man
-     Multi-threading type:  posix
- The directory of site-specific packages will be
-     site-lib:              /home/opam/.opam/4.09/lib
- The configuration file is written to:
-     findlib config file:   /home/opam/.opam/4.09/lib/findlib.conf
- Software will be installed:
-     Libraries:             in <site-lib>/findlib
-     Binaries:              /home/opam/.opam/4.09/bin
-     Manual pages:          /home/opam/.opam/4.09/man
-     topfind script:        /home/opam/.opam/4.09/lib/ocaml
- Topfind ppxopt support:    yes
- Toolbox:                   no
- Link custom runtime:       no
- Need bytes compatibility:  no
- 
- Configuration has been written to Makefile.config
- 
- You can now do 'make all', and optionally 'make opt', to build ocamlfind.
Processing 18/41: [dune: ocaml bootstrap.ml] [ocamlbuild: make check-if-preinstalled] [ocamlfind: make all]
-> retrieved ahrocksdb.0.2.2  (https://github.com/ahrefs/ocaml-ahrocksdb/releases/download/0.2.2/ahrocksdb-0.2.2.tbz)
+ /home/opam/.opam/opam-init/hooks/sandbox.sh "build" "make" "all" (CWD=/home/opam/.opam/4.09/.opam-switch/build/ocamlfind.1.9.5)
- for p in findlib; do ( cd src/$p; make all ) || exit; done
- make[1]: Entering directory '/home/opam/.opam/4.09/.opam-switch/build/ocamlfind.1.9.5/src/findlib'
- ocamllex fl_meta.mll
- 22 states, 392 transitions, table size 1700 bytes
- USE_CYGPATH="0"; \
- export USE_CYGPATH; \
- cat findlib_config.mlp | \
-          ../../tools/patch '@CONFIGFILE@' '/home/opam/.opam/4.09/lib/findlib.conf' | \
-          ../../tools/patch '@STDLIB@' '/home/opam/.opam/4.09/lib/ocaml' | \
- 	sed -e 's;@AUTOLINK@;true;g' \
- 	    -e 's;@SYSTEM@;linux;g' \
- 	     >findlib_config.ml
- if [ "true" = "true" ]; then                 \
- 	cp topfind.ml.in topfind.ml;                             \
- else                                                             \
- 	sed -e '/PPXOPT_BEGIN/,/PPXOPT_END/ d' topfind.ml.in     \
- 		> topfind.ml ;                                   \
- fi
- ocamldep *.ml *.mli >depend
- ocamlc -I +compiler-libs -opaque   -I +unix -I +dynlink -g -c findlib_config.ml
- ocamlc -I +compiler-libs -opaque   -I +unix -I +dynlink -g -c fl_split.ml
- ocamlc -I +compiler-libs -opaque   -I +unix -I +dynlink -g -c fl_metatoken.ml
- ocamlc -I +compiler-libs -opaque   -I +unix -I +dynlink -g -c fl_meta.ml
- ocamlc -I +compiler-libs -opaque   -I +unix -I +dynlink -c fl_metascanner.mli
- ocamlc -I +compiler-libs -opaque   -I +unix -I +dynlink -g -c fl_metascanner.ml
- ocamlc -I +compiler-libs -opaque   -I +unix -I +dynlink -c fl_topo.mli
- ocamlc -I +compiler-libs -opaque   -I +unix -I +dynlink -g -c fl_topo.ml
- ocamlc -I +compiler-libs -opaque   -I +unix -I +dynlink -c fl_package_base.mli
- ocamlc -I +compiler-libs -opaque   -I +unix -I +dynlink -g -c fl_package_base.ml
- ocamlc -I +compiler-libs -opaque   -I +unix -I +dynlink -c findlib.mli
- ocamlc -I +compiler-libs -opaque   -I +unix -I +dynlink -g -c findlib.ml
- ocamlc -I +compiler-libs -opaque   -I +unix -I +dynlink -g -c fl_args.ml
- ocamlc -I +compiler-libs -opaque   -I +unix -I +dynlink -g -c fl_lint.ml
- ocamlc -I +compiler-libs -a -o findlib.cma findlib_config.cmo fl_split.cmo fl_metatoken.cmo fl_meta.cmo fl_metascanner.cmo fl_topo.cmo fl_package_base.cmo findlib.cmo fl_args.cmo fl_lint.cmo
- ocamlc -I +compiler-libs -opaque   -I +unix -I +dynlink -g -c ocaml_args.ml
- ocamlc -I +compiler-libs -opaque   -I +unix -I +dynlink -g -c frontend.ml
- ocamlc -I +compiler-libs  -o ocamlfind -g findlib.cma unix.cma \
-            -I +unix -I +dynlink ocaml_args.cmo frontend.cmo
- ocamlc -I +compiler-libs -opaque   -I +unix -I +dynlink -c topfind.mli
- ocamlc -I +compiler-libs -opaque   -I +unix -I +dynlink -g -c topfind.ml
- ocamlc -I +compiler-libs -a -o findlib_top.cma topfind.cmo
- USE_CYGPATH="0"; \
- export USE_CYGPATH; \
- cat topfind_rd1.p | \
-          ../../tools/patch '@SITELIB@' '/home/opam/.opam/4.09/lib' \
-     	    >topfind
- ocamlc -I +compiler-libs -opaque   -I +unix -I +dynlink -c fl_dynload.mli
- ocamlc -I +compiler-libs -opaque   -I +unix -I +dynlink -g -c fl_dynload.ml
- ocamlc -I +compiler-libs -a -o findlib_dynload.cma fl_dynload.cmo
- make[1]: Leaving directory '/home/opam/.opam/4.09/.opam-switch/build/ocamlfind.1.9.5/src/findlib'
- make all-config
- make[1]: Entering directory '/home/opam/.opam/4.09/.opam-switch/build/ocamlfind.1.9.5'
- USE_CYGPATH="0"; \
- export USE_CYGPATH; \
- cat findlib.conf.in | \
-      tools/patch '@SITELIB@' '/home/opam/.opam/4.09/lib' >findlib.conf
- if ./tools/cmd_from_same_dir ocamlc; then \
- 	echo 'ocamlc="ocamlc.opt"' >>findlib.conf; \
- fi
- if ./tools/cmd_from_same_dir ocamlopt; then \
- 	echo 'ocamlopt="ocamlopt.opt"' >>findlib.conf; \
- fi
- if ./tools/cmd_from_same_dir ocamldep; then \
- 	echo 'ocamldep="ocamldep.opt"' >>findlib.conf; \
- fi
- if ./tools/cmd_from_same_dir ocamldoc; then \
- 	echo 'ocamldoc="ocamldoc.opt"' >>findlib.conf; \
- fi
- make[1]: Leaving directory '/home/opam/.opam/4.09/.opam-switch/build/ocamlfind.1.9.5'
Processing 18/41: [dune: ocaml bootstrap.ml] [ocamlbuild: make check-if-preinstalled] [ocamlfind: make opt]
+ /home/opam/.opam/opam-init/hooks/sandbox.sh "build" "make" "opt" (CWD=/home/opam/.opam/4.09/.opam-switch/build/ocamlfind.1.9.5)
- for p in findlib; do ( cd src/$p; make opt ) || exit; done
- make[1]: Entering directory '/home/opam/.opam/4.09/.opam-switch/build/ocamlfind.1.9.5/src/findlib'
- ocamlopt -I +compiler-libs -g -opaque  -I +unix -I +dynlink -c findlib_config.ml
- ocamlopt -I +compiler-libs -g -opaque  -I +unix -I +dynlink -c fl_split.ml
- ocamlopt -I +compiler-libs -g -opaque  -I +unix -I +dynlink -c fl_metatoken.ml
- ocamlopt -I +compiler-libs -g -opaque  -I +unix -I +dynlink -c fl_meta.ml
- ocamlopt -I +compiler-libs -g -opaque  -I +unix -I +dynlink -c fl_metascanner.ml
- ocamlopt -I +compiler-libs -g -opaque  -I +unix -I +dynlink -c fl_topo.ml
- ocamlopt -I +compiler-libs -g -opaque  -I +unix -I +dynlink -c fl_package_base.ml
- ocamlopt -I +compiler-libs -g -opaque  -I +unix -I +dynlink -c findlib.ml
- ocamlopt -I +compiler-libs -g -opaque  -I +unix -I +dynlink -c fl_args.ml
- ocamlopt -I +compiler-libs -g -opaque  -I +unix -I +dynlink -c fl_lint.ml
- ocamlopt -I +compiler-libs -g -a -o findlib.cmxa findlib_config.cmx fl_split.cmx fl_metatoken.cmx fl_meta.cmx fl_metascanner.cmx fl_topo.cmx fl_package_base.cmx findlib.cmx fl_args.cmx fl_lint.cmx
- if [ 1 -gt 0 ]; then \
-     ocamlopt -I +compiler-libs -g -shared -o findlib.cmxs findlib_config.cmx fl_split.cmx fl_metatoken.cmx fl_meta.cmx fl_metascanner.cmx fl_topo.cmx fl_package_base.cmx findlib.cmx fl_args.cmx fl_lint.cmx; \
- fi
- ocamlopt -I +compiler-libs -g -opaque  -I +unix -I +dynlink -c ocaml_args.ml
- ocamlopt -I +compiler-libs -g -opaque  -I +unix -I +dynlink -c frontend.ml
- ocamlopt -I +compiler-libs -g -o ocamlfind_opt findlib.cmxa unix.cmxa \
- 	   -I +unix -I +dynlink ocaml_args.cmx frontend.cmx
- ocamlopt -I +compiler-libs -g -opaque  -I +unix -I +dynlink -c topfind.ml
- File "_none_", line 1:
- Warning 58: no cmx file was found in path for module Topdirs, and its interface was not compiled with -opaque
- File "_none_", line 1:
- Warning 58: no cmx file was found in path for module Toploop, and its interface was not compiled with -opaque
- ocamlopt -I +compiler-libs -g -a -o findlib_top.cmxa topfind.cmx
- if [ 1 -gt 0 ]; then \
-     ocamlopt -I +compiler-libs -g -shared -o findlib_top.cmxs topfind.cmx; \
- fi
- ocamlopt -I +compiler-libs -g -opaque  -I +unix -I +dynlink -c fl_dynload.ml
- ocamlopt -I +compiler-libs -g -a -o findlib_dynload.cmxa fl_dynload.cmx
- if [ 1 -gt 0 ]; then \
-     ocamlopt -I +compiler-libs -g -shared -o findlib_dynload.cmxs fl_dynload.cmx; \
- fi
- make[1]: Leaving directory '/home/opam/.opam/4.09/.opam-switch/build/ocamlfind.1.9.5/src/findlib'
-> compiled  ocamlfind.1.9.5
Processing 18/41: [dune: ocaml bootstrap.ml] [ocamlbuild: make check-if-preinstalled]
Processing 19/41: [dune: ocaml bootstrap.ml] [ocamlbuild: make check-if-preinstalled] [ocamlfind: make install]
+ /home/opam/.opam/opam-init/hooks/sandbox.sh "build" "make" "check-if-preinstalled" "all" "opam-install" (CWD=/home/opam/.opam/4.09/.opam-switch/build/ocamlbuild.0.14.1)
- if test -d /home/opam/.opam/4.09/lib/ocaml/ocamlbuild; then\
-   >&2 echo "ERROR: Preinstalled ocamlbuild detected at"\
-        "/home/opam/.opam/4.09/lib/ocaml/ocamlbuild";\
-   >&2 echo "Installation aborted; if you want to bypass this"\
-         "safety check, pass CHECK_IF_PREINSTALLED=false to make";\
-   exit 2;\
- fi
- ocamlc.opt -w +L -w +R -w +Z -I src -I +unix -safe-string -bin-annot -strict-sequence -c src/const.ml
- ocamlc.opt -w +L -w +R -w +Z -I src -I +unix -safe-string -bin-annot -strict-sequence -c src/loc.mli
- ocamlc.opt -w +L -w +R -w +Z -I src -I +unix -safe-string -bin-annot -strict-sequence -c src/loc.ml
- ocamlc.opt -w +L -w +R -w +Z -I src -I +unix -safe-string -bin-annot -strict-sequence -c src/discard_printf.mli
- ocamlc.opt -w +L -w +R -w +Z -I src -I +unix -safe-string -bin-annot -strict-sequence -c src/discard_printf.ml
- ocamlc.opt -w +L -w +R -w +Z -I src -I +unix -safe-string -bin-annot -strict-sequence -c src/signatures.mli
- ocamlc.opt -w +L -w +R -w +Z -I src -I +unix -safe-string -bin-annot -strict-sequence -c src/my_std.mli
- ocamlc.opt -w +L -w +R -w +Z -I src -I +unix -safe-string -bin-annot -strict-sequence -c src/my_std.ml
- ocamlc.opt -w +L -w +R -w +Z -I src -I +unix -safe-string -bin-annot -strict-sequence -c src/my_unix.mli
- ocamlc.opt -w +L -w +R -w +Z -I src -I +unix -safe-string -bin-annot -strict-sequence -c src/my_unix.ml
- ocamlc.opt -w +L -w +R -w +Z -I src -I +unix -safe-string -bin-annot -strict-sequence -c src/tags.mli
- ocamlc.opt -w +L -w +R -w +Z -I src -I +unix -safe-string -bin-annot -strict-sequence -c src/tags.ml
- ocamlc.opt -w +L -w +R -w +Z -I src -I +unix -safe-string -bin-annot -strict-sequence -c src/display.mli
- ocamlc.opt -w +L -w +R -w +Z -I src -I +unix -safe-string -bin-annot -strict-sequence -c src/display.ml
- ocamlc.opt -w +L -w +R -w +Z -I src -I +unix -safe-string -bin-annot -strict-sequence -c src/log.mli
- ocamlc.opt -w +L -w +R -w +Z -I src -I +unix -safe-string -bin-annot -strict-sequence -c src/log.ml
- ocamlc.opt -w +L -w +R -w +Z -I src -I +unix -safe-string -bin-annot -strict-sequence -c src/shell.mli
- ocamlc.opt -w +L -w +R -w +Z -I src -I +unix -safe-string -bin-annot -strict-sequence -c src/shell.ml
- ocamlc.opt -w +L -w +R -w +Z -I src -I +unix -safe-string -bin-annot -strict-sequence -c src/bool.mli
- ocamlc.opt -w +L -w +R -w +Z -I src -I +unix -safe-string -bin-annot -strict-sequence -c src/bool.ml
- ocamlc.opt -w +L -w +R -w +Z -I src -I +unix -safe-string -bin-annot -strict-sequence -c src/glob_ast.mli
- ocamlc.opt -w +L -w +R -w +Z -I src -I +unix -safe-string -bin-annot -strict-sequence -c src/glob_ast.ml
- ocamllex.opt src/glob_lexer.mll
- 55 states, 419 transitions, table size 2006 bytes
- ocamlc.opt -w +L -w +R -w +Z -I src -I +unix -safe-string -bin-annot -strict-sequence -c src/glob_lexer.mli
- ocamlc.opt -w +L -w +R -w +Z -I src -I +unix -safe-string -bin-annot -strict-sequence -c src/glob_lexer.ml
- ocamlc.opt -w +L -w +R -w +Z -I src -I +unix -safe-string -bin-annot -strict-sequence -c src/glob.mli
- ocamlc.opt -w +L -w +R -w +Z -I src -I +unix -safe-string -bin-annot -strict-sequence -c src/glob.ml
- ocamllex.opt src/lexers.mll
- 251 states, 1051 transitions, table size 5710 bytes
- 4334 additional bytes used for bindings
- ocamlc.opt -w +L -w +R -w +Z -I src -I +unix -safe-string -bin-annot -strict-sequence -c src/lexers.mli
- ocamlc.opt -w +L -w +R -w +Z -I src -I +unix -safe-string -bin-annot -strict-sequence -c src/lexers.ml
- ocamlc.opt -w +L -w +R -w +Z -I src -I +unix -safe-string -bin-annot -strict-sequence -c src/param_tags.mli
- ocamlc.opt -w +L -w +R -w +Z -I src -I +unix -safe-string -bin-annot -strict-sequence -c src/param_tags.ml
- ocamlc.opt -w +L -w +R -w +Z -I src -I +unix -safe-string -bin-annot -strict-sequence -c src/command.mli
- ocamlc.opt -w +L -w +R -w +Z -I src -I +unix -safe-string -bin-annot -strict-sequence -c src/command.ml
- ocamlc.opt -w +L -w +R -w +Z -I src -I +unix -safe-string -bin-annot -strict-sequence -c src/ocamlbuild_config.ml
- ocamlc.opt -w +L -w +R -w +Z -I src -I +unix -safe-string -bin-annot -strict-sequence -c src/ocamlbuild_where.mli
- ocamlc.opt -w +L -w +R -w +Z -I src -I +unix -safe-string -bin-annot -strict-sequence -c src/ocamlbuild_where.ml
- ocamlc.opt -w +L -w +R -w +Z -I src -I +unix -safe-string -bin-annot -strict-sequence -c src/slurp.mli
- ocamlc.opt -w +L -w +R -w +Z -I src -I +unix -safe-string -bin-annot -strict-sequence -c src/slurp.ml
- ocamlc.opt -w +L -w +R -w +Z -I src -I +unix -safe-string -bin-annot -strict-sequence -c src/options.mli
- ocamlc.opt -w +L -w +R -w +Z -I src -I +unix -safe-string -bin-annot -strict-sequence -c src/options.ml
- ocamlc.opt -w +L -w +R -w +Z -I src -I +unix -safe-string -bin-annot -strict-sequence -c src/pathname.mli
- ocamlc.opt -w +L -w +R -w +Z -I src -I +unix -safe-string -bin-annot -strict-sequence -c src/pathname.ml
- ocamlc.opt -w +L -w +R -w +Z -I src -I +unix -safe-string -bin-annot -strict-sequence -c src/configuration.mli
- ocamlc.opt -w +L -w +R -w +Z -I src -I +unix -safe-string -bin-annot -strict-sequence -c src/configuration.ml
- ocamlc.opt -w +L -w +R -w +Z -I src -I +unix -safe-string -bin-annot -strict-sequence -c src/flags.mli
- ocamlc.opt -w +L -w +R -w +Z -I src -I +unix -safe-string -bin-annot -strict-sequence -c src/flags.ml
- ocamlc.opt -w +L -w +R -w +Z -I src -I +unix -safe-string -bin-annot -strict-sequence -c src/hygiene.mli
- ocamlc.opt -w +L -w +R -w +Z -I src -I +unix -safe-string -bin-annot -strict-sequence -c src/hygiene.ml
- ocamlc.opt -w +L -w +R -w +Z -I src -I +unix -safe-string -bin-annot -strict-sequence -c src/digest_cache.mli
- ocamlc.opt -w +L -w +R -w +Z -I src -I +unix -safe-string -bin-annot -strict-sequence -c src/digest_cache.ml
- ocamlc.opt -w +L -w +R -w +Z -I src -I +unix -safe-string -bin-annot -strict-sequence -c src/resource.mli
- ocamlc.opt -w +L -w +R -w +Z -I src -I +unix -safe-string -bin-annot -strict-sequence -c src/resource.ml
- ocamlc.opt -w +L -w +R -w +Z -I src -I +unix -safe-string -bin-annot -strict-sequence -c src/rule.mli
- ocamlc.opt -w +L -w +R -w +Z -I src -I +unix -safe-string -bin-annot -strict-sequence -c src/rule.ml
- ocamlc.opt -w +L -w +R -w +Z -I src -I +unix -safe-string -bin-annot -strict-sequence -c src/solver.mli
- ocamlc.opt -w +L -w +R -w +Z -I src -I +unix -safe-string -bin-annot -strict-sequence -c src/solver.ml
- ocamlc.opt -w +L -w +R -w +Z -I src -I +unix -safe-string -bin-annot -strict-sequence -c src/report.mli
- ocamlc.opt -w +L -w +R -w +Z -I src -I +unix -safe-string -bin-annot -strict-sequence -c src/report.ml
- ocamlc.opt -w +L -w +R -w +Z -I src -I +unix -safe-string -bin-annot -strict-sequence -c src/tools.mli
- ocamlc.opt -w +L -w +R -w +Z -I src -I +unix -safe-string -bin-annot -strict-sequence -c src/tools.ml
- ocamlc.opt -w +L -w +R -w +Z -I src -I +unix -safe-string -bin-annot -strict-sequence -c src/fda.mli
- ocamlc.opt -w +L -w +R -w +Z -I src -I +unix -safe-string -bin-annot -strict-sequence -c src/fda.ml
- ocamlc.opt -w +L -w +R -w +Z -I src -I +unix -safe-string -bin-annot -strict-sequence -c src/findlib.mli
- ocamlc.opt -w +L -w +R -w +Z -I src -I +unix -safe-string -bin-annot -strict-sequence -c src/findlib.ml
- ocamlc.opt -w +L -w +R -w +Z -I src -I +unix -safe-string -bin-annot -strict-sequence -c src/ocaml_arch.mli
- ocamlc.opt -w +L -w +R -w +Z -I src -I +unix -safe-string -bin-annot -strict-sequence -c src/ocaml_arch.ml
- ocamlc.opt -w +L -w +R -w +Z -I src -I +unix -safe-string -bin-annot -strict-sequence -c src/ocaml_utils.mli
- ocamlc.opt -w +L -w +R -w +Z -I src -I +unix -safe-string -bin-annot -strict-sequence -c src/ocaml_utils.ml
- ocamlc.opt -w +L -w +R -w +Z -I src -I +unix -safe-string -bin-annot -strict-sequence -c src/ocaml_dependencies.mli
- ocamlc.opt -w +L -w +R -w +Z -I src -I +unix -safe-string -bin-annot -strict-sequence -c src/ocaml_dependencies.ml
- ocamlc.opt -w +L -w +R -w +Z -I src -I +unix -safe-string -bin-annot -strict-sequence -c src/ocaml_compiler.mli
- ocamlc.opt -w +L -w +R -w +Z -I src -I +unix -safe-string -bin-annot -strict-sequence -c src/ocaml_compiler.ml
- ocamlc.opt -w +L -w +R -w +Z -I src -I +unix -safe-string -bin-annot -strict-sequence -c src/ocaml_tools.mli
- ocamlc.opt -w +L -w +R -w +Z -I src -I +unix -safe-string -bin-annot -strict-sequence -c src/ocaml_tools.ml
- ocamlc.opt -w +L -w +R -w +Z -I src -I +unix -safe-string -bin-annot -strict-sequence -c src/ocaml_specific.mli
- ocamlc.opt -w +L -w +R -w +Z -I src -I +unix -safe-string -bin-annot -strict-sequence -c src/ocaml_specific.ml
- ocamlc.opt -w +L -w +R -w +Z -I src -I +unix -safe-string -bin-annot -strict-sequence -c src/exit_codes.mli
- ocamlc.opt -w +L -w +R -w +Z -I src -I +unix -safe-string -bin-annot -strict-sequence -c src/exit_codes.ml
- ocamlc.opt -w +L -w +R -w +Z -I src -I +unix -safe-string -bin-annot -strict-sequence -c src/plugin.mli
- ocamlc.opt -w +L -w +R -w +Z -I src -I +unix -safe-string -bin-annot -strict-sequence -c src/plugin.ml
- ocamlc.opt -w +L -w +R -w +Z -I src -I +unix -safe-string -bin-annot -strict-sequence -c src/hooks.mli
- ocamlc.opt -w +L -w +R -w +Z -I src -I +unix -safe-string -bin-annot -strict-sequence -c src/hooks.ml
- ocamlc.opt -w +L -w +R -w +Z -I src -I +unix -safe-string -bin-annot -strict-sequence -c src/main.mli
- ocamlc.opt -w +L -w +R -w +Z -I src -I +unix -safe-string -bin-annot -strict-sequence -c src/main.ml
- mkdir -p tmp
- ocamlc.opt -pack src/const.cmo src/loc.cmo src/discard_printf.cmo src/signatures.cmi src/my_std.cmo src/my_unix.cmo src/tags.cmo src/display.cmo src/log.cmo src/shell.cmo src/bool.cmo src/glob_ast.cmo src/glob_lexer.cmo src/glob.cmo src/lexers.cmo src/param_tags.cmo src/command.cmo src/ocamlbuild_config.cmo src/ocamlbuild_where.cmo src/slurp.cmo src/options.cmo src/pathname.cmo src/configuration.cmo src/flags.cmo src/hygiene.cmo src/digest_cache.cmo src/resource.cmo src/rule.cmo src/solver.cmo src/report.cmo src/tools.cmo src/fda.cmo src/findlib.cmo src/ocaml_arch.cmo src/ocaml_utils.cmo src/ocaml_dependencies.cmo src/ocaml_compiler.cmo src/ocaml_tools.cmo src/ocaml_specific.cmo src/exit_codes.cmo src/plugin.cmo src/hooks.cmo src/main.cmo -o tmp/ocamlbuild_pack.cmo
- mv tmp/ocamlbuild_pack.cmi src/ocamlbuild_pack.cmi
- mv tmp/ocamlbuild_pack.cmo src/ocamlbuild_pack.cmo
- ocamlc.opt -w +L -w +R -w +Z -I src -I +unix -safe-string -bin-annot -strict-sequence -c src/ocamlbuild_plugin.mli
- ocamlc.opt -w +L -w +R -w +Z -I src -I +unix -safe-string -bin-annot -strict-sequence -c src/ocamlbuild_plugin.ml
- ocamlc.opt -w +L -w +R -w +Z -I src -I +unix -safe-string -bin-annot -strict-sequence -c src/ocamlbuild_executor.mli
- ocamlc.opt -w +L -w +R -w +Z -I src -I +unix -safe-string -bin-annot -strict-sequence -c src/ocamlbuild_executor.ml
- ocamlc.opt -w +L -w +R -w +Z -I src -I +unix -safe-string -bin-annot -strict-sequence -c src/ocamlbuild_unix_plugin.mli
- ocamlc.opt -w +L -w +R -w +Z -I src -I +unix -safe-string -bin-annot -strict-sequence -c src/ocamlbuild_unix_plugin.ml
- ocamlc.opt -w +L -w +R -w +Z -I src -I +unix -safe-string -bin-annot -strict-sequence -c src/ocamlbuild.mli
- ocamlc.opt -w +L -w +R -w +Z -I src -I +unix -safe-string -bin-annot -strict-sequence -c src/ocamlbuild.ml
- ocamlc.opt -I +unix -I src -o ocamlbuild.byte unix.cma src/ocamlbuild_pack.cmo src/ocamlbuild_plugin.cmo src/ocamlbuild_executor.cmo src/ocamlbuild_unix_plugin.cmo src/ocamlbuild.cmo
- ocamlc.opt -a -o src/ocamlbuildlib.cma src/ocamlbuild_pack.cmo src/ocamlbuild_plugin.cmo src/ocamlbuild_executor.cmo src/ocamlbuild_unix_plugin.cmo
- ocamlopt.opt -for-pack Ocamlbuild_pack -w +L -w +R -w +Z -I src -I +unix -safe-string -bin-annot -strict-sequence -c src/const.ml
- ocamlopt.opt -for-pack Ocamlbuild_pack -w +L -w +R -w +Z -I src -I +unix -safe-string -bin-annot -strict-sequence -c src/loc.ml
- ocamlopt.opt -for-pack Ocamlbuild_pack -w +L -w +R -w +Z -I src -I +unix -safe-string -bin-annot -strict-sequence -c src/discard_printf.ml
- ocamlopt.opt -for-pack Ocamlbuild_pack -w +L -w +R -w +Z -I src -I +unix -safe-string -bin-annot -strict-sequence -c src/my_std.ml
- ocamlopt.opt -for-pack Ocamlbuild_pack -w +L -w +R -w +Z -I src -I +unix -safe-string -bin-annot -strict-sequence -c src/my_unix.ml
- ocamlopt.opt -for-pack Ocamlbuild_pack -w +L -w +R -w +Z -I src -I +unix -safe-string -bin-annot -strict-sequence -c src/tags.ml
- ocamlopt.opt -for-pack Ocamlbuild_pack -w +L -w +R -w +Z -I src -I +unix -safe-string -bin-annot -strict-sequence -c src/display.ml
- ocamlopt.opt -for-pack Ocamlbuild_pack -w +L -w +R -w +Z -I src -I +unix -safe-string -bin-annot -strict-sequence -c src/log.ml
- ocamlopt.opt -for-pack Ocamlbuild_pack -w +L -w +R -w +Z -I src -I +unix -safe-string -bin-annot -strict-sequence -c src/shell.ml
- ocamlopt.opt -for-pack Ocamlbuild_pack -w +L -w +R -w +Z -I src -I +unix -safe-string -bin-annot -strict-sequence -c src/bool.ml
- ocamlopt.opt -for-pack Ocamlbuild_pack -w +L -w +R -w +Z -I src -I +unix -safe-string -bin-annot -strict-sequence -c src/glob_ast.ml
- ocamlopt.opt -for-pack Ocamlbuild_pack -w +L -w +R -w +Z -I src -I +unix -safe-string -bin-annot -strict-sequence -c src/glob_lexer.ml
- ocamlopt.opt -for-pack Ocamlbuild_pack -w +L -w +R -w +Z -I src -I +unix -safe-string -bin-annot -strict-sequence -c src/glob.ml
- ocamlopt.opt -for-pack Ocamlbuild_pack -w +L -w +R -w +Z -I src -I +unix -safe-string -bin-annot -strict-sequence -c src/lexers.ml
- ocamlopt.opt -for-pack Ocamlbuild_pack -w +L -w +R -w +Z -I src -I +unix -safe-string -bin-annot -strict-sequence -c src/param_tags.ml
- ocamlopt.opt -for-pack Ocamlbuild_pack -w +L -w +R -w +Z -I src -I +unix -safe-string -bin-annot -strict-sequence -c src/command.ml
- ocamlopt.opt -for-pack Ocamlbuild_pack -w +L -w +R -w +Z -I src -I +unix -safe-string -bin-annot -strict-sequence -c src/ocamlbuild_config.ml
- ocamlopt.opt -for-pack Ocamlbuild_pack -w +L -w +R -w +Z -I src -I +unix -safe-string -bin-annot -strict-sequence -c src/ocamlbuild_where.ml
- ocamlopt.opt -for-pack Ocamlbuild_pack -w +L -w +R -w +Z -I src -I +unix -safe-string -bin-annot -strict-sequence -c src/slurp.ml
- ocamlopt.opt -for-pack Ocamlbuild_pack -w +L -w +R -w +Z -I src -I +unix -safe-string -bin-annot -strict-sequence -c src/options.ml
- ocamlopt.opt -for-pack Ocamlbuild_pack -w +L -w +R -w +Z -I src -I +unix -safe-string -bin-annot -strict-sequence -c src/pathname.ml
- ocamlopt.opt -for-pack Ocamlbuild_pack -w +L -w +R -w +Z -I src -I +unix -safe-string -bin-annot -strict-sequence -c src/configuration.ml
- ocamlopt.opt -for-pack Ocamlbuild_pack -w +L -w +R -w +Z -I src -I +unix -safe-string -bin-annot -strict-sequence -c src/flags.ml
- ocamlopt.opt -for-pack Ocamlbuild_pack -w +L -w +R -w +Z -I src -I +unix -safe-string -bin-annot -strict-sequence -c src/hygiene.ml
- ocamlopt.opt -for-pack Ocamlbuild_pack -w +L -w +R -w +Z -I src -I +unix -safe-string -bin-annot -strict-sequence -c src/digest_cache.ml
- ocamlopt.opt -for-pack Ocamlbuild_pack -w +L -w +R -w +Z -I src -I +unix -safe-string -bin-annot -strict-sequence -c src/resource.ml
- ocamlopt.opt -for-pack Ocamlbuild_pack -w +L -w +R -w +Z -I src -I +unix -safe-string -bin-annot -strict-sequence -c src/rule.ml
- ocamlopt.opt -for-pack Ocamlbuild_pack -w +L -w +R -w +Z -I src -I +unix -safe-string -bin-annot -strict-sequence -c src/solver.ml
- ocamlopt.opt -for-pack Ocamlbuild_pack -w +L -w +R -w +Z -I src -I +unix -safe-string -bin-annot -strict-sequence -c src/report.ml
- ocamlopt.opt -for-pack Ocamlbuild_pack -w +L -w +R -w +Z -I src -I +unix -safe-string -bin-annot -strict-sequence -c src/tools.ml
- ocamlopt.opt -for-pack Ocamlbuild_pack -w +L -w +R -w +Z -I src -I +unix -safe-string -bin-annot -strict-sequence -c src/fda.ml
- ocamlopt.opt -for-pack Ocamlbuild_pack -w +L -w +R -w +Z -I src -I +unix -safe-string -bin-annot -strict-sequence -c src/findlib.ml
- ocamlopt.opt -for-pack Ocamlbuild_pack -w +L -w +R -w +Z -I src -I +unix -safe-string -bin-annot -strict-sequence -c src/ocaml_arch.ml
- ocamlopt.opt -for-pack Ocamlbuild_pack -w +L -w +R -w +Z -I src -I +unix -safe-string -bin-annot -strict-sequence -c src/ocaml_utils.ml
- ocamlopt.opt -for-pack Ocamlbuild_pack -w +L -w +R -w +Z -I src -I +unix -safe-string -bin-annot -strict-sequence -c src/ocaml_dependencies.ml
- ocamlopt.opt -for-pack Ocamlbuild_pack -w +L -w +R -w +Z -I src -I +unix -safe-string -bin-annot -strict-sequence -c src/ocaml_compiler.ml
- ocamlopt.opt -for-pack Ocamlbuild_pack -w +L -w +R -w +Z -I src -I +unix -safe-string -bin-annot -strict-sequence -c src/ocaml_tools.ml
- ocamlopt.opt -for-pack Ocamlbuild_pack -w +L -w +R -w +Z -I src -I +unix -safe-string -bin-annot -strict-sequence -c src/ocaml_specific.ml
- ocamlopt.opt -for-pack Ocamlbuild_pack -w +L -w +R -w +Z -I src -I +unix -safe-string -bin-annot -strict-sequence -c src/exit_codes.ml
- ocamlopt.opt -for-pack Ocamlbuild_pack -w +L -w +R -w +Z -I src -I +unix -safe-string -bin-annot -strict-sequence -c src/plugin.ml
- ocamlopt.opt -for-pack Ocamlbuild_pack -w +L -w +R -w +Z -I src -I +unix -safe-string -bin-annot -strict-sequence -c src/hooks.ml
- ocamlopt.opt -for-pack Ocamlbuild_pack -w +L -w +R -w +Z -I src -I +unix -safe-string -bin-annot -strict-sequence -c src/main.ml
- mkdir -p tmp
- ocamlopt.opt -pack src/const.cmx src/loc.cmx src/discard_printf.cmx src/signatures.cmi src/my_std.cmx src/my_unix.cmx src/tags.cmx src/display.cmx src/log.cmx src/shell.cmx src/bool.cmx src/glob_ast.cmx src/glob_lexer.cmx src/glob.cmx src/lexers.cmx src/param_tags.cmx src/command.cmx src/ocamlbuild_config.cmx src/ocamlbuild_where.cmx src/slurp.cmx src/options.cmx src/pathname.cmx src/configuration.cmx src/flags.cmx src/hygiene.cmx src/digest_cache.cmx src/resource.cmx src/rule.cmx src/solver.cmx src/report.cmx src/tools.cmx src/fda.cmx src/findlib.cmx src/ocaml_arch.cmx src/ocaml_utils.cmx src/ocaml_dependencies.cmx src/ocaml_compiler.cmx src/ocaml_tools.cmx src/ocaml_specific.cmx src/exit_codes.cmx src/plugin.cmx src/hooks.cmx src/main.cmx -o tmp/ocamlbuild_pack.cmx
- mv tmp/ocamlbuild_pack.cmx src/ocamlbuild_pack.cmx
- mv tmp/ocamlbuild_pack.o src/ocamlbuild_pack.o
- ocamlopt.opt -for-pack Ocamlbuild_pack -w +L -w +R -w +Z -I src -I +unix -safe-string -bin-annot -strict-sequence -c src/ocamlbuild_plugin.ml
- ocamlopt.opt -for-pack Ocamlbuild_pack -w +L -w +R -w +Z -I src -I +unix -safe-string -bin-annot -strict-sequence -c src/ocamlbuild_executor.ml
- ocamlopt.opt -for-pack Ocamlbuild_pack -w +L -w +R -w +Z -I src -I +unix -safe-string -bin-annot -strict-sequence -c src/ocamlbuild_unix_plugin.ml
- ocamlopt.opt -for-pack Ocamlbuild_pack -w +L -w +R -w +Z -I src -I +unix -safe-string -bin-annot -strict-sequence -c src/ocamlbuild.ml
- ocamlopt.opt -I +unix -I src -o ocamlbuild.native unix.cmxa src/ocamlbuild_pack.cmx src/ocamlbuild_plugin.cmx src/ocamlbuild_executor.cmx src/ocamlbuild_unix_plugin.cmx src/ocamlbuild.cmx
- ocamlopt.opt -a -o src/ocamlbuildlib.cmxa src/ocamlbuild_pack.cmx src/ocamlbuild_plugin.cmx src/ocamlbuild_executor.cmx src/ocamlbuild_unix_plugin.cmx
- ocamlc.opt src/ocamlbuild_pack.cmo -I src man/options_man.ml -o man/options_man.byte
- ./man/options_man.byte > man/ocamlbuild.options.1
- cat man/ocamlbuild.header.1 man/ocamlbuild.options.1 man/ocamlbuild.footer.1 > man/ocamlbuild.1
- make ocamlbuild.install
- make[1]: Entering directory '/home/opam/.opam/4.09/.opam-switch/build/ocamlbuild.0.14.1'
- rm -f ocamlbuild.install
- touch ocamlbuild.install
- make install-bin-opam
- make[2]: Entering directory '/home/opam/.opam/4.09/.opam-switch/build/ocamlbuild.0.14.1'
- echo 'bin: [' >> ocamlbuild.install
- echo '  "ocamlbuild.byte" {"ocamlbuild.byte"}' >> ocamlbuild.install
- echo '  "ocamlbuild.native" {"ocamlbuild.native"}' >> ocamlbuild.install
- echo '  "ocamlbuild.native" {"ocamlbuild"}' >> ocamlbuild.install
- echo ']' >> ocamlbuild.install
- echo >> ocamlbuild.install
- make[2]: Leaving directory '/home/opam/.opam/4.09/.opam-switch/build/ocamlbuild.0.14.1'
- make install-lib-opam
- make[2]: Entering directory '/home/opam/.opam/4.09/.opam-switch/build/ocamlbuild.0.14.1'
- echo 'lib: [' >> ocamlbuild.install
- make install-lib-basics-opam
- make[3]: Entering directory '/home/opam/.opam/4.09/.opam-switch/build/ocamlbuild.0.14.1'
- echo '  "ocamlbuild.opam" {"opam"}' >> ocamlbuild.install
- echo '  "META"' >> ocamlbuild.install
- for lib in src/signatures.mli src/signatures.cmi src/signatures.cmti; do \
-   echo "  \"$lib\" {\"$(basename $lib)\"}" >> ocamlbuild.install; \
- done
- make[3]: Leaving directory '/home/opam/.opam/4.09/.opam-switch/build/ocamlbuild.0.14.1'
- make install-lib-byte-opam
- make[3]: Entering directory '/home/opam/.opam/4.09/.opam-switch/build/ocamlbuild.0.14.1'
- for lib in src/ocamlbuildlib.cma src/ocamlbuild.cmo src/ocamlbuild_pack.cmi src/ocamlbuild_plugin.cmi src/ocamlbuild_executor.cmi src/ocamlbuild_unix_plugin.cmi; do \
-   echo "  \"$lib\" {\"$(basename $lib)\"}" >> ocamlbuild.install; \
- done
- make[3]: Leaving directory '/home/opam/.opam/4.09/.opam-switch/build/ocamlbuild.0.14.1'
- make install-lib-native-opam
- make[3]: Entering directory '/home/opam/.opam/4.09/.opam-switch/build/ocamlbuild.0.14.1'
- for lib in src/ocamlbuildlib.cmxa src/ocamlbuildlib.a src/ocamlbuild.cmx src/ocamlbuild.o src/ocamlbuild_pack.cmx src/ocamlbuild_plugin.cmx src/ocamlbuild_executor.cmx src/ocamlbuild_unix_plugin.cmx src/ocamlbuild_plugin.o src/ocamlbuild_executor.o src/ocamlbuild_unix_plugin.o; do \
-   echo "  \"$lib\" {\"$(basename $lib)\"}" >> ocamlbuild.install; \
- done
- make[3]: Leaving directory '/home/opam/.opam/4.09/.opam-switch/build/ocamlbuild.0.14.1'
- echo ']' >> ocamlbuild.install
- echo >> ocamlbuild.install
- make[2]: Leaving directory '/home/opam/.opam/4.09/.opam-switch/build/ocamlbuild.0.14.1'
- make install-man-opam
- make[2]: Entering directory '/home/opam/.opam/4.09/.opam-switch/build/ocamlbuild.0.14.1'
- echo 'man: [' >> ocamlbuild.install
- echo '  "man/ocamlbuild.1" {"man1/ocamlbuild.1"}' >> ocamlbuild.install
- echo ']' >> ocamlbuild.install
- echo >> ocamlbuild.install
- make[2]: Leaving directory '/home/opam/.opam/4.09/.opam-switch/build/ocamlbuild.0.14.1'
- make install-doc-opam
- make[2]: Entering directory '/home/opam/.opam/4.09/.opam-switch/build/ocamlbuild.0.14.1'
- echo 'doc: [' >> ocamlbuild.install
- echo '  "LICENSE"' >> ocamlbuild.install
- echo '  "Changes"' >> ocamlbuild.install
- echo '  "Readme.md"' >> ocamlbuild.install
- echo ']' >> ocamlbuild.install
- make[2]: Leaving directory '/home/opam/.opam/4.09/.opam-switch/build/ocamlbuild.0.14.1'
- make[1]: Leaving directory '/home/opam/.opam/4.09/.opam-switch/build/ocamlbuild.0.14.1'
-> compiled  ocamlbuild.0.14.1
Processing 19/41: [dune: ocaml bootstrap.ml] [ocamlfind: make install]
+ /home/opam/.opam/opam-init/hooks/sandbox.sh "install" "make" "install" (CWD=/home/opam/.opam/4.09/.opam-switch/build/ocamlfind.1.9.5)
- if [ "1" -eq 1 ]; then \
-     for x in camlp4 dbm graphics labltk num ocamlbuild; do \
-       if [ -f "/home/opam/.opam/4.09/lib/$x/META" ]; then \
-         if ! grep -Fq '[distributed with Ocaml]' "//home/opam/.opam/4.09/lib/$x/META"; then \
-           rm -f site-lib-src/$x/META; \
-         fi; \
-       fi; \
-     done; \
-     test -f "site-lib-src/num/META" || rm -f "site-lib-src/num-top/META"; \
-   fi
- echo 'SITELIB_META =' > Makefile.packages.in
- for x in `ls site-lib-src`; do test ! -f "site-lib-src/$x/META" || echo $x >> Makefile.packages.in; done
- tr '\n' ' ' < Makefile.packages.in > Makefile.packages
- rm Makefile.packages.in
- install -d "/home/opam/.opam/4.09/bin"
- install -d "/home/opam/.opam/4.09/man"
- make install-config
- make[1]: Entering directory '/home/opam/.opam/4.09/.opam-switch/build/ocamlfind.1.9.5'
- install -d "`dirname \"/home/opam/.opam/4.09/lib/findlib.conf\"`"
- test -f "/home/opam/.opam/4.09/lib/findlib.conf" || install -c findlib.conf "/home/opam/.opam/4.09/lib/findlib.conf"
- make[1]: Leaving directory '/home/opam/.opam/4.09/.opam-switch/build/ocamlfind.1.9.5'
- for p in findlib; do ( cd src/$p; make install ); done
- make[1]: Entering directory '/home/opam/.opam/4.09/.opam-switch/build/ocamlfind.1.9.5/src/findlib'
- install -d "/home/opam/.opam/4.09/lib/findlib"
- install -d "/home/opam/.opam/4.09/bin"
- test 1 -eq 0 || install -d "/home/opam/.opam/4.09/lib/ocaml"
- test 1 -eq 0 || install -c topfind "/home/opam/.opam/4.09/lib/ocaml/"
- files=` ../../tools/collect_files ../../Makefile.config \
- findlib.cmi findlib.mli findlib.cma findlib.cmxa findlib.a findlib.cmxs \
- findlib_config.cmi findlib_config.ml topfind.cmi topfind.mli \
- fl_args.cmi fl_lint.cmi fl_meta.cmi fl_split.cmi fl_topo.cmi ocaml_args.cmi \
- fl_package_base.mli fl_package_base.cmi fl_metascanner.mli fl_metascanner.cmi \
- fl_metatoken.cmi findlib_top.cma findlib_top.cmxa findlib_top.a findlib_top.cmxs \
- findlib_dynload.cma findlib_dynload.cmxa findlib_dynload.a findlib_dynload.cmxs fl_dynload.mli fl_dynload.cmi \
- META` && \
- install -c $files "/home/opam/.opam/4.09/lib/findlib/"
- f="ocamlfind"; { test -f ocamlfind_opt && f="ocamlfind_opt"; }; \
- install -c $f "/home/opam/.opam/4.09/bin/ocamlfind"
- # the following "if" block is only needed for 4.00beta2
- if [ 1 -eq 0 -a -f "/home/opam/.opam/4.09/lib/ocaml/compiler-libs/topdirs.cmi" ]; then \
-     cd "/home/opam/.opam/4.09/lib/ocaml/compiler-libs/"; \
-     install -c topdirs.cmi toploop.cmi "/home/opam/.opam/4.09/lib/findlib/"; \
- fi
- make[1]: Leaving directory '/home/opam/.opam/4.09/.opam-switch/build/ocamlfind.1.9.5/src/findlib'
- make install-meta
- make[1]: Entering directory '/home/opam/.opam/4.09/.opam-switch/build/ocamlfind.1.9.5'
- for x in bigarray bytes compiler-libs dynlink ocamldoc raw_spacetime stdlib str threads unix ; do install -d "/home/opam/.opam/4.09/lib/$x"; install -c site-lib-src/$x/META "/home/opam/.opam/4.09/lib/$x/META.tmp" && mv "/home/opam/.opam/4.09/lib/$x/META.tmp" "/home/opam/.opam/4.09/lib/$x/META"; done
- install -d "/home/opam/.opam/4.09/lib/findlib"; install -c Makefile.packages "/home/opam/.opam/4.09/lib/findlib/Makefile.packages"
- make[1]: Leaving directory '/home/opam/.opam/4.09/.opam-switch/build/ocamlfind.1.9.5'
- test ! -f 'site-lib-src/num-top/META' || { cd src/findlib; make install-num-top; }
- test ! -f 'site-lib-src/camlp4/META' ||	install -c tools/safe_camlp4 "/home/opam/.opam/4.09/bin"
- make install-doc
- make[1]: Entering directory '/home/opam/.opam/4.09/.opam-switch/build/ocamlfind.1.9.5'
- install -d "/home/opam/.opam/4.09/man/man1" "/home/opam/.opam/4.09/man/man3" "/home/opam/.opam/4.09/man/man5"
- install -c doc/ref-man/ocamlfind.1 "/home/opam/.opam/4.09/man/man1"
- install -c doc/ref-man/META.5 doc/ref-man/site-lib.5 doc/ref-man/findlib.conf.5 "/home/opam/.opam/4.09/man/man5"
- make[1]: Leaving directory '/home/opam/.opam/4.09/.opam-switch/build/ocamlfind.1.9.5'
-> installed ocamlfind.1.9.5
Processing 19/41: [dune: ocaml bootstrap.ml]
-> installed ocamlbuild.0.14.1
Processing 20/41: [dune: ocaml bootstrap.ml]
Processing 21/41: [dune: ocaml bootstrap.ml] [topkg: ocaml build]
+ /home/opam/.opam/opam-init/hooks/sandbox.sh "build" "ocaml" "pkg/pkg.ml" "build" "--pkg-name" "topkg" "--dev-pkg" "false" (CWD=/home/opam/.opam/4.09/.opam-switch/build/topkg.1.0.5)
- ocamlfind ocamldep -modules src/topkg.ml > src/topkg.ml.depends
- ocamlfind ocamldep -modules src/topkg.mli > src/topkg.mli.depends
- ocamlfind ocamlc -c -g -bin-annot -safe-string -I src -I test -I src-care -I src-bin -o src/topkg.cmi src/topkg.mli
- ocamlfind ocamldep -modules src/topkg_build.ml > src/topkg_build.ml.depends
- ocamlfind ocamldep -modules src/topkg_build.mli > src/topkg_build.mli.depends
- ocamlfind ocamldep -modules src/topkg_cmd.mli > src/topkg_cmd.mli.depends
- ocamlfind ocamldep -modules src/topkg_fpath.mli > src/topkg_fpath.mli.depends
- ocamlfind ocamlc -c -g -bin-annot -safe-string -I src -I test -I src-care -I src-bin -o src/topkg_fpath.cmi src/topkg_fpath.mli
- ocamlfind ocamldep -modules src/topkg_codec.mli > src/topkg_codec.mli.depends
- ocamlfind ocamlc -c -g -bin-annot -safe-string -I src -I test -I src-care -I src-bin -o src/topkg_cmd.cmi src/topkg_cmd.mli
- ocamlfind ocamldep -modules src/topkg_result.mli > src/topkg_result.mli.depends
- ocamlfind ocamlc -c -g -bin-annot -safe-string -I src -I test -I src-care -I src-bin -o src/topkg_result.cmi src/topkg_result.mli
- ocamlfind ocamldep -modules src/topkg_conf.mli > src/topkg_conf.mli.depends
- ocamlfind ocamlc -c -g -bin-annot -safe-string -I src -I test -I src-care -I src-bin -o src/topkg_codec.cmi src/topkg_codec.mli
- ocamlfind ocamlc -c -g -bin-annot -safe-string -I src -I test -I src-care -I src-bin -o src/topkg_conf.cmi src/topkg_conf.mli
- ocamlfind ocamlc -c -g -bin-annot -safe-string -I src -I test -I src-care -I src-bin -o src/topkg_build.cmi src/topkg_build.mli
- ocamlfind ocamldep -modules src/topkg_cmd.ml > src/topkg_cmd.ml.depends
- ocamlfind ocamldep -modules src/topkg_fpath.ml > src/topkg_fpath.ml.depends
- ocamlfind ocamldep -modules src/topkg_string.ml > src/topkg_string.ml.depends
- ocamlfind ocamldep -modules src/topkg_string.mli > src/topkg_string.mli.depends
- ocamlfind ocamlc -c -g -bin-annot -safe-string -I src -I test -I src-care -I src-bin -o src/topkg_string.cmi src/topkg_string.mli
- ocamlfind ocamlopt -c -g -bin-annot -safe-string -I src -I test -I src-care -I src-bin -o src/topkg_string.cmx src/topkg_string.ml
- ocamlfind ocamlopt -c -g -bin-annot -safe-string -I src -I test -I src-care -I src-bin -o src/topkg_fpath.cmx src/topkg_fpath.ml
- ocamlfind ocamldep -modules src/topkg_codec.ml > src/topkg_codec.ml.depends
- ocamlfind ocamlopt -c -g -bin-annot -safe-string -I src -I test -I src-care -I src-bin -o src/topkg_cmd.cmx src/topkg_cmd.ml
- ocamlfind ocamldep -modules src/topkg_os.ml > src/topkg_os.ml.depends
- ocamlfind ocamldep -modules src/topkg_os.mli > src/topkg_os.mli.depends
- ocamlfind ocamlc -c -g -bin-annot -safe-string -I src -I test -I src-care -I src-bin -o src/topkg_os.cmi src/topkg_os.mli
- ocamlfind ocamldep -modules src/topkg_log.ml > src/topkg_log.ml.depends
- ocamlfind ocamldep -modules src/topkg_log.mli > src/topkg_log.mli.depends
- ocamlfind ocamlc -c -g -bin-annot -safe-string -I src -I test -I src-care -I src-bin -o src/topkg_log.cmi src/topkg_log.mli
- ocamlfind ocamldep -modules src/topkg_result.ml > src/topkg_result.ml.depends
- ocamlfind ocamlopt -c -g -bin-annot -safe-string -I src -I test -I src-care -I src-bin -o src/topkg_result.cmx src/topkg_result.ml
- ocamlfind ocamlopt -c -g -bin-annot -safe-string -I src -I test -I src-care -I src-bin -o src/topkg_log.cmx src/topkg_log.ml
- ocamlfind ocamlopt -c -g -bin-annot -safe-string -I src -I test -I src-care -I src-bin -o src/topkg_os.cmx src/topkg_os.ml
- ocamlfind ocamldep -modules src/topkg_conf.ml > src/topkg_conf.ml.depends
- ocamlfind ocamlopt -c -g -bin-annot -safe-string -I src -I test -I src-care -I src-bin -o src/topkg_codec.cmx src/topkg_codec.ml
- ocamlfind ocamldep -modules src/topkg_vcs.ml > src/topkg_vcs.ml.depends
- ocamlfind ocamldep -modules src/topkg_vcs.mli > src/topkg_vcs.mli.depends
- ocamlfind ocamlc -c -g -bin-annot -safe-string -I src -I test -I src-care -I src-bin -o src/topkg_vcs.cmi src/topkg_vcs.mli
- ocamlfind ocamlopt -c -g -bin-annot -safe-string -I src -I test -I src-care -I src-bin -o src/topkg_vcs.cmx src/topkg_vcs.ml
- ocamlfind ocamlopt -c -g -bin-annot -safe-string -I src -I test -I src-care -I src-bin -o src/topkg_conf.cmx src/topkg_conf.ml
- ocamlfind ocamldep -modules src/topkg_distrib.ml > src/topkg_distrib.ml.depends
- ocamlfind ocamldep -modules src/topkg_distrib.mli > src/topkg_distrib.mli.depends
- ocamlfind ocamlc -c -g -bin-annot -safe-string -I src -I test -I src-care -I src-bin -o src/topkg_distrib.cmi src/topkg_distrib.mli
- ocamlfind ocamldep -modules src/topkg_opam.ml > src/topkg_opam.ml.depends
- ocamlfind ocamldep -modules src/topkg_opam.mli > src/topkg_opam.mli.depends
- ocamlfind ocamlc -c -g -bin-annot -safe-string -I src -I test -I src-care -I src-bin -o src/topkg_opam.cmi src/topkg_opam.mli
- ocamlfind ocamlopt -c -g -bin-annot -safe-string -I src -I test -I src-care -I src-bin -o src/topkg_opam.cmx src/topkg_opam.ml
- ocamlfind ocamldep -modules src/topkg_fexts.ml > src/topkg_fexts.ml.depends
- ocamlfind ocamldep -modules src/topkg_fexts.mli > src/topkg_fexts.mli.depends
- ocamlfind ocamlc -c -g -bin-annot -safe-string -I src -I test -I src-care -I src-bin -o src/topkg_fexts.cmi src/topkg_fexts.mli
- ocamlfind ocamldep -modules src/topkg_install.ml > src/topkg_install.ml.depends
- ocamlfind ocamldep -modules src/topkg_install.mli > src/topkg_install.mli.depends
- ocamlfind ocamldep -modules src/topkg_test.mli > src/topkg_test.mli.depends
- ocamlfind ocamlc -c -g -bin-annot -safe-string -I src -I test -I src-care -I src-bin -o src/topkg_test.cmi src/topkg_test.mli
- ocamlfind ocamlc -c -g -bin-annot -safe-string -I src -I test -I src-care -I src-bin -o src/topkg_install.cmi src/topkg_install.mli
- ocamlfind ocamlopt -c -g -bin-annot -safe-string -I src -I test -I src-care -I src-bin -o src/topkg_fexts.cmx src/topkg_fexts.ml
- ocamlfind ocamldep -modules src/topkg_test.ml > src/topkg_test.ml.depends
- ocamlfind ocamlopt -c -g -bin-annot -safe-string -I src -I test -I src-care -I src-bin -o src/topkg_test.cmx src/topkg_test.ml
- ocamlfind ocamldep -modules src/topkg_ipc.ml > src/topkg_ipc.ml.depends
- ocamlfind ocamldep -modules src/topkg_ipc.mli > src/topkg_ipc.mli.depends
- ocamlfind ocamldep -modules src/topkg_pkg.mli > src/topkg_pkg.mli.depends
- ocamlfind ocamldep -modules src/topkg_publish.mli > src/topkg_publish.mli.depends
- ocamlfind ocamlc -c -g -bin-annot -safe-string -I src -I test -I src-care -I src-bin -o src/topkg_publish.cmi src/topkg_publish.mli
- ocamlfind ocamlc -c -g -bin-annot -safe-string -I src -I test -I src-care -I src-bin -o src/topkg_pkg.cmi src/topkg_pkg.mli
- ocamlfind ocamlc -c -g -bin-annot -safe-string -I src -I test -I src-care -I src-bin -o src/topkg_ipc.cmi src/topkg_ipc.mli
- ocamlfind ocamldep -modules src/topkg_pkg.ml > src/topkg_pkg.ml.depends
- ocamlfind ocamlopt -c -g -bin-annot -safe-string -I src -I test -I src-care -I src-bin -o src/topkg_build.cmx src/topkg_build.ml
- ocamlfind ocamlopt -c -g -bin-annot -safe-string -I src -I test -I src-care -I src-bin -o src/topkg_distrib.cmx src/topkg_distrib.ml
- ocamlfind ocamlopt -c -g -bin-annot -safe-string -I src -I test -I src-care -I src-bin -o src/topkg_install.cmx src/topkg_install.ml
- ocamlfind ocamldep -modules src/topkg_publish.ml > src/topkg_publish.ml.depends
- ocamlfind ocamlopt -c -g -bin-annot -safe-string -I src -I test -I src-care -I src-bin -o src/topkg_publish.cmx src/topkg_publish.ml
- ocamlfind ocamlopt -c -g -bin-annot -safe-string -I src -I test -I src-care -I src-bin -o src/topkg_pkg.cmx src/topkg_pkg.ml
- ocamlfind ocamldep -modules src/topkg_main.ml > src/topkg_main.ml.depends
- ocamlfind ocamldep -modules src/topkg_main.mli > src/topkg_main.mli.depends
- ocamlfind ocamlc -c -g -bin-annot -safe-string -I src -I test -I src-care -I src-bin -o src/topkg_main.cmi src/topkg_main.mli
- ocamlfind ocamlopt -c -g -bin-annot -safe-string -I src -I test -I src-care -I src-bin -o src/topkg_ipc.cmx src/topkg_ipc.ml
- ocamlfind ocamlopt -c -g -bin-annot -safe-string -I src -I test -I src-care -I src-bin -o src/topkg_main.cmx src/topkg_main.ml
- ocamlfind ocamlopt -c -g -bin-annot -safe-string -I src -I test -I src-care -I src-bin -o src/topkg.cmx src/topkg.ml
- ocamlfind ocamlopt -a -I src src/topkg_string.cmx src/topkg_fpath.cmx src/topkg_cmd.cmx src/topkg_result.cmx src/topkg_log.cmx src/topkg_os.cmx src/topkg_codec.cmx src/topkg_vcs.cmx src/topkg_conf.cmx src/topkg_build.cmx src/topkg_opam.cmx src/topkg_distrib.cmx src/topkg_fexts.cmx src/topkg_test.cmx src/topkg_install.cmx src/topkg_publish.cmx src/topkg_pkg.cmx src/topkg_ipc.cmx src/topkg_main.cmx src/topkg.cmx -o src/topkg.cmxa
- ocamlfind ocamlopt -shared -linkall -I src src/topkg.cmxa -o src/topkg.cmxs
- ocamlfind ocamlc -c -g -bin-annot -safe-string -I src -I test -I src-care -I src-bin -o src/topkg.cmo src/topkg.ml
- ocamlfind ocamlc -c -g -bin-annot -safe-string -I src -I test -I src-care -I src-bin -o src/topkg_build.cmo src/topkg_build.ml
- ocamlfind ocamlc -c -g -bin-annot -safe-string -I src -I test -I src-care -I src-bin -o src/topkg_cmd.cmo src/topkg_cmd.ml
- ocamlfind ocamlc -c -g -bin-annot -safe-string -I src -I test -I src-care -I src-bin -o src/topkg_codec.cmo src/topkg_codec.ml
- ocamlfind ocamlc -c -g -bin-annot -safe-string -I src -I test -I src-care -I src-bin -o src/topkg_conf.cmo src/topkg_conf.ml
- ocamlfind ocamlc -c -g -bin-annot -safe-string -I src -I test -I src-care -I src-bin -o src/topkg_distrib.cmo src/topkg_distrib.ml
- ocamlfind ocamlc -c -g -bin-annot -safe-string -I src -I test -I src-care -I src-bin -o src/topkg_fexts.cmo src/topkg_fexts.ml
- ocamlfind ocamlc -c -g -bin-annot -safe-string -I src -I test -I src-care -I src-bin -o src/topkg_fpath.cmo src/topkg_fpath.ml
- ocamlfind ocamlc -c -g -bin-annot -safe-string -I src -I test -I src-care -I src-bin -o src/topkg_install.cmo src/topkg_install.ml
- ocamlfind ocamlc -c -g -bin-annot -safe-string -I src -I test -I src-care -I src-bin -o src/topkg_ipc.cmo src/topkg_ipc.ml
- ocamlfind ocamlc -c -g -bin-annot -safe-string -I src -I test -I src-care -I src-bin -o src/topkg_log.cmo src/topkg_log.ml
- ocamlfind ocamlc -c -g -bin-annot -safe-string -I src -I test -I src-care -I src-bin -o src/topkg_main.cmo src/topkg_main.ml
- ocamlfind ocamlc -c -g -bin-annot -safe-string -I src -I test -I src-care -I src-bin -o src/topkg_opam.cmo src/topkg_opam.ml
- ocamlfind ocamlc -c -g -bin-annot -safe-string -I src -I test -I src-care -I src-bin -o src/topkg_os.cmo src/topkg_os.ml
- ocamlfind ocamlc -c -g -bin-annot -safe-string -I src -I test -I src-care -I src-bin -o src/topkg_pkg.cmo src/topkg_pkg.ml
- ocamlfind ocamlc -c -g -bin-annot -safe-string -I src -I test -I src-care -I src-bin -o src/topkg_publish.cmo src/topkg_publish.ml
- ocamlfind ocamlc -c -g -bin-annot -safe-string -I src -I test -I src-care -I src-bin -o src/topkg_result.cmo src/topkg_result.ml
- ocamlfind ocamlc -c -g -bin-annot -safe-string -I src -I test -I src-care -I src-bin -o src/topkg_string.cmo src/topkg_string.ml
- ocamlfind ocamlc -c -g -bin-annot -safe-string -I src -I test -I src-care -I src-bin -o src/topkg_test.cmo src/topkg_test.ml
- ocamlfind ocamlc -c -g -bin-annot -safe-string -I src -I test -I src-care -I src-bin -o src/topkg_vcs.cmo src/topkg_vcs.ml
- ocamlfind ocamlc -a -I src src/topkg_string.cmo src/topkg_fpath.cmo src/topkg_cmd.cmo src/topkg_result.cmo src/topkg_log.cmo src/topkg_os.cmo src/topkg_codec.cmo src/topkg_vcs.cmo src/topkg_conf.cmo src/topkg_build.cmo src/topkg_opam.cmo src/topkg_distrib.cmo src/topkg_fexts.cmo src/topkg_test.cmo src/topkg_install.cmo src/topkg_publish.cmo src/topkg_pkg.cmo src/topkg_ipc.cmo src/topkg_main.cmo src/topkg.cmo -o src/topkg.cma
- # Parallel statistics: { count(total): 2(84), max: 20, min: 2, average(total): 11.000(1.238) }
-> compiled  topkg.1.0.5
Processing 21/41: [dune: ocaml bootstrap.ml]
-> installed topkg.1.0.5
Processing 22/41: [dune: ocaml bootstrap.ml]
Processing 23/41: [astring: ocaml build] [dune: ocaml bootstrap.ml]
Processing 24/41: [astring: ocaml build] [dune: ocaml bootstrap.ml] [rresult: ocaml build]
+ /home/opam/.opam/opam-init/hooks/sandbox.sh "build" "ocaml" "pkg/pkg.ml" "build" "--dev-pkg" "false" (CWD=/home/opam/.opam/4.09/.opam-switch/build/rresult.0.7.0)
- ocamlfind ocamldep -modules src/rresult.ml > src/rresult.ml.depends
- ocamlfind ocamldep -modules src/rresult.mli > src/rresult.mli.depends
- ocamlfind ocamlc -c -g -bin-annot -safe-string -I src -I test -o src/rresult.cmi src/rresult.mli
- ocamlfind ocamlopt -c -g -bin-annot -safe-string -I src -I test -o src/rresult.cmx src/rresult.ml
- ocamlfind ocamlopt -a -I src src/rresult.cmx -o src/rresult.cmxa
- ocamlfind ocamlopt -shared -linkall -I src src/rresult.cmxa -o src/rresult.cmxs
- ocamlfind ocamlc -c -g -bin-annot -safe-string -I src -I test -o src/rresult.cmo src/rresult.ml
- ocamlfind ocamlc -a -I src src/rresult.cmo -o src/rresult.cma
- ocamlfind ocamldep -package compiler-libs.toplevel -modules src/rresult_top.ml > src/rresult_top.ml.depends
- ocamlfind ocamlc -c -g -bin-annot -safe-string -package compiler-libs.toplevel -I src -I test -o src/rresult_top.cmo src/rresult_top.ml
- + ocamlfind ocamlc -c -g -bin-annot -safe-string -package compiler-libs.toplevel -I src -I test -o src/rresult_top.cmo src/rresult_top.ml
- findlib: [WARNING] Interface topdirs.cmi occurs in several directories: /home/opam/.opam/4.09/lib/ocaml, /home/opam/.opam/4.09/lib/ocaml/compiler-libs
- ocamlfind ocamlopt -c -g -bin-annot -safe-string -package compiler-libs.toplevel -I src -I test -o src/rresult_top.cmx src/rresult_top.ml
- + ocamlfind ocamlopt -c -g -bin-annot -safe-string -package compiler-libs.toplevel -I src -I test -o src/rresult_top.cmx src/rresult_top.ml
- findlib: [WARNING] Interface topdirs.cmi occurs in several directories: /home/opam/.opam/4.09/lib/ocaml, /home/opam/.opam/4.09/lib/ocaml/compiler-libs
- File "_none_", line 1:
- Warning 58: no cmx file was found in path for module Toploop, and its interface was not compiled with -opaque
- ocamlfind ocamlopt -a -package compiler-libs.toplevel -I src src/rresult_top.cmx -o src/rresult_top.cmxa
- + ocamlfind ocamlopt -a -package compiler-libs.toplevel -I src src/rresult_top.cmx -o src/rresult_top.cmxa
- findlib: [WARNING] Interface topdirs.cmi occurs in several directories: /home/opam/.opam/4.09/lib/ocaml, /home/opam/.opam/4.09/lib/ocaml/compiler-libs
- ocamlfind ocamlopt -shared -linkall -package compiler-libs.toplevel -I src src/rresult_top.cmxa -o src/rresult_top.cmxs
- + ocamlfind ocamlopt -shared -linkall -package compiler-libs.toplevel -I src src/rresult_top.cmxa -o src/rresult_top.cmxs
- findlib: [WARNING] Interface topdirs.cmi occurs in several directories: /home/opam/.opam/4.09/lib/ocaml, /home/opam/.opam/4.09/lib/ocaml/compiler-libs
- ocamlfind ocamlc -a -package compiler-libs.toplevel -I src src/rresult_top.cmo -o src/rresult_top.cma
- + ocamlfind ocamlc -a -package compiler-libs.toplevel -I src src/rresult_top.cmo -o src/rresult_top.cma
- findlib: [WARNING] Interface topdirs.cmi occurs in several directories: /home/opam/.opam/4.09/lib/ocaml, /home/opam/.opam/4.09/lib/ocaml/compiler-libs
- # No parallelism done
-> compiled  rresult.0.7.0
Processing 24/41: [astring: ocaml build] [dune: ocaml bootstrap.ml]
-> installed rresult.0.7.0
Processing 25/41: [astring: ocaml build] [dune: ocaml bootstrap.ml]
+ /home/opam/.opam/opam-init/hooks/sandbox.sh "build" "ocaml" "pkg/pkg.ml" "build" "--pinned" "false" (CWD=/home/opam/.opam/4.09/.opam-switch/build/astring.0.8.5)
- ocamlfind ocamldep -modules src/astring_unsafe.ml > src/astring_unsafe.ml.depends
- ocamlfind ocamlc -c -g -bin-annot -safe-string -I src -I test -o src/astring_unsafe.cmo src/astring_unsafe.ml
- ocamlfind ocamldep -modules src/astring_base.ml > src/astring_base.ml.depends
- ocamlfind ocamlc -c -g -bin-annot -safe-string -I src -I test -o src/astring_base.cmo src/astring_base.ml
- ocamlfind ocamlopt -c -g -bin-annot -safe-string -I src -I test -o src/astring_unsafe.cmx src/astring_unsafe.ml
- ocamlfind ocamldep -modules src/astring_escape.ml > src/astring_escape.ml.depends
- ocamlfind ocamlc -c -g -bin-annot -safe-string -I src -I test -o src/astring_escape.cmo src/astring_escape.ml
- ocamlfind ocamldep -modules src/astring_char.ml > src/astring_char.ml.depends
- ocamlfind ocamlc -c -g -bin-annot -safe-string -I src -I test -o src/astring_char.cmo src/astring_char.ml
- ocamlfind ocamlopt -c -g -bin-annot -safe-string -I src -I test -o src/astring_escape.cmx src/astring_escape.ml
- ocamlfind ocamldep -modules src/astring_sub.ml > src/astring_sub.ml.depends
- ocamlfind ocamlc -c -g -bin-annot -safe-string -I src -I test -o src/astring_sub.cmo src/astring_sub.ml
- ocamlfind ocamlopt -c -g -bin-annot -safe-string -I src -I test -o src/astring_base.cmx src/astring_base.ml
- ocamlfind ocamlopt -c -g -bin-annot -safe-string -I src -I test -o src/astring_char.cmx src/astring_char.ml
- ocamlfind ocamldep -modules src/astring_string.ml > src/astring_string.ml.depends
- ocamlfind ocamlc -c -g -bin-annot -safe-string -I src -I test -o src/astring_string.cmo src/astring_string.ml
- ocamlfind ocamlopt -c -g -bin-annot -safe-string -I src -I test -o src/astring_sub.cmx src/astring_sub.ml
- ocamlfind ocamldep -modules src/astring.ml > src/astring.ml.depends
- ocamlfind ocamldep -modules src/astring.mli > src/astring.mli.depends
- ocamlfind ocamlc -c -g -bin-annot -safe-string -I src -I test -o src/astring.cmi src/astring.mli
- ocamlfind ocamlopt -c -g -bin-annot -safe-string -I src -I test -o src/astring_string.cmx src/astring_string.ml
- ocamlfind ocamlopt -c -g -bin-annot -safe-string -I src -I test -o src/astring.cmx src/astring.ml
- ocamlfind ocamlopt -a -I src src/astring_unsafe.cmx src/astring_base.cmx src/astring_escape.cmx src/astring_char.cmx src/astring_sub.cmx src/astring_string.cmx src/astring.cmx -o src/astring.cmxa
- ocamlfind ocamlopt -shared -linkall -I src src/astring.cmxa -o src/astring.cmxs
- ocamlfind ocamlc -c -g -bin-annot -safe-string -I src -I test -o src/astring.cmo src/astring.ml
- ocamlfind ocamlc -a -I src src/astring_unsafe.cmo src/astring_base.cmo src/astring_escape.cmo src/astring_char.cmo src/astring_sub.cmo src/astring_string.cmo src/astring.cmo -o src/astring.cma
- ocamlfind ocamldep -package compiler-libs.toplevel -modules src/astring_top.ml > src/astring_top.ml.depends
- ocamlfind ocamlc -c -g -bin-annot -safe-string -package compiler-libs.toplevel -I src -I test -o src/astring_top.cmo src/astring_top.ml
- + ocamlfind ocamlc -c -g -bin-annot -safe-string -package compiler-libs.toplevel -I src -I test -o src/astring_top.cmo src/astring_top.ml
- findlib: [WARNING] Interface topdirs.cmi occurs in several directories: /home/opam/.opam/4.09/lib/ocaml, /home/opam/.opam/4.09/lib/ocaml/compiler-libs
- ocamlfind ocamlopt -c -g -bin-annot -safe-string -package compiler-libs.toplevel -I src -I test -o src/astring_top.cmx src/astring_top.ml
- + ocamlfind ocamlopt -c -g -bin-annot -safe-string -package compiler-libs.toplevel -I src -I test -o src/astring_top.cmx src/astring_top.ml
- findlib: [WARNING] Interface topdirs.cmi occurs in several directories: /home/opam/.opam/4.09/lib/ocaml, /home/opam/.opam/4.09/lib/ocaml/compiler-libs
- File "_none_", line 1:
- Warning 58: no cmx file was found in path for module Toploop, and its interface was not compiled with -opaque
- ocamlfind ocamlopt -a -package compiler-libs.toplevel -I src src/astring_top.cmx -o src/astring_top.cmxa
- + ocamlfind ocamlopt -a -package compiler-libs.toplevel -I src src/astring_top.cmx -o src/astring_top.cmxa
- findlib: [WARNING] Interface topdirs.cmi occurs in several directories: /home/opam/.opam/4.09/lib/ocaml, /home/opam/.opam/4.09/lib/ocaml/compiler-libs
- ocamlfind ocamlopt -shared -linkall -package compiler-libs.toplevel -I src src/astring_top.cmxa -o src/astring_top.cmxs
- + ocamlfind ocamlopt -shared -linkall -package compiler-libs.toplevel -I src src/astring_top.cmxa -o src/astring_top.cmxs
- findlib: [WARNING] Interface topdirs.cmi occurs in several directories: /home/opam/.opam/4.09/lib/ocaml, /home/opam/.opam/4.09/lib/ocaml/compiler-libs
- ocamlfind ocamlc -a -package compiler-libs.toplevel -I src src/astring_top.cmo -o src/astring_top.cma
- + ocamlfind ocamlc -a -package compiler-libs.toplevel -I src src/astring_top.cmo -o src/astring_top.cma
- findlib: [WARNING] Interface topdirs.cmi occurs in several directories: /home/opam/.opam/4.09/lib/ocaml, /home/opam/.opam/4.09/lib/ocaml/compiler-libs
- # No parallelism done
-> compiled  astring.0.8.5
Processing 25/41: [dune: ocaml bootstrap.ml]
-> installed astring.0.8.5
Processing 26/41: [dune: ocaml bootstrap.ml]
+ /home/opam/.opam/opam-init/hooks/sandbox.sh "build" "ocaml" "bootstrap.ml" "-j" "31" (CWD=/home/opam/.opam/4.09/.opam-switch/build/dune.3.4.1)
- ocamlc -custom -w -24 -g -o .duneboot.exe -I boot unix.cma boot/libs.ml boot/duneboot.ml
- ./.duneboot.exe -j 31
- 

Processing 26/41: [dune: ./dune.exe build]
+ /home/opam/.opam/opam-init/hooks/sandbox.sh "build" "./dune.exe" "build" "dune.install" "--release" "--profile" "dune-bootstrap" "-j" "31" (CWD=/home/opam/.opam/4.09/.opam-switch/build/dune.3.4.1)
-> compiled  dune.3.4.1
-> installed dune.3.4.1
Processing 28/41: [bigarray-compat: dune build]
Processing 29/41: [bigarray-compat: dune build] [csexp: dune build]
Processing 30/41: [bigarray-compat: dune build] [csexp: dune build] [stdlib-shims: dune build]
+ /home/opam/.opam/opam-init/hooks/sandbox.sh "build" "dune" "build" "-p" "csexp" "-j" "31" "@install" (CWD=/home/opam/.opam/4.09/.opam-switch/build/csexp.1.5.1)
-> compiled  csexp.1.5.1
Processing 30/41: [bigarray-compat: dune build] [stdlib-shims: dune build]
-> installed csexp.1.5.1
Processing 31/41: [bigarray-compat: dune build] [stdlib-shims: dune build]
Processing 32/41: [bigarray-compat: dune build] [dune-configurator: rm] [stdlib-shims: dune build]
+ /home/opam/.opam/opam-init/hooks/sandbox.sh "build" "dune" "build" "-p" "bigarray-compat" "-j" "31" (CWD=/home/opam/.opam/4.09/.opam-switch/build/bigarray-compat.1.1.0)
-> compiled  bigarray-compat.1.1.0
Processing 32/41: [dune-configurator: rm] [stdlib-shims: dune build]
-> installed bigarray-compat.1.1.0
Processing 33/41: [dune-configurator: rm] [stdlib-shims: dune build]
+ /home/opam/.opam/opam-init/hooks/sandbox.sh "build" "dune" "build" "-p" "stdlib-shims" "-j" "31" (CWD=/home/opam/.opam/4.09/.opam-switch/build/stdlib-shims.0.3.0)
-> compiled  stdlib-shims.0.3.0
Processing 33/41: [dune-configurator: rm]
-> installed stdlib-shims.0.3.0
Processing 34/41: [dune-configurator: rm]
Processing 35/41: [dune-configurator: rm] [integers: dune build]
+ /home/opam/.opam/opam-init/hooks/sandbox.sh "build" "rm" "-rf" "vendor/csexp" (CWD=/home/opam/.opam/4.09/.opam-switch/build/dune-configurator.3.4.1)
+ /home/opam/.opam/opam-init/hooks/sandbox.sh "build" "rm" "-rf" "vendor/pp" (CWD=/home/opam/.opam/4.09/.opam-switch/build/dune-configurator.3.4.1)
Processing 35/41: [dune-configurator: dune build] [integers: dune build]
+ /home/opam/.opam/opam-init/hooks/sandbox.sh "build" "dune" "build" "-p" "integers" "-j" "31" (CWD=/home/opam/.opam/4.09/.opam-switch/build/integers.0.7.0)
-> compiled  integers.0.7.0
Processing 35/41: [dune-configurator: dune build]
-> installed integers.0.7.0
Processing 36/41: [dune-configurator: dune build]
Processing 37/41: [ctypes: touch libffi.config] [dune-configurator: dune build]
+ /home/opam/.opam/opam-init/hooks/sandbox.sh "build" "touch" "libffi.config" (CWD=/home/opam/.opam/4.09/.opam-switch/build/ctypes.0.20.1)
Processing 37/41: [ctypes: make ctypes-base] [dune-configurator: dune build]
+ /home/opam/.opam/opam-init/hooks/sandbox.sh "build" "dune" "build" "-p" "dune-configurator" "-j" "31" "@install" (CWD=/home/opam/.opam/4.09/.opam-switch/build/dune-configurator.3.4.1)
-> compiled  dune-configurator.3.4.1
Processing 37/41: [ctypes: make ctypes-base]
-> installed dune-configurator.3.4.1
Processing 38/41: [ctypes: make ctypes-base]
+ /home/opam/.opam/opam-init/hooks/sandbox.sh "build" "make" "XEN=disable" "ctypes-base" "ctypes-stubs" (CWD=/home/opam/.opam/4.09/.opam-switch/build/ctypes.0.20.1)
- ./src/discover/determine_as_needed_flags.sh >> asneeded.config
- ocamlfind  ocamlc -o gen_c_primitives -package str -strict-sequence -linkpkg src/configure/extract_from_c.ml src/configure/gen_c_primitives.ml -I src/configure
- ./gen_c_primitives > src/ctypes/ctypes_primitives.ml 2> gen_c_primitives.log || (rm src/ctypes/ctypes_primitives.ml && cat gen_c_primitives.log || false)
- ocamlfind  ocamlc -o gen_libffi_abi -package str -strict-sequence -linkpkg src/configure/extract_from_c.ml src/configure/gen_libffi_abi.ml -I src/configure
- ./gen_libffi_abi > src/ctypes-foreign/libffi_abi.ml 2> gen_c_primitives.log || (rm src/ctypes-foreign/libffi_abi.ml && cat gen_c_primitives.log || false)
- cp src/ctypes-foreign/dl.ml.unix src/ctypes-foreign/dl.ml
- cp src/ctypes-foreign/dl_stubs.c.unix src/ctypes-foreign/dl_stubs.c
- ocamlfind  ocamlc -package bigarray-compat -package integers   -principal -short-paths -strict-sequence -g -ccopt "-I/home/opam/.opam/4.09/lib/integers"   -c -o _build/src/ctypes/ctypes_ptr.cmo -I _build/src/ctypes  src/ctypes/ctypes_ptr.ml
- ocamlfind  ocamlc -package bigarray-compat -package integers   -principal -short-paths -strict-sequence -g -ccopt "-I/home/opam/.opam/4.09/lib/integers"   -c -o _build/src/ctypes/ctypes_roots_stubs.cmo -I _build/src/ctypes  src/ctypes/ctypes_roots_stubs.ml
- ocamlfind  ocamlopt -bin-annot -c -o _build/src/ctypes/lDouble.cmi -package bigarray-compat -package integers    -principal -short-paths -strict-sequence -g -ccopt "-I/home/opam/.opam/4.09/lib/integers" -I _build/src/ctypes  src/ctypes/lDouble.mli
- ocamlfind  ocamlc -package bigarray-compat -package integers   -principal -short-paths -strict-sequence -g -ccopt "-I/home/opam/.opam/4.09/lib/integers"   -c -o _build/src/ctypes/lDouble.cmo -I _build/src/ctypes  src/ctypes/lDouble.ml
- ocamlfind  ocamlc -package bigarray-compat -package integers   -principal -short-paths -strict-sequence -g -ccopt "-I/home/opam/.opam/4.09/lib/integers"   -c -o _build/src/ctypes/ctypes_bigarray_stubs.cmo -I _build/src/ctypes  src/ctypes/ctypes_bigarray_stubs.ml
- ocamlfind  ocamlopt -bin-annot -c -o _build/src/ctypes/complexL.cmi -package bigarray-compat -package integers    -principal -short-paths -strict-sequence -g -ccopt "-I/home/opam/.opam/4.09/lib/integers" -I _build/src/ctypes  src/ctypes/complexL.mli
- ocamlfind  ocamlc -package bigarray-compat -package integers   -principal -short-paths -strict-sequence -g -ccopt "-I/home/opam/.opam/4.09/lib/integers"   -c -o _build/src/ctypes/complexL.cmo -I _build/src/ctypes  src/ctypes/complexL.ml
- ocamlfind  ocamlopt -bin-annot -c -o _build/src/ctypes/ctypes_primitive_types.cmi -package bigarray-compat -package integers    -principal -short-paths -strict-sequence -g -ccopt "-I/home/opam/.opam/4.09/lib/integers" -I _build/src/ctypes  src/ctypes/ctypes_primitive_types.mli
- ocamlfind  ocamlc -package bigarray-compat -package integers   -principal -short-paths -strict-sequence -g -ccopt "-I/home/opam/.opam/4.09/lib/integers"   -c -o _build/src/ctypes/ctypes_primitive_types.cmo -I _build/src/ctypes  src/ctypes/ctypes_primitive_types.ml
- ocamlfind  ocamlc -package bigarray-compat -package integers   -principal -short-paths -strict-sequence -g -ccopt "-I/home/opam/.opam/4.09/lib/integers"   -c -o _build/src/ctypes/ctypes_primitives.cmo -I _build/src/ctypes  src/ctypes/ctypes_primitives.ml
- ocamlfind  ocamlc -package bigarray-compat -package integers   -principal -short-paths -strict-sequence -g -ccopt "-I/home/opam/.opam/4.09/lib/integers"   -c -o _build/src/ctypes/ctypes_value_printing_stubs.cmo -I _build/src/ctypes  src/ctypes/ctypes_value_printing_stubs.ml
- ocamlfind  ocamlc -package bigarray-compat -package integers   -principal -short-paths -strict-sequence -g -ccopt "-I/home/opam/.opam/4.09/lib/integers"   -c -o _build/src/ctypes/ctypes_memory_stubs.cmo -I _build/src/ctypes  src/ctypes/ctypes_memory_stubs.ml
- ocamlfind  ocamlopt -bin-annot -c -o _build/src/ctypes/ctypes_bigarray.cmi -package bigarray-compat -package integers    -principal -short-paths -strict-sequence -g -ccopt "-I/home/opam/.opam/4.09/lib/integers" -I _build/src/ctypes  src/ctypes/ctypes_bigarray.mli
- ocamlfind  ocamlc -package bigarray-compat -package integers   -principal -short-paths -strict-sequence -g -ccopt "-I/home/opam/.opam/4.09/lib/integers"   -c -o _build/src/ctypes/ctypes_bigarray.cmo -I _build/src/ctypes  src/ctypes/ctypes_bigarray.ml
- ocamlfind  ocamlopt -bin-annot -c -o _build/src/ctypes/ctypes_static.cmi -package bigarray-compat -package integers    -principal -short-paths -strict-sequence -g -ccopt "-I/home/opam/.opam/4.09/lib/integers" -I _build/src/ctypes  src/ctypes/ctypes_static.mli
- ocamlfind  ocamlc -package bigarray-compat -package integers   -principal -short-paths -strict-sequence -g -ccopt "-I/home/opam/.opam/4.09/lib/integers"   -c -o _build/src/ctypes/ctypes_static.cmo -I _build/src/ctypes  src/ctypes/ctypes_static.ml
- ocamlfind  ocamlc -package bigarray-compat -package integers   -principal -short-paths -strict-sequence -g -ccopt "-I/home/opam/.opam/4.09/lib/integers"   -c -o _build/src/ctypes/ctypes_std_view_stubs.cmo -I _build/src/ctypes  src/ctypes/ctypes_std_view_stubs.ml
- ocamlfind  ocamlopt -bin-annot -c -o _build/src/ctypes/ctypes_structs.cmi -package bigarray-compat -package integers    -principal -short-paths -strict-sequence -g -ccopt "-I/home/opam/.opam/4.09/lib/integers" -I _build/src/ctypes  src/ctypes/ctypes_structs.mli
- ocamlfind  ocamlc -package bigarray-compat -package integers   -principal -short-paths -strict-sequence -g -ccopt "-I/home/opam/.opam/4.09/lib/integers"   -c -o _build/src/ctypes/ctypes_structs.cmo -I _build/src/ctypes  src/ctypes/ctypes_structs.ml
- ocamlfind  ocamlopt -bin-annot -c -o _build/src/ctypes/ctypes_structs_computed.cmi -package bigarray-compat -package integers    -principal -short-paths -strict-sequence -g -ccopt "-I/home/opam/.opam/4.09/lib/integers" -I _build/src/ctypes  src/ctypes/ctypes_structs_computed.mli
- ocamlfind  ocamlc -package bigarray-compat -package integers   -principal -short-paths -strict-sequence -g -ccopt "-I/home/opam/.opam/4.09/lib/integers"   -c -o _build/src/ctypes/ctypes_structs_computed.cmo -I _build/src/ctypes  src/ctypes/ctypes_structs_computed.ml
- ocamlfind  ocamlopt -bin-annot -c -o _build/src/ctypes/ctypes_type_printing.cmi -package bigarray-compat -package integers    -principal -short-paths -strict-sequence -g -ccopt "-I/home/opam/.opam/4.09/lib/integers" -I _build/src/ctypes  src/ctypes/ctypes_type_printing.mli
- ocamlfind  ocamlc -package bigarray-compat -package integers   -principal -short-paths -strict-sequence -g -ccopt "-I/home/opam/.opam/4.09/lib/integers"   -c -o _build/src/ctypes/ctypes_type_printing.cmo -I _build/src/ctypes  src/ctypes/ctypes_type_printing.ml
- ocamlfind  ocamlc -package bigarray-compat -package integers   -principal -short-paths -strict-sequence -g -ccopt "-I/home/opam/.opam/4.09/lib/integers"   -c -o _build/src/ctypes/ctypes_memory.cmo -I _build/src/ctypes  src/ctypes/ctypes_memory.ml
- ocamlfind  ocamlopt -bin-annot -c -o _build/src/ctypes/ctypes_coerce.cmi -package bigarray-compat -package integers    -principal -short-paths -strict-sequence -g -ccopt "-I/home/opam/.opam/4.09/lib/integers" -I _build/src/ctypes  src/ctypes/ctypes_coerce.mli
- ocamlfind  ocamlc -package bigarray-compat -package integers   -principal -short-paths -strict-sequence -g -ccopt "-I/home/opam/.opam/4.09/lib/integers"   -c -o _build/src/ctypes/ctypes_coerce.cmo -I _build/src/ctypes  src/ctypes/ctypes_coerce.ml
- ocamlfind  ocamlc -package bigarray-compat -package integers   -principal -short-paths -strict-sequence -g -ccopt "-I/home/opam/.opam/4.09/lib/integers"   -c -o _build/src/ctypes/ctypes_std_views.cmo -I _build/src/ctypes  src/ctypes/ctypes_std_views.ml
- ocamlfind  ocamlc -package bigarray-compat -package integers   -principal -short-paths -strict-sequence -g -ccopt "-I/home/opam/.opam/4.09/lib/integers"   -c -o _build/src/ctypes/ctypes_value_printing.cmo -I _build/src/ctypes  src/ctypes/ctypes_value_printing.ml
- ocamlfind  ocamlopt -bin-annot -c -o _build/src/ctypes/ctypes_types.cmi -package bigarray-compat -package integers    -principal -short-paths -strict-sequence -g -ccopt "-I/home/opam/.opam/4.09/lib/integers" -I _build/src/ctypes  src/ctypes/ctypes_types.mli
- ocamlfind  ocamlopt -bin-annot -c -o _build/src/ctypes/ctypes.cmi -package bigarray-compat -package integers    -principal -short-paths -strict-sequence -g -ccopt "-I/home/opam/.opam/4.09/lib/integers" -I _build/src/ctypes  src/ctypes/ctypes.mli
- ocamlfind  ocamlc -package bigarray-compat -package integers   -principal -short-paths -strict-sequence -g -ccopt "-I/home/opam/.opam/4.09/lib/integers"   -c -o _build/src/ctypes/ctypes.cmo -I _build/src/ctypes  src/ctypes/ctypes.ml
- ocamlfind  ocamlopt -bin-annot -c -o _build/src/ctypes/cstubs_internals.cmi -package bigarray-compat -package integers    -principal -short-paths -strict-sequence -g -ccopt "-I/home/opam/.opam/4.09/lib/integers" -I _build/src/ctypes  src/ctypes/cstubs_internals.mli
- ocamlfind  ocamlc -package bigarray-compat -package integers   -principal -short-paths -strict-sequence -g -ccopt "-I/home/opam/.opam/4.09/lib/integers"   -c -o _build/src/ctypes/cstubs_internals.cmo -I _build/src/ctypes  src/ctypes/cstubs_internals.ml
- ocamlfind  ocamlopt -bin-annot -c -o _build/src/ctypes/posixTypes.cmi -package bigarray-compat -package integers    -principal -short-paths -strict-sequence -g -ccopt "-I/home/opam/.opam/4.09/lib/integers" -I _build/src/ctypes  src/ctypes/posixTypes.mli
- ocamlfind  ocamlc -package bigarray-compat -package integers   -principal -short-paths -strict-sequence -g -ccopt "-I/home/opam/.opam/4.09/lib/integers"   -c -o _build/src/ctypes/posixTypes.cmo -I _build/src/ctypes  src/ctypes/posixTypes.ml
- ocamlfind  ocamlc -a -linkall -principal -short-paths -strict-sequence -g -ccopt "-I/home/opam/.opam/4.09/lib/integers"  -cclib -lctypes_stubs -dllib -lctypes_stubs  -cclib -lintegers_stubs -dllib -lintegers_stubs -package bigarray-compat -package integers   -o _build/ctypes.cma _build/src/ctypes/ctypes_ptr.cmo _build/src/ctypes/ctypes_roots_stubs.cmo _build/src/ctypes/lDouble.cmo _build/src/ctypes/ctypes_bigarray_stubs.cmo _build/src/ctypes/complexL.cmo _build/src/ctypes/ctypes_primitive_types.cmo _build/src/ctypes/ctypes_primitives.cmo _build/src/ctypes/ctypes_value_printing_stubs.cmo _build/src/ctypes/ctypes_memory_stubs.cmo _build/src/ctypes/ctypes_bigarray.cmo _build/src/ctypes/ctypes_static.cmo _build/src/ctypes/ctypes_std_view_stubs.cmo _build/src/ctypes/ctypes_structs.cmo _build/src/ctypes/ctypes_structs_computed.cmo _build/src/ctypes/ctypes_type_printing.cmo _build/src/ctypes/ctypes_memory.cmo _build/src/ctypes/ctypes_coerce.cmo _build/src/ctypes/ctypes_std_views.cmo _build/src/ctypes/ctypes_value_printing.cmo _build/src/ctypes/ctypes.cmo _build/src/ctypes/cstubs_internals.cmo _build/src/ctypes/posixTypes.cmo -cclib -Wl,--no-as-needed
- cd _build/src/ctypes && ocamlfind  ocamlc -c -package bigarray-compat -package integers   -ccopt -fPIC -ccopt -Wall -ccopt -g -ccopt "-I/home/opam/.opam/4.09/lib/integers" -ccopt -I -ccopt "/home/opam/.opam/4.09/.opam-switch/build/ctypes.0.20.1/src/ctypes" -ccopt -I -ccopt "/home/opam/.opam/4.09/.opam-switch/build/ctypes.0.20.1/tests" -o complex_stubs.o -principal -short-paths -strict-sequence -g -ccopt "-I/home/opam/.opam/4.09/lib/integers" /home/opam/.opam/4.09/.opam-switch/build/ctypes.0.20.1/src/ctypes/complex_stubs.c
- cd _build/src/ctypes && ocamlfind  ocamlc -c -package bigarray-compat -package integers   -ccopt -fPIC -ccopt -Wall -ccopt -g -ccopt "-I/home/opam/.opam/4.09/lib/integers" -ccopt -I -ccopt "/home/opam/.opam/4.09/.opam-switch/build/ctypes.0.20.1/src/ctypes" -ccopt -I -ccopt "/home/opam/.opam/4.09/.opam-switch/build/ctypes.0.20.1/tests" -o ctypes_bigarrays.o -principal -short-paths -strict-sequence -g -ccopt "-I/home/opam/.opam/4.09/lib/integers" /home/opam/.opam/4.09/.opam-switch/build/ctypes.0.20.1/src/ctypes/ctypes_bigarrays.c
- cd _build/src/ctypes && ocamlfind  ocamlc -c -package bigarray-compat -package integers   -ccopt -fPIC -ccopt -Wall -ccopt -g -ccopt "-I/home/opam/.opam/4.09/lib/integers" -ccopt -I -ccopt "/home/opam/.opam/4.09/.opam-switch/build/ctypes.0.20.1/src/ctypes" -ccopt -I -ccopt "/home/opam/.opam/4.09/.opam-switch/build/ctypes.0.20.1/tests" -o ctypes_roots.o -principal -short-paths -strict-sequence -g -ccopt "-I/home/opam/.opam/4.09/lib/integers" /home/opam/.opam/4.09/.opam-switch/build/ctypes.0.20.1/src/ctypes/ctypes_roots.c
- cd _build/src/ctypes && ocamlfind  ocamlc -c -package bigarray-compat -package integers   -ccopt -fPIC -ccopt -Wall -ccopt -g -ccopt "-I/home/opam/.opam/4.09/lib/integers" -ccopt -I -ccopt "/home/opam/.opam/4.09/.opam-switch/build/ctypes.0.20.1/src/ctypes" -ccopt -I -ccopt "/home/opam/.opam/4.09/.opam-switch/build/ctypes.0.20.1/tests" -o ldouble_stubs.o -principal -short-paths -strict-sequence -g -ccopt "-I/home/opam/.opam/4.09/lib/integers" /home/opam/.opam/4.09/.opam-switch/build/ctypes.0.20.1/src/ctypes/ldouble_stubs.c
- cd _build/src/ctypes && ocamlfind  ocamlc -c -package bigarray-compat -package integers   -ccopt -fPIC -ccopt -Wall -ccopt -g -ccopt "-I/home/opam/.opam/4.09/lib/integers" -ccopt -I -ccopt "/home/opam/.opam/4.09/.opam-switch/build/ctypes.0.20.1/src/ctypes" -ccopt -I -ccopt "/home/opam/.opam/4.09/.opam-switch/build/ctypes.0.20.1/tests" -o managed_buffer_stubs.o -principal -short-paths -strict-sequence -g -ccopt "-I/home/opam/.opam/4.09/lib/integers" /home/opam/.opam/4.09/.opam-switch/build/ctypes.0.20.1/src/ctypes/managed_buffer_stubs.c
- cd _build/src/ctypes && ocamlfind  ocamlc -c -package bigarray-compat -package integers   -ccopt -fPIC -ccopt -Wall -ccopt -g -ccopt "-I/home/opam/.opam/4.09/lib/integers" -ccopt -I -ccopt "/home/opam/.opam/4.09/.opam-switch/build/ctypes.0.20.1/src/ctypes" -ccopt -I -ccopt "/home/opam/.opam/4.09/.opam-switch/build/ctypes.0.20.1/tests" -o posix_types_stubs.o -principal -short-paths -strict-sequence -g -ccopt "-I/home/opam/.opam/4.09/lib/integers" /home/opam/.opam/4.09/.opam-switch/build/ctypes.0.20.1/src/ctypes/posix_types_stubs.c
- cd _build/src/ctypes && ocamlfind  ocamlc -c -package bigarray-compat -package integers   -ccopt -fPIC -ccopt -Wall -ccopt -g -ccopt "-I/home/opam/.opam/4.09/lib/integers" -ccopt -I -ccopt "/home/opam/.opam/4.09/.opam-switch/build/ctypes.0.20.1/src/ctypes" -ccopt -I -ccopt "/home/opam/.opam/4.09/.opam-switch/build/ctypes.0.20.1/tests" -o raw_pointer_stubs.o -principal -short-paths -strict-sequence -g -ccopt "-I/home/opam/.opam/4.09/lib/integers" /home/opam/.opam/4.09/.opam-switch/build/ctypes.0.20.1/src/ctypes/raw_pointer_stubs.c
- cd _build/src/ctypes && ocamlfind  ocamlc -c -package bigarray-compat -package integers   -ccopt -fPIC -ccopt -Wall -ccopt -g -ccopt "-I/home/opam/.opam/4.09/lib/integers" -ccopt -I -ccopt "/home/opam/.opam/4.09/.opam-switch/build/ctypes.0.20.1/src/ctypes" -ccopt -I -ccopt "/home/opam/.opam/4.09/.opam-switch/build/ctypes.0.20.1/tests" -o type_info_stubs.o -principal -short-paths -strict-sequence -g -ccopt "-I/home/opam/.opam/4.09/lib/integers" /home/opam/.opam/4.09/.opam-switch/build/ctypes.0.20.1/src/ctypes/type_info_stubs.c
- ocamlfind  ocamlmklib -o _build/ctypes_stubs _build/src/ctypes/complex_stubs.o _build/src/ctypes/ctypes_bigarrays.o _build/src/ctypes/ctypes_roots.o _build/src/ctypes/ldouble_stubs.o _build/src/ctypes/managed_buffer_stubs.o _build/src/ctypes/posix_types_stubs.o _build/src/ctypes/raw_pointer_stubs.o _build/src/ctypes/type_info_stubs.o  
- ocamlfind  opt -bin-annot -c -o _build/src/ctypes/ctypes_ptr.cmx -package bigarray-compat -package integers   -principal -short-paths -strict-sequence -g -ccopt "-I/home/opam/.opam/4.09/lib/integers"  -package bigarray-compat -package integers    -I _build/src/ctypes  src/ctypes/ctypes_ptr.ml
- ocamlfind  opt -bin-annot -c -o _build/src/ctypes/ctypes_roots_stubs.cmx -package bigarray-compat -package integers   -principal -short-paths -strict-sequence -g -ccopt "-I/home/opam/.opam/4.09/lib/integers"  -package bigarray-compat -package integers    -I _build/src/ctypes  src/ctypes/ctypes_roots_stubs.ml
- ocamlfind  opt -bin-annot -c -o _build/src/ctypes/lDouble.cmx -package bigarray-compat -package integers   -principal -short-paths -strict-sequence -g -ccopt "-I/home/opam/.opam/4.09/lib/integers"  -package bigarray-compat -package integers    -I _build/src/ctypes  src/ctypes/lDouble.ml
- ocamlfind  opt -bin-annot -c -o _build/src/ctypes/ctypes_bigarray_stubs.cmx -package bigarray-compat -package integers   -principal -short-paths -strict-sequence -g -ccopt "-I/home/opam/.opam/4.09/lib/integers"  -package bigarray-compat -package integers    -I _build/src/ctypes  src/ctypes/ctypes_bigarray_stubs.ml
- ocamlfind  opt -bin-annot -c -o _build/src/ctypes/complexL.cmx -package bigarray-compat -package integers   -principal -short-paths -strict-sequence -g -ccopt "-I/home/opam/.opam/4.09/lib/integers"  -package bigarray-compat -package integers    -I _build/src/ctypes  src/ctypes/complexL.ml
- ocamlfind  opt -bin-annot -c -o _build/src/ctypes/ctypes_primitive_types.cmx -package bigarray-compat -package integers   -principal -short-paths -strict-sequence -g -ccopt "-I/home/opam/.opam/4.09/lib/integers"  -package bigarray-compat -package integers    -I _build/src/ctypes  src/ctypes/ctypes_primitive_types.ml
- ocamlfind  opt -bin-annot -c -o _build/src/ctypes/ctypes_primitives.cmx -package bigarray-compat -package integers   -principal -short-paths -strict-sequence -g -ccopt "-I/home/opam/.opam/4.09/lib/integers"  -package bigarray-compat -package integers    -I _build/src/ctypes  src/ctypes/ctypes_primitives.ml
- ocamlfind  opt -bin-annot -c -o _build/src/ctypes/ctypes_value_printing_stubs.cmx -package bigarray-compat -package integers   -principal -short-paths -strict-sequence -g -ccopt "-I/home/opam/.opam/4.09/lib/integers"  -package bigarray-compat -package integers    -I _build/src/ctypes  src/ctypes/ctypes_value_printing_stubs.ml
- ocamlfind  opt -bin-annot -c -o _build/src/ctypes/ctypes_memory_stubs.cmx -package bigarray-compat -package integers   -principal -short-paths -strict-sequence -g -ccopt "-I/home/opam/.opam/4.09/lib/integers"  -package bigarray-compat -package integers    -I _build/src/ctypes  src/ctypes/ctypes_memory_stubs.ml
- ocamlfind  opt -bin-annot -c -o _build/src/ctypes/ctypes_bigarray.cmx -package bigarray-compat -package integers   -principal -short-paths -strict-sequence -g -ccopt "-I/home/opam/.opam/4.09/lib/integers"  -package bigarray-compat -package integers    -I _build/src/ctypes  src/ctypes/ctypes_bigarray.ml
- ocamlfind  opt -bin-annot -c -o _build/src/ctypes/ctypes_static.cmx -package bigarray-compat -package integers   -principal -short-paths -strict-sequence -g -ccopt "-I/home/opam/.opam/4.09/lib/integers"  -package bigarray-compat -package integers    -I _build/src/ctypes  src/ctypes/ctypes_static.ml
- ocamlfind  opt -bin-annot -c -o _build/src/ctypes/ctypes_std_view_stubs.cmx -package bigarray-compat -package integers   -principal -short-paths -strict-sequence -g -ccopt "-I/home/opam/.opam/4.09/lib/integers"  -package bigarray-compat -package integers    -I _build/src/ctypes  src/ctypes/ctypes_std_view_stubs.ml
- ocamlfind  opt -bin-annot -c -o _build/src/ctypes/ctypes_structs.cmx -package bigarray-compat -package integers   -principal -short-paths -strict-sequence -g -ccopt "-I/home/opam/.opam/4.09/lib/integers"  -package bigarray-compat -package integers    -I _build/src/ctypes  src/ctypes/ctypes_structs.ml
- ocamlfind  opt -bin-annot -c -o _build/src/ctypes/ctypes_structs_computed.cmx -package bigarray-compat -package integers   -principal -short-paths -strict-sequence -g -ccopt "-I/home/opam/.opam/4.09/lib/integers"  -package bigarray-compat -package integers    -I _build/src/ctypes  src/ctypes/ctypes_structs_computed.ml
- ocamlfind  opt -bin-annot -c -o _build/src/ctypes/ctypes_type_printing.cmx -package bigarray-compat -package integers   -principal -short-paths -strict-sequence -g -ccopt "-I/home/opam/.opam/4.09/lib/integers"  -package bigarray-compat -package integers    -I _build/src/ctypes  src/ctypes/ctypes_type_printing.ml
- ocamlfind  opt -bin-annot -c -o _build/src/ctypes/ctypes_memory.cmx -package bigarray-compat -package integers   -principal -short-paths -strict-sequence -g -ccopt "-I/home/opam/.opam/4.09/lib/integers"  -package bigarray-compat -package integers    -I _build/src/ctypes  src/ctypes/ctypes_memory.ml
- ocamlfind  opt -bin-annot -c -o _build/src/ctypes/ctypes_coerce.cmx -package bigarray-compat -package integers   -principal -short-paths -strict-sequence -g -ccopt "-I/home/opam/.opam/4.09/lib/integers"  -package bigarray-compat -package integers    -I _build/src/ctypes  src/ctypes/ctypes_coerce.ml
- ocamlfind  opt -bin-annot -c -o _build/src/ctypes/ctypes_std_views.cmx -package bigarray-compat -package integers   -principal -short-paths -strict-sequence -g -ccopt "-I/home/opam/.opam/4.09/lib/integers"  -package bigarray-compat -package integers    -I _build/src/ctypes  src/ctypes/ctypes_std_views.ml
- ocamlfind  opt -bin-annot -c -o _build/src/ctypes/ctypes_value_printing.cmx -package bigarray-compat -package integers   -principal -short-paths -strict-sequence -g -ccopt "-I/home/opam/.opam/4.09/lib/integers"  -package bigarray-compat -package integers    -I _build/src/ctypes  src/ctypes/ctypes_value_printing.ml
- ocamlfind  opt -bin-annot -c -o _build/src/ctypes/ctypes.cmx -package bigarray-compat -package integers   -principal -short-paths -strict-sequence -g -ccopt "-I/home/opam/.opam/4.09/lib/integers"  -package bigarray-compat -package integers    -I _build/src/ctypes  src/ctypes/ctypes.ml
- ocamlfind  opt -bin-annot -c -o _build/src/ctypes/cstubs_internals.cmx -package bigarray-compat -package integers   -principal -short-paths -strict-sequence -g -ccopt "-I/home/opam/.opam/4.09/lib/integers"  -package bigarray-compat -package integers    -I _build/src/ctypes  src/ctypes/cstubs_internals.ml
- ocamlfind  opt -bin-annot -c -o _build/src/ctypes/posixTypes.cmx -package bigarray-compat -package integers   -principal -short-paths -strict-sequence -g -ccopt "-I/home/opam/.opam/4.09/lib/integers"  -package bigarray-compat -package integers    -I _build/src/ctypes  src/ctypes/posixTypes.ml
- ocamlfind  opt -a -linkall -principal -short-paths -strict-sequence -g -ccopt "-I/home/opam/.opam/4.09/lib/integers"  -package bigarray-compat -package integers   -cclib -lctypes_stubs  -cclib -lintegers_stubs -o _build/ctypes.cmxa _build/src/ctypes/ctypes_ptr.cmx _build/src/ctypes/ctypes_roots_stubs.cmx _build/src/ctypes/lDouble.cmx _build/src/ctypes/ctypes_bigarray_stubs.cmx _build/src/ctypes/complexL.cmx _build/src/ctypes/ctypes_primitive_types.cmx _build/src/ctypes/ctypes_primitives.cmx _build/src/ctypes/ctypes_value_printing_stubs.cmx _build/src/ctypes/ctypes_memory_stubs.cmx _build/src/ctypes/ctypes_bigarray.cmx _build/src/ctypes/ctypes_static.cmx _build/src/ctypes/ctypes_std_view_stubs.cmx _build/src/ctypes/ctypes_structs.cmx _build/src/ctypes/ctypes_structs_computed.cmx _build/src/ctypes/ctypes_type_printing.cmx _build/src/ctypes/ctypes_memory.cmx _build/src/ctypes/ctypes_coerce.cmx _build/src/ctypes/ctypes_std_views.cmx _build/src/ctypes/ctypes_value_printing.cmx _build/src/ctypes/ctypes.cmx _build/src/ctypes/cstubs_internals.cmx _build/src/ctypes/posixTypes.cmx -cclib -Wl,--no-as-needed
- ocamlfind  opt -shared -linkall -principal -short-paths -strict-sequence -g -ccopt "-I/home/opam/.opam/4.09/lib/integers"  -package bigarray-compat -package integers   -o _build/ctypes.cmxs _build/src/ctypes/ctypes_ptr.cmx _build/src/ctypes/ctypes_roots_stubs.cmx _build/src/ctypes/lDouble.cmx _build/src/ctypes/ctypes_bigarray_stubs.cmx _build/src/ctypes/complexL.cmx _build/src/ctypes/ctypes_primitive_types.cmx _build/src/ctypes/ctypes_primitives.cmx _build/src/ctypes/ctypes_value_printing_stubs.cmx _build/src/ctypes/ctypes_memory_stubs.cmx _build/src/ctypes/ctypes_bigarray.cmx _build/src/ctypes/ctypes_static.cmx _build/src/ctypes/ctypes_std_view_stubs.cmx _build/src/ctypes/ctypes_structs.cmx _build/src/ctypes/ctypes_structs_computed.cmx _build/src/ctypes/ctypes_type_printing.cmx _build/src/ctypes/ctypes_memory.cmx _build/src/ctypes/ctypes_coerce.cmx _build/src/ctypes/ctypes_std_views.cmx _build/src/ctypes/ctypes_value_printing.cmx _build/src/ctypes/ctypes.cmx _build/src/ctypes/cstubs_internals.cmx _build/src/ctypes/posixTypes.cmx _build/src/ctypes/complex_stubs.o _build/src/ctypes/ctypes_bigarrays.o _build/src/ctypes/ctypes_roots.o _build/src/ctypes/ldouble_stubs.o _build/src/ctypes/managed_buffer_stubs.o _build/src/ctypes/posix_types_stubs.o _build/src/ctypes/raw_pointer_stubs.o _build/src/ctypes/type_info_stubs.o -cclib -Wl,--no-as-needed
- ocamlfind  ocamlopt -bin-annot -c -o _build/src/ctypes-top/ctypes_printers.cmi -package compiler-libs -package integers    -principal -short-paths -strict-sequence -g -ccopt "-I/home/opam/.opam/4.09/lib/integers" -I _build/src/ctypes-top  -I _build/src/ctypes src/ctypes-top/ctypes_printers.mli
- findlib: [WARNING] Interface topdirs.cmi occurs in several directories: /home/opam/.opam/4.09/lib/ocaml, /home/opam/.opam/4.09/lib/ocaml/compiler-libs
- ocamlfind  ocamlc -package compiler-libs -package integers   -principal -short-paths -strict-sequence -g -ccopt "-I/home/opam/.opam/4.09/lib/integers"   -c -o _build/src/ctypes-top/ctypes_printers.cmo -I _build/src/ctypes-top  -I _build/src/ctypes src/ctypes-top/ctypes_printers.ml
- findlib: [WARNING] Interface topdirs.cmi occurs in several directories: /home/opam/.opam/4.09/lib/ocaml, /home/opam/.opam/4.09/lib/ocaml/compiler-libs
- ocamlfind  ocamlc -package compiler-libs -package integers   -principal -short-paths -strict-sequence -g -ccopt "-I/home/opam/.opam/4.09/lib/integers"   -c -o _build/src/ctypes-top/install_ctypes_printers.cmo -I _build/src/ctypes-top  -I _build/src/ctypes src/ctypes-top/install_ctypes_printers.ml
- findlib: [WARNING] Interface topdirs.cmi occurs in several directories: /home/opam/.opam/4.09/lib/ocaml, /home/opam/.opam/4.09/lib/ocaml/compiler-libs
- ocamlfind  ocamlc -a -linkall -principal -short-paths -strict-sequence -g -ccopt "-I/home/opam/.opam/4.09/lib/integers"    -package compiler-libs -package integers   -o _build/ctypes-top.cma _build/src/ctypes-top/ctypes_printers.cmo _build/src/ctypes-top/install_ctypes_printers.cmo -cclib -Wl,--no-as-needed
- findlib: [WARNING] Interface topdirs.cmi occurs in several directories: /home/opam/.opam/4.09/lib/ocaml, /home/opam/.opam/4.09/lib/ocaml/compiler-libs
- ocamlfind  opt -bin-annot -c -o _build/src/ctypes-top/ctypes_printers.cmx -package compiler-libs -package integers   -principal -short-paths -strict-sequence -g -ccopt "-I/home/opam/.opam/4.09/lib/integers"  -package compiler-libs -package integers    -I _build/src/ctypes-top  -I _build/src/ctypes src/ctypes-top/ctypes_printers.ml
- findlib: [WARNING] Interface topdirs.cmi occurs in several directories: /home/opam/.opam/4.09/lib/ocaml, /home/opam/.opam/4.09/lib/ocaml/compiler-libs
- ocamlfind  opt -bin-annot -c -o _build/src/ctypes-top/install_ctypes_printers.cmx -package compiler-libs -package integers   -principal -short-paths -strict-sequence -g -ccopt "-I/home/opam/.opam/4.09/lib/integers"  -package compiler-libs -package integers    -I _build/src/ctypes-top  -I _build/src/ctypes src/ctypes-top/install_ctypes_printers.ml
- findlib: [WARNING] Interface topdirs.cmi occurs in several directories: /home/opam/.opam/4.09/lib/ocaml, /home/opam/.opam/4.09/lib/ocaml/compiler-libs
- File "_none_", line 1:
- Warning 58: no cmx file was found in path for module Toploop, and its interface was not compiled with -opaque
- ocamlfind  opt -a -linkall -principal -short-paths -strict-sequence -g -ccopt "-I/home/opam/.opam/4.09/lib/integers"  -package compiler-libs -package integers     -o _build/ctypes-top.cmxa _build/src/ctypes-top/ctypes_printers.cmx _build/src/ctypes-top/install_ctypes_printers.cmx -cclib -Wl,--no-as-needed
- findlib: [WARNING] Interface topdirs.cmi occurs in several directories: /home/opam/.opam/4.09/lib/ocaml, /home/opam/.opam/4.09/lib/ocaml/compiler-libs
- ocamlfind  opt -shared -linkall -principal -short-paths -strict-sequence -g -ccopt "-I/home/opam/.opam/4.09/lib/integers"  -package compiler-libs -package integers   -o _build/ctypes-top.cmxs _build/src/ctypes-top/ctypes_printers.cmx _build/src/ctypes-top/install_ctypes_printers.cmx  -cclib -Wl,--no-as-needed
- findlib: [WARNING] Interface topdirs.cmi occurs in several directories: /home/opam/.opam/4.09/lib/ocaml, /home/opam/.opam/4.09/lib/ocaml/compiler-libs
- ocamlfind  ocamlopt -bin-annot -c -o _build/src/cstubs/cstubs_analysis.cmi -package str -package integers    -principal -short-paths -strict-sequence -g -ccopt "-I/home/opam/.opam/4.09/lib/integers" -I _build/src/cstubs  -I _build/src/ctypes src/cstubs/cstubs_analysis.mli
- ocamlfind  ocamlc -package str -package integers   -principal -short-paths -strict-sequence -g -ccopt "-I/home/opam/.opam/4.09/lib/integers"   -c -o _build/src/cstubs/cstubs_analysis.cmo -I _build/src/cstubs  -I _build/src/ctypes src/cstubs/cstubs_analysis.ml
- ocamlfind  ocamlopt -bin-annot -c -o _build/src/cstubs/cstubs_errors.cmi -package str -package integers    -principal -short-paths -strict-sequence -g -ccopt "-I/home/opam/.opam/4.09/lib/integers" -I _build/src/cstubs  -I _build/src/ctypes src/cstubs/cstubs_errors.mli
- ocamlfind  ocamlc -package str -package integers   -principal -short-paths -strict-sequence -g -ccopt "-I/home/opam/.opam/4.09/lib/integers"   -c -o _build/src/cstubs/cstubs_errors.cmo -I _build/src/cstubs  -I _build/src/ctypes src/cstubs/cstubs_errors.ml
- ocamlfind  ocamlopt -bin-annot -c -o _build/src/cstubs/ctypes_path.cmi -package str -package integers    -principal -short-paths -strict-sequence -g -ccopt "-I/home/opam/.opam/4.09/lib/integers" -I _build/src/cstubs  -I _build/src/ctypes src/cstubs/ctypes_path.mli
- ocamlfind  ocamlc -package str -package integers   -principal -short-paths -strict-sequence -g -ccopt "-I/home/opam/.opam/4.09/lib/integers"   -c -o _build/src/cstubs/ctypes_path.cmo -I _build/src/cstubs  -I _build/src/ctypes src/cstubs/ctypes_path.ml
- ocamlfind  ocamlopt -bin-annot -c -o _build/src/cstubs/cstubs_public_name.cmi -package str -package integers    -principal -short-paths -strict-sequence -g -ccopt "-I/home/opam/.opam/4.09/lib/integers" -I _build/src/cstubs  -I _build/src/ctypes src/cstubs/cstubs_public_name.mli
- ocamlfind  ocamlc -package str -package integers   -principal -short-paths -strict-sequence -g -ccopt "-I/home/opam/.opam/4.09/lib/integers"   -c -o _build/src/cstubs/cstubs_public_name.cmo -I _build/src/cstubs  -I _build/src/ctypes src/cstubs/cstubs_public_name.ml
- ocamlfind  ocamlopt -bin-annot -c -o _build/src/cstubs/cstubs_generate_ml.cmi -package str -package integers    -principal -short-paths -strict-sequence -g -ccopt "-I/home/opam/.opam/4.09/lib/integers" -I _build/src/cstubs  -I _build/src/ctypes src/cstubs/cstubs_generate_ml.mli
- ocamlfind  ocamlc -package str -package integers   -principal -short-paths -strict-sequence -g -ccopt "-I/home/opam/.opam/4.09/lib/integers"   -c -o _build/src/cstubs/cstubs_generate_ml.cmo -I _build/src/cstubs  -I _build/src/ctypes src/cstubs/cstubs_generate_ml.ml
- ocamlfind  ocamlc -package str -package integers   -principal -short-paths -strict-sequence -g -ccopt "-I/home/opam/.opam/4.09/lib/integers"   -c -o _build/src/cstubs/cstubs_c_language.cmo -I _build/src/cstubs  -I _build/src/ctypes src/cstubs/cstubs_c_language.ml
- ocamlfind  ocamlc -package str -package integers   -principal -short-paths -strict-sequence -g -ccopt "-I/home/opam/.opam/4.09/lib/integers"   -c -o _build/src/cstubs/cstubs_emit_c.cmo -I _build/src/cstubs  -I _build/src/ctypes src/cstubs/cstubs_emit_c.ml
- ocamlfind  ocamlopt -bin-annot -c -o _build/src/cstubs/cstubs_generate_c.cmi -package str -package integers    -principal -short-paths -strict-sequence -g -ccopt "-I/home/opam/.opam/4.09/lib/integers" -I _build/src/cstubs  -I _build/src/ctypes src/cstubs/cstubs_generate_c.mli
- ocamlfind  ocamlc -package str -package integers   -principal -short-paths -strict-sequence -g -ccopt "-I/home/opam/.opam/4.09/lib/integers"   -c -o _build/src/cstubs/cstubs_generate_c.cmo -I _build/src/cstubs  -I _build/src/ctypes src/cstubs/cstubs_generate_c.ml
- ocamlfind  ocamlopt -bin-annot -c -o _build/src/cstubs/cstubs_inverted.cmi -package str -package integers    -principal -short-paths -strict-sequence -g -ccopt "-I/home/opam/.opam/4.09/lib/integers" -I _build/src/cstubs  -I _build/src/ctypes src/cstubs/cstubs_inverted.mli
- ocamlfind  ocamlc -package str -package integers   -principal -short-paths -strict-sequence -g -ccopt "-I/home/opam/.opam/4.09/lib/integers"   -c -o _build/src/cstubs/cstubs_inverted.cmo -I _build/src/cstubs  -I _build/src/ctypes src/cstubs/cstubs_inverted.ml
- ocamlfind  ocamlopt -bin-annot -c -o _build/src/cstubs/cstubs_structs.cmi -package str -package integers    -principal -short-paths -strict-sequence -g -ccopt "-I/home/opam/.opam/4.09/lib/integers" -I _build/src/cstubs  -I _build/src/ctypes src/cstubs/cstubs_structs.mli
- ocamlfind  ocamlc -package str -package integers   -principal -short-paths -strict-sequence -g -ccopt "-I/home/opam/.opam/4.09/lib/integers"   -c -o _build/src/cstubs/cstubs_structs.cmo -I _build/src/cstubs  -I _build/src/ctypes src/cstubs/cstubs_structs.ml
- ocamlfind  ocamlopt -bin-annot -c -o _build/src/cstubs/cstubs.cmi -package str -package integers    -principal -short-paths -strict-sequence -g -ccopt "-I/home/opam/.opam/4.09/lib/integers" -I _build/src/cstubs  -I _build/src/ctypes src/cstubs/cstubs.mli
- ocamlfind  ocamlc -package str -package integers   -principal -short-paths -strict-sequence -g -ccopt "-I/home/opam/.opam/4.09/lib/integers"   -c -o _build/src/cstubs/cstubs.cmo -I _build/src/cstubs  -I _build/src/ctypes src/cstubs/cstubs.ml
- ocamlfind  ocamlc -a -linkall -principal -short-paths -strict-sequence -g -ccopt "-I/home/opam/.opam/4.09/lib/integers"    -package str -package integers   -o _build/cstubs.cma _build/src/cstubs/cstubs_analysis.cmo _build/src/cstubs/cstubs_errors.cmo _build/src/cstubs/ctypes_path.cmo _build/src/cstubs/cstubs_public_name.cmo _build/src/cstubs/cstubs_generate_ml.cmo _build/src/cstubs/cstubs_c_language.cmo _build/src/cstubs/cstubs_emit_c.cmo _build/src/cstubs/cstubs_generate_c.cmo _build/src/cstubs/cstubs_inverted.cmo _build/src/cstubs/cstubs_structs.cmo _build/src/cstubs/cstubs.cmo -cclib -Wl,--no-as-needed
- ocamlfind  opt -bin-annot -c -o _build/src/cstubs/cstubs_analysis.cmx -package str -package integers   -principal -short-paths -strict-sequence -g -ccopt "-I/home/opam/.opam/4.09/lib/integers"  -package str -package integers    -I _build/src/cstubs  -I _build/src/ctypes src/cstubs/cstubs_analysis.ml
- ocamlfind  opt -bin-annot -c -o _build/src/cstubs/cstubs_errors.cmx -package str -package integers   -principal -short-paths -strict-sequence -g -ccopt "-I/home/opam/.opam/4.09/lib/integers"  -package str -package integers    -I _build/src/cstubs  -I _build/src/ctypes src/cstubs/cstubs_errors.ml
- ocamlfind  opt -bin-annot -c -o _build/src/cstubs/ctypes_path.cmx -package str -package integers   -principal -short-paths -strict-sequence -g -ccopt "-I/home/opam/.opam/4.09/lib/integers"  -package str -package integers    -I _build/src/cstubs  -I _build/src/ctypes src/cstubs/ctypes_path.ml
- ocamlfind  opt -bin-annot -c -o _build/src/cstubs/cstubs_public_name.cmx -package str -package integers   -principal -short-paths -strict-sequence -g -ccopt "-I/home/opam/.opam/4.09/lib/integers"  -package str -package integers    -I _build/src/cstubs  -I _build/src/ctypes src/cstubs/cstubs_public_name.ml
- ocamlfind  opt -bin-annot -c -o _build/src/cstubs/cstubs_generate_ml.cmx -package str -package integers   -principal -short-paths -strict-sequence -g -ccopt "-I/home/opam/.opam/4.09/lib/integers"  -package str -package integers    -I _build/src/cstubs  -I _build/src/ctypes src/cstubs/cstubs_generate_ml.ml
- ocamlfind  opt -bin-annot -c -o _build/src/cstubs/cstubs_c_language.cmx -package str -package integers   -principal -short-paths -strict-sequence -g -ccopt "-I/home/opam/.opam/4.09/lib/integers"  -package str -package integers    -I _build/src/cstubs  -I _build/src/ctypes src/cstubs/cstubs_c_language.ml
- ocamlfind  opt -bin-annot -c -o _build/src/cstubs/cstubs_emit_c.cmx -package str -package integers   -principal -short-paths -strict-sequence -g -ccopt "-I/home/opam/.opam/4.09/lib/integers"  -package str -package integers    -I _build/src/cstubs  -I _build/src/ctypes src/cstubs/cstubs_emit_c.ml
- ocamlfind  opt -bin-annot -c -o _build/src/cstubs/cstubs_generate_c.cmx -package str -package integers   -principal -short-paths -strict-sequence -g -ccopt "-I/home/opam/.opam/4.09/lib/integers"  -package str -package integers    -I _build/src/cstubs  -I _build/src/ctypes src/cstubs/cstubs_generate_c.ml
- ocamlfind  opt -bin-annot -c -o _build/src/cstubs/cstubs_inverted.cmx -package str -package integers   -principal -short-paths -strict-sequence -g -ccopt "-I/home/opam/.opam/4.09/lib/integers"  -package str -package integers    -I _build/src/cstubs  -I _build/src/ctypes src/cstubs/cstubs_inverted.ml
- ocamlfind  opt -bin-annot -c -o _build/src/cstubs/cstubs_structs.cmx -package str -package integers   -principal -short-paths -strict-sequence -g -ccopt "-I/home/opam/.opam/4.09/lib/integers"  -package str -package integers    -I _build/src/cstubs  -I _build/src/ctypes src/cstubs/cstubs_structs.ml
- ocamlfind  opt -bin-annot -c -o _build/src/cstubs/cstubs.cmx -package str -package integers   -principal -short-paths -strict-sequence -g -ccopt "-I/home/opam/.opam/4.09/lib/integers"  -package str -package integers    -I _build/src/cstubs  -I _build/src/ctypes src/cstubs/cstubs.ml
- ocamlfind  opt -a -linkall -principal -short-paths -strict-sequence -g -ccopt "-I/home/opam/.opam/4.09/lib/integers"  -package str -package integers     -o _build/cstubs.cmxa _build/src/cstubs/cstubs_analysis.cmx _build/src/cstubs/cstubs_errors.cmx _build/src/cstubs/ctypes_path.cmx _build/src/cstubs/cstubs_public_name.cmx _build/src/cstubs/cstubs_generate_ml.cmx _build/src/cstubs/cstubs_c_language.cmx _build/src/cstubs/cstubs_emit_c.cmx _build/src/cstubs/cstubs_generate_c.cmx _build/src/cstubs/cstubs_inverted.cmx _build/src/cstubs/cstubs_structs.cmx _build/src/cstubs/cstubs.cmx -cclib -Wl,--no-as-needed
- ocamlfind  opt -shared -linkall -principal -short-paths -strict-sequence -g -ccopt "-I/home/opam/.opam/4.09/lib/integers"  -package str -package integers   -o _build/cstubs.cmxs _build/src/cstubs/cstubs_analysis.cmx _build/src/cstubs/cstubs_errors.cmx _build/src/cstubs/ctypes_path.cmx _build/src/cstubs/cstubs_public_name.cmx _build/src/cstubs/cstubs_generate_ml.cmx _build/src/cstubs/cstubs_c_language.cmx _build/src/cstubs/cstubs_emit_c.cmx _build/src/cstubs/cstubs_generate_c.cmx _build/src/cstubs/cstubs_inverted.cmx _build/src/cstubs/cstubs_structs.cmx _build/src/cstubs/cstubs.cmx  -cclib -Wl,--no-as-needed
-> compiled  ctypes.0.20.1
Processing 39/41: [ctypes: make install]
+ /home/opam/.opam/opam-init/hooks/sandbox.sh "install" "make" "install" "XEN=disable" (CWD=/home/opam/.opam/4.09/.opam-switch/build/ctypes.0.20.1)
- ocamlfind  install ctypes META CHANGES.md
- Installed /home/opam/.opam/4.09/lib/ctypes/CHANGES.md
- Installed /home/opam/.opam/4.09/lib/ctypes/META
- ocamlfind  install -add ctypes -optional  _build/ctypes.cma _build/dllctypes_stubs.so  _build/ctypes.cmxa _build/ctypes.cmxs _build/libctypes_stubs.a  _build/ctypes.a src/ctypes/lDouble.mli src/ctypes/complexL.mli src/ctypes/ctypes.mli src/ctypes/posixTypes.mli src/ctypes/ctypes_types.mli _build/src/ctypes/lDouble.cmi _build/src/ctypes/complexL.cmi _build/src/ctypes/ctypes.cmi _build/src/ctypes/posixTypes.cmi _build/src/ctypes/ctypes_types.cmi _build/src/ctypes/ctypes_static.cmi _build/src/ctypes/ctypes_primitive_types.cmi _build/src/ctypes/ctypes_structs.cmi _build/src/ctypes/cstubs_internals.cmi _build/src/ctypes/lDouble.cmt _build/src/ctypes/complexL.cmt _build/src/ctypes/ctypes.cmt _build/src/ctypes/posixTypes.cmt _build/src/ctypes/ctypes_types.cmt _build/src/ctypes/lDouble.cmti _build/src/ctypes/complexL.cmti _build/src/ctypes/ctypes.cmti _build/src/ctypes/posixTypes.cmti _build/src/ctypes/ctypes_types.cmti src/ctypes/cstubs_internals.h src/ctypes/ctypes_complex_compatibility.h src/ctypes/ctypes_complex_stubs.h src/ctypes/ctypes_cstubs_internals.h src/ctypes/ctypes_ldouble_stubs.h src/ctypes/ctypes_managed_buffer_stubs.h src/ctypes/ctypes_primitives.h src/ctypes/ctypes_raw_pointer.h src/ctypes/ctypes_type_info_stubs.h  _build/src/ctypes/ctypes_ptr.cmx _build/src/ctypes/ctypes_roots_stubs.cmx _build/src/ctypes/lDouble.cmx _build/src/ctypes/ctypes_bigarray_stubs.cmx _build/src/ctypes/complexL.cmx _build/src/ctypes/ctypes_primitive_types.cmx _build/src/ctypes/ctypes_primitives.cmx _build/src/ctypes/ctypes_value_printing_stubs.cmx _build/src/ctypes/ctypes_memory_stubs.cmx _build/src/ctypes/ctypes_bigarray.cmx _build/src/ctypes/ctypes_static.cmx _build/src/ctypes/ctypes_std_view_stubs.cmx _build/src/ctypes/ctypes_structs.cmx _build/src/ctypes/ctypes_structs_computed.cmx _build/src/ctypes/ctypes_type_printing.cmx _build/src/ctypes/ctypes_memory.cmx _build/src/ctypes/ctypes_coerce.cmx _build/src/ctypes/ctypes_std_views.cmx _build/src/ctypes/ctypes_value_printing.cmx _build/src/ctypes/ctypes.cmx _build/src/ctypes/cstubs_internals.cmx _build/src/ctypes/posixTypes.cmx
- Installed /home/opam/.opam/4.09/lib/ctypes/posixTypes.cmx
- Installed /home/opam/.opam/4.09/lib/ctypes/cstubs_internals.cmx
- Installed /home/opam/.opam/4.09/lib/ctypes/ctypes.cmx
- Installed /home/opam/.opam/4.09/lib/ctypes/ctypes_value_printing.cmx
- Installed /home/opam/.opam/4.09/lib/ctypes/ctypes_std_views.cmx
- Installed /home/opam/.opam/4.09/lib/ctypes/ctypes_coerce.cmx
- Installed /home/opam/.opam/4.09/lib/ctypes/ctypes_memory.cmx
- Installed /home/opam/.opam/4.09/lib/ctypes/ctypes_type_printing.cmx
- Installed /home/opam/.opam/4.09/lib/ctypes/ctypes_structs_computed.cmx
- Installed /home/opam/.opam/4.09/lib/ctypes/ctypes_structs.cmx
- Installed /home/opam/.opam/4.09/lib/ctypes/ctypes_std_view_stubs.cmx
- Installed /home/opam/.opam/4.09/lib/ctypes/ctypes_static.cmx
- Installed /home/opam/.opam/4.09/lib/ctypes/ctypes_bigarray.cmx
- Installed /home/opam/.opam/4.09/lib/ctypes/ctypes_memory_stubs.cmx
- Installed /home/opam/.opam/4.09/lib/ctypes/ctypes_value_printing_stubs.cmx
- Installed /home/opam/.opam/4.09/lib/ctypes/ctypes_primitives.cmx
- Installed /home/opam/.opam/4.09/lib/ctypes/ctypes_primitive_types.cmx
- Installed /home/opam/.opam/4.09/lib/ctypes/complexL.cmx
- Installed /home/opam/.opam/4.09/lib/ctypes/ctypes_bigarray_stubs.cmx
- Installed /home/opam/.opam/4.09/lib/ctypes/lDouble.cmx
- Installed /home/opam/.opam/4.09/lib/ctypes/ctypes_roots_stubs.cmx
- Installed /home/opam/.opam/4.09/lib/ctypes/ctypes_ptr.cmx
- Installed /home/opam/.opam/4.09/lib/ctypes/ctypes_type_info_stubs.h
- Installed /home/opam/.opam/4.09/lib/ctypes/ctypes_raw_pointer.h
- Installed /home/opam/.opam/4.09/lib/ctypes/ctypes_primitives.h
- Installed /home/opam/.opam/4.09/lib/ctypes/ctypes_managed_buffer_stubs.h
- Installed /home/opam/.opam/4.09/lib/ctypes/ctypes_ldouble_stubs.h
- Installed /home/opam/.opam/4.09/lib/ctypes/ctypes_cstubs_internals.h
- Installed /home/opam/.opam/4.09/lib/ctypes/ctypes_complex_stubs.h
- Installed /home/opam/.opam/4.09/lib/ctypes/ctypes_complex_compatibility.h
- Installed /home/opam/.opam/4.09/lib/ctypes/cstubs_internals.h
- Installed /home/opam/.opam/4.09/lib/ctypes/ctypes_types.cmti
- Installed /home/opam/.opam/4.09/lib/ctypes/posixTypes.cmti
- Installed /home/opam/.opam/4.09/lib/ctypes/ctypes.cmti
- Installed /home/opam/.opam/4.09/lib/ctypes/complexL.cmti
- Installed /home/opam/.opam/4.09/lib/ctypes/lDouble.cmti
- Installed /home/opam/.opam/4.09/lib/ctypes/posixTypes.cmt
- Installed /home/opam/.opam/4.09/lib/ctypes/ctypes.cmt
- Installed /home/opam/.opam/4.09/lib/ctypes/complexL.cmt
- Installed /home/opam/.opam/4.09/lib/ctypes/lDouble.cmt
- Installed /home/opam/.opam/4.09/lib/ctypes/cstubs_internals.cmi
- Installed /home/opam/.opam/4.09/lib/ctypes/ctypes_structs.cmi
- Installed /home/opam/.opam/4.09/lib/ctypes/ctypes_primitive_types.cmi
- Installed /home/opam/.opam/4.09/lib/ctypes/ctypes_static.cmi
- Installed /home/opam/.opam/4.09/lib/ctypes/ctypes_types.cmi
- Installed /home/opam/.opam/4.09/lib/ctypes/posixTypes.cmi
- Installed /home/opam/.opam/4.09/lib/ctypes/ctypes.cmi
- Installed /home/opam/.opam/4.09/lib/ctypes/complexL.cmi
- Installed /home/opam/.opam/4.09/lib/ctypes/lDouble.cmi
- Installed /home/opam/.opam/4.09/lib/ctypes/ctypes_types.mli
- Installed /home/opam/.opam/4.09/lib/ctypes/posixTypes.mli
- Installed /home/opam/.opam/4.09/lib/ctypes/ctypes.mli
- Installed /home/opam/.opam/4.09/lib/ctypes/complexL.mli
- Installed /home/opam/.opam/4.09/lib/ctypes/lDouble.mli
- Installed /home/opam/.opam/4.09/lib/ctypes/ctypes.a
- Installed /home/opam/.opam/4.09/lib/ctypes/libctypes_stubs.a
- Installed /home/opam/.opam/4.09/lib/ctypes/ctypes.cmxs
- Installed /home/opam/.opam/4.09/lib/ctypes/ctypes.cmxa
- Installed /home/opam/.opam/4.09/lib/ctypes/ctypes.cma
- Installed /home/opam/.opam/4.09/lib/stublibs/dllctypes_stubs.so
- Installed /home/opam/.opam/4.09/lib/stublibs/dllctypes_stubs.so.owner
- ocamlfind: [WARNING] You have installed DLLs but the directory /home/opam/.opam/4.09/lib/stublibs is not mentioned in ld.conf
- ocamlfind  install -add ctypes -optional  _build/ctypes-top.cma   _build/ctypes-top.cmxa _build/ctypes-top.cmxs   _build/ctypes-top.a src/ctypes-top/ctypes_printers.mli _build/src/ctypes-top/ctypes_printers.cmi  _build/src/ctypes-top/ctypes_printers.cmt _build/src/ctypes-top/ctypes_printers.cmti   _build/src/ctypes-top/ctypes_printers.cmx _build/src/ctypes-top/install_ctypes_printers.cmx
- Installed /home/opam/.opam/4.09/lib/ctypes/install_ctypes_printers.cmx
- Installed /home/opam/.opam/4.09/lib/ctypes/ctypes_printers.cmx
- Installed /home/opam/.opam/4.09/lib/ctypes/ctypes_printers.cmti
- Installed /home/opam/.opam/4.09/lib/ctypes/ctypes_printers.cmt
- Installed /home/opam/.opam/4.09/lib/ctypes/ctypes_printers.cmi
- Installed /home/opam/.opam/4.09/lib/ctypes/ctypes_printers.mli
- Installed /home/opam/.opam/4.09/lib/ctypes/ctypes-top.a
- Installed /home/opam/.opam/4.09/lib/ctypes/ctypes-top.cmxs
- Installed /home/opam/.opam/4.09/lib/ctypes/ctypes-top.cmxa
- Installed /home/opam/.opam/4.09/lib/ctypes/ctypes-top.cma
- ocamlfind  install -add ctypes -optional  _build/ctypes-foreign.cma _build/dllctypes-foreign_stubs.so  _build/ctypes-foreign.cmxa _build/ctypes-foreign.cmxs _build/libctypes-foreign_stubs.a  _build/ctypes-foreign.a src/ctypes-foreign/dl.mli src/ctypes-foreign/libffi_abi.mli src/ctypes-foreign/foreign.mli _build/src/ctypes-foreign/dl.cmi _build/src/ctypes-foreign/libffi_abi.cmi _build/src/ctypes-foreign/foreign.cmi  _build/src/ctypes-foreign/dl.cmt _build/src/ctypes-foreign/libffi_abi.cmt _build/src/ctypes-foreign/foreign.cmt _build/src/ctypes-foreign/dl.cmti _build/src/ctypes-foreign/libffi_abi.cmti _build/src/ctypes-foreign/foreign.cmti   _build/src/ctypes-foreign/ctypes_closure_properties.cmx _build/src/ctypes-foreign/ctypes_ffi_stubs.cmx _build/src/ctypes-foreign/ctypes_foreign_threaded_stubs.cmx _build/src/ctypes-foreign/ctypes_weak_ref.cmx _build/src/ctypes-foreign/dl.cmx _build/src/ctypes-foreign/libffi_abi.cmx _build/src/ctypes-foreign/ctypes_ffi.cmx _build/src/ctypes-foreign/ctypes_foreign_basis.cmx _build/src/ctypes-foreign/foreign.cmx
- Installed /home/opam/.opam/4.09/lib/ctypes/foreign.mli
- Installed /home/opam/.opam/4.09/lib/ctypes/libffi_abi.mli
- Installed /home/opam/.opam/4.09/lib/ctypes/dl.mli
- ocamlfind  install -add ctypes -optional  _build/cstubs.cma   _build/cstubs.cmxa _build/cstubs.cmxs   _build/cstubs.a src/cstubs/cstubs_structs.mli src/cstubs/cstubs.mli src/cstubs/cstubs_inverted.mli _build/src/cstubs/cstubs_structs.cmi _build/src/cstubs/cstubs.cmi _build/src/cstubs/cstubs_inverted.cmi  _build/src/cstubs/cstubs_structs.cmt _build/src/cstubs/cstubs.cmt _build/src/cstubs/cstubs_inverted.cmt _build/src/cstubs/cstubs_structs.cmti _build/src/cstubs/cstubs.cmti _build/src/cstubs/cstubs_inverted.cmti  /home/opam/.opam/4.09/lib/integers/ocaml_integers.h _build/src/cstubs/cstubs_analysis.cmx _build/src/cstubs/cstubs_errors.cmx _build/src/cstubs/ctypes_path.cmx _build/src/cstubs/cstubs_public_name.cmx _build/src/cstubs/cstubs_generate_ml.cmx _build/src/cstubs/cstubs_c_language.cmx _build/src/cstubs/cstubs_emit_c.cmx _build/src/cstubs/cstubs_generate_c.cmx _build/src/cstubs/cstubs_inverted.cmx _build/src/cstubs/cstubs_structs.cmx _build/src/cstubs/cstubs.cmx
- Installed /home/opam/.opam/4.09/lib/ctypes/cstubs.cmx
- Installed /home/opam/.opam/4.09/lib/ctypes/cstubs_structs.cmx
- Installed /home/opam/.opam/4.09/lib/ctypes/cstubs_inverted.cmx
- Installed /home/opam/.opam/4.09/lib/ctypes/cstubs_generate_c.cmx
- Installed /home/opam/.opam/4.09/lib/ctypes/cstubs_emit_c.cmx
- Installed /home/opam/.opam/4.09/lib/ctypes/cstubs_c_language.cmx
- Installed /home/opam/.opam/4.09/lib/ctypes/cstubs_generate_ml.cmx
- Installed /home/opam/.opam/4.09/lib/ctypes/cstubs_public_name.cmx
- Installed /home/opam/.opam/4.09/lib/ctypes/ctypes_path.cmx
- Installed /home/opam/.opam/4.09/lib/ctypes/cstubs_errors.cmx
- Installed /home/opam/.opam/4.09/lib/ctypes/cstubs_analysis.cmx
- Installed /home/opam/.opam/4.09/lib/ctypes/ocaml_integers.h
- Installed /home/opam/.opam/4.09/lib/ctypes/cstubs_inverted.cmti
- Installed /home/opam/.opam/4.09/lib/ctypes/cstubs.cmti
- Installed /home/opam/.opam/4.09/lib/ctypes/cstubs_structs.cmti
- Installed /home/opam/.opam/4.09/lib/ctypes/cstubs_inverted.cmt
- Installed /home/opam/.opam/4.09/lib/ctypes/cstubs.cmt
- Installed /home/opam/.opam/4.09/lib/ctypes/cstubs_structs.cmt
- Installed /home/opam/.opam/4.09/lib/ctypes/cstubs_inverted.cmi
- Installed /home/opam/.opam/4.09/lib/ctypes/cstubs.cmi
- Installed /home/opam/.opam/4.09/lib/ctypes/cstubs_structs.cmi
- Installed /home/opam/.opam/4.09/lib/ctypes/cstubs_inverted.mli
- Installed /home/opam/.opam/4.09/lib/ctypes/cstubs.mli
- Installed /home/opam/.opam/4.09/lib/ctypes/cstubs_structs.mli
- Installed /home/opam/.opam/4.09/lib/ctypes/cstubs.a
- Installed /home/opam/.opam/4.09/lib/ctypes/cstubs.cmxs
- Installed /home/opam/.opam/4.09/lib/ctypes/cstubs.cmxa
- Installed /home/opam/.opam/4.09/lib/ctypes/cstubs.cma
-> installed ctypes.0.20.1
Processing 40/41: [ahrocksdb: dune build]
+ /home/opam/.opam/opam-init/hooks/sandbox.sh "build" "dune" "build" "-p" "ahrocksdb" "-j" "31" (CWD=/home/opam/.opam/4.09/.opam-switch/build/ahrocksdb.0.2.2)
- File "ffi/lib/dune", line 23, characters 0-155:
- 23 | (rule
- 24 |  (targets c_flags.sexp c_library_flags.sexp c_flags.txt c_library_flags.txt)
- 25 |  (deps    (:discover config/discover.exe))
- 26 |  (action  (run %{discover})))
- (cd _build/default/ffi/lib && config/discover.exe)
- failed to find an include path for RocksDB: are development headers installed on your system ?
- tested paths: /usr/local/include/rocksdb /usr/include/rocksdb
- compiling c program:
-  | 
-  | 
-  | #include <c.h>
-  | #include <version.h>
-  | 
-  | int main() {
-  |   rocksdb_options_t* opt = rocksdb_options_create();
-  |   rocksdb_options_destroy(opt);
-  |   return 0;
-  | };
-  | 
- run: gcc -O2 -fno-strict-aliasing -fwrapv -fPIC -I/usr/local/include/rocksdb -I /home/opam/.opam/4.09/lib/ocaml -o /opam-tmp/build_fce309_dune/ocaml-configurator4bb029/c-test-0/test.exe /opam-tmp/build_fce309_dune/ocaml-configurator4bb029/c-test-0/test.c -lm -lrocksdb
- -> process exited with code 1
- -> stdout:
- -> stderr:
-  | /opam-tmp/build_fce309_dune/ocaml-configurator4bb029/c-test-0/test.c:3:10: fatal error: c.h: No such file or directory
-  |     3 | #include <c.h>
-  |       |          ^~~~~
-  | compilation terminated.
- compiling c program:
-  | 
-  | 
-  | #include <c.h>
-  | #include <version.h>
-  | 
-  | int main() {
-  |   rocksdb_options_t* opt = rocksdb_options_create();
-  |   rocksdb_options_destroy(opt);
-  |   return 0;
-  | };
-  | 
- run: gcc -O2 -fno-strict-aliasing -fwrapv -fPIC -I/usr/include/rocksdb -I /home/opam/.opam/4.09/lib/ocaml -o /opam-tmp/build_fce309_dune/ocaml-configurator4bb029/c-test-2/test.exe /opam-tmp/build_fce309_dune/ocaml-configurator4bb029/c-test-2/test.c -lm -lrocksdb
- -> process exited with code 1
- -> stdout:
- -> stderr:
-  | In file included from /opam-tmp/build_fce309_dune/ocaml-configurator4bb029/c-test-2/test.c:4:
-  | /usr/include/rocksdb/version.h:7:10: fatal error: string: No such file or directory
-  |     7 | #include <string>
-  |       |          ^~~~~~~~
-  | compilation terminated.
- Error: discover error
[ERROR] The compilation of ahrocksdb.0.2.2 failed at "dune build -p ahrocksdb -j 31".

#=== ERROR while compiling ahrocksdb.0.2.2 ====================================#
# context              2.2.0~alpha~dev | linux/x86_64 | ocaml-base-compiler.4.09.1 | file:///home/opam/opam-repository
# path                 ~/.opam/4.09/.opam-switch/build/ahrocksdb.0.2.2
# command              ~/.opam/opam-init/hooks/sandbox.sh build dune build -p ahrocksdb -j 31
# exit-code            1
# env-file             ~/.opam/log/ahrocksdb-8-bef21e.env
# output-file          ~/.opam/log/ahrocksdb-8-bef21e.out
### output ###
# File "ffi/lib/dune", line 23, characters 0-155:
# 23 | (rule
# 24 |  (targets c_flags.sexp c_library_flags.sexp c_flags.txt c_library_flags.txt)
# 25 |  (deps    (:discover config/discover.exe))
# 26 |  (action  (run %{discover})))
# (cd _build/default/ffi/lib && config/discover.exe)
# failed to find an include path for RocksDB: are development headers installed on your system ?
# tested paths: /usr/local/include/rocksdb /usr/include/rocksdb
# compiling c program:
#  | 
#  | 
#  | #include <c.h>
#  | #include <version.h>
#  | 
#  | int main() {
#  |   rocksdb_options_t* opt = rocksdb_options_create();
#  |   rocksdb_options_destroy(opt);
#  |   return 0;
#  | };
#  | 
# run: gcc -O2 -fno-strict-aliasing -fwrapv -fPIC -I/usr/local/include/rocksdb -I /home/opam/.opam/4.09/lib/ocaml -o /opam-tmp/build_fce309_dune/ocaml-configurator4bb029/c-test-0/test.exe /opam-tmp/build_fce309_dune/ocaml-configurator4bb029/c-test-0/test.c -lm -lrocksdb
# -> process exited with code 1
# -> stdout:
# -> stderr:
#  | /opam-tmp/build_fce309_dune/ocaml-configurator4bb029/c-test-0/test.c:3:10: fatal error: c.h: No such file or directory
#  |     3 | #include <c.h>
#  |       |          ^~~~~
#  | compilation terminated.
# compiling c program:
#  | 
#  | 
#  | #include <c.h>
#  | #include <version.h>
#  | 
#  | int main() {
#  |   rocksdb_options_t* opt = rocksdb_options_create();
#  |   rocksdb_options_destroy(opt);
#  |   return 0;
#  | };
#  | 
# run: gcc -O2 -fno-strict-aliasing -fwrapv -fPIC -I/usr/include/rocksdb -I /home/opam/.opam/4.09/lib/ocaml -o /opam-tmp/build_fce309_dune/ocaml-configurator4bb029/c-test-2/test.exe /opam-tmp/build_fce309_dune/ocaml-configurator4bb029/c-test-2/test.c -lm -lrocksdb
# -> process exited with code 1
# -> stdout:
# -> stderr:
#  | In file included from /opam-tmp/build_fce309_dune/ocaml-configurator4bb029/c-test-2/test.c:4:
#  | /usr/include/rocksdb/version.h:7:10: fatal error: string: No such file or directory
#  |     7 | #include <string>
#  |       |          ^~~~~~~~
#  | compilation terminated.
# Error: discover error



<><> Error report <><><><><><><><><><><><><><><><><><><><><><><><><><><><><><><>
+- The following actions failed
| - build ahrocksdb 0.2.2
+- 
+- The following changes have been performed
| - install astring           0.8.5
| - install bigarray-compat   1.1.0
| - install conf-rocksdb      1
| - install csexp             1.5.1
| - install ctypes            0.20.1
| - install dune              3.4.1
| - install dune-configurator 3.4.1
| - install integers          0.7.0
| - install ocamlbuild        0.14.1
| - install ocamlfind         1.9.5
| - install rresult           0.7.0
| - install stdlib-shims      0.3.0
| - install topkg             1.0.5
+- 
# Run eval $(opam env) to update the current shell environment

The former state can be restored with:
    /usr/bin/opam switch import "/home/opam/.opam/4.09/.opam-switch/backup/state-20220902112859.export"
'opam install -vy ahrocksdb.0.2.2' failed.
"/bin/bash" "-c"
"
opam remove -y "ahrocksdb.0.2.2"
opam install -vy "ahrocksdb.0.2.2"
res=$?
if [ $res = 31 ]; then
    if opam show -f x-ci-accept-failures: "ahrocksdb.0.2.2" | grep -q '"debian-unstable"'; then
        echo "This package failed and has been disabled for CI using the 'x-ci-accept-failures' field."
        exit 69
    fi
fi


exit $res
" failed with exit status 31
Failed: Build failed