OCamllabs icon Home|Differences with the last checks|Previous runs


Building on x86-bm-10.ocamllabs.io

(from ocaml/opam:debian-unstable@sha256:3794ee62a7fce85a684ef8d17a97b2f35a24f0d7e270c1c064f789e115ce2680)
Unable to find image 'ocaml/opam:debian-unstable@sha256:3794ee62a7fce85a684ef8d17a97b2f35a24f0d7e270c1c064f789e115ce2680' locally
docker.io/ocaml/opam@sha256:3794ee62a7fce85a684ef8d17a97b2f35a24f0d7e270c1c064f789e115ce2680: Pulling from ocaml/opam
f5e1f8c89883: Already exists
2c958ca589db: Already exists
c8ed9a5d2d5a: Pulling fs layer
c8ed9a5d2d5a: Verifying Checksum
c8ed9a5d2d5a: Download complete
c8ed9a5d2d5a: Pull complete
Digest: sha256:3794ee62a7fce85a684ef8d17a97b2f35a24f0d7e270c1c064f789e115ce2680
Status: Downloaded newer image for ocaml/opam@sha256:3794ee62a7fce85a684ef8d17a97b2f35a24f0d7e270c1c064f789e115ce2680
2022-06-21 01:19.58 ---> using "bc6ddede489eb9279cf9755493c550ebcf9992e17ae0035d89337b3a0266ee1d" from cache

/: (user (uid 1000) (gid 1000))

/: (env OPAMPRECISETRACKING 1)

/: (env OPAMUTF8 never)

/: (env OPAMEXTERNALSOLVER builtin-0install)

/: (env OPAMCRITERIA +removed)

/: (run (shell "sudo ln -f /usr/bin/opam-dev /usr/bin/opam"))
2022-06-21 01:19.58 ---> using "2193bfc3c6e974e1eed1a3239ffa54bf12d29cbc1f806facc7ae48af2584e8ce" from cache

/: (run (network host)
        (shell "rm -rf ~/opam-repository && git clone -q 'https://github.com/ocaml/opam-repository' ~/opam-repository && git -C ~/opam-repository checkout -q 0b80c2d48dae2b07798f39c00665a40ead379c1f"))
2022-06-21 01:19.58 ---> using "0872a7876b6114f71f0b61f873dc10a666ae2aba5e7460d1543c68652172324d" from cache

/: (run (shell "rm -rf ~/.opam && opam init -ya --bare --config ~/.opamrc-sandbox ~/opam-repository"))
Configuring from /home/opam/.opamrc-sandbox, then /home/opam/.opamrc, and finally from built-in defaults.
Checking for available remotes: rsync and local, git.
  - you won't be able to use mercurial repositories unless you install the hg command on your system.
  - you won't be able to use darcs repositories unless you install the darcs command on your system.


<><> Fetching repository information ><><><><><><><><><><><><><><><><><><><><><>
[default] Initialised

User configuration:
  ~/.profile is already up-to-date.
[NOTE] Make sure that ~/.profile is well sourced in your ~/.bashrc.

2022-06-21 01:19.58 ---> using "a664420c8d230348a7667a27e590157b3ecd012f463afd05a7f19049d5741277" from cache

/: (run (cache (opam-archives (target /home/opam/.opam/download-cache)))
        (network host)
        (shell "opam switch create --repositories=default '5.0' '5.0.0+trunk'"))

<><> Installing new switch packages <><><><><><><><><><><><><><><><><><><><><><>
Switch invariant: ["ocaml-variants" {= "5.0.0+trunk"}]

<><> Processing actions <><><><><><><><><><><><><><><><><><><><><><><><><><><><>
-> installed base-bigarray.base
-> installed base-threads.base
-> installed base-unix.base
-> retrieved ocaml-variants.5.0.0+trunk  (https://github.com/ocaml/ocaml/archive/5.0.tar.gz)
-> installed ocaml-variants.5.0.0+trunk
-> installed ocaml-config.3
-> installed ocaml.5.0.0
-> installed base-domains.base
-> installed base-nnp.base
Done.
# Run eval $(opam env --switch=5.0) to update the current shell environment
2022-06-21 01:19.58 ---> using "015774a9f910c58f72f1006c543a6cd93998c29c8953b2a36744e74d2c8ed5d4" from cache

/: (run (network host)
        (shell "opam update --depexts"))
+ /usr/bin/sudo "apt-get" "update"
- Get:1 http://deb.debian.org/debian unstable InRelease [165 kB]
- Get:2 http://deb.debian.org/debian unstable/main amd64 Packages.diff/Index [63.6 kB]
- Get:3 http://deb.debian.org/debian unstable/main amd64 Packages T-2022-06-20-1403.37-F-2022-06-14-2004.21.pdiff [430 kB]
- Get:3 http://deb.debian.org/debian unstable/main amd64 Packages T-2022-06-20-1403.37-F-2022-06-14-2004.21.pdiff [430 kB]
- Fetched 659 kB in 3s (229 kB/s)
- Reading package lists...
2022-06-21 01:19.58 ---> using "a25ff7379f403192d1fef7293f67d9c74d52f7e9becaa9ff899793081dd9fd29" from cache

/: (run (cache (opam-archives (target /home/opam/.opam/download-cache)))
        (network host)
        (shell  "\
               \nopam remove -y \"archsat.1.1\"\
               \nopam install -vy \"archsat.1.1\"\
               \nres=$?\
               \nif [ $res = 31 ]; then\
               \n    if opam show -f x-ci-accept-failures: \"archsat.1.1\" | grep -q '\"debian-unstable\"'; then\
               \n        echo \"This package failed and has been disabled for CI using the 'x-ci-accept-failures' field.\"\
               \n        exit 69\
               \n    fi\
               \nfi\
               \n\
               \n\
               \nexit $res\
               \n"))
[NOTE] archsat.1.1 is not installed.

Nothing to do.
The following actions will be performed:
=== install 27 packages
  - install archsat           1.1
  - install base-bytes        base     [required by gen, iter]
  - install cmdliner          1.1.1    [required by archsat]
  - install conf-gmp          4        [required by zarith]
  - install containers        2.8.1    [required by archsat]
  - install csexp             1.5.1    [required by dune-configurator]
  - install dolmen            0.4.1    [required by archsat]
  - install dune              3.3.0    [required by ocamlgraph, gen, containers, etc.]
  - install dune-configurator 3.3.0    [required by gen, containers, iter]
  - install gen               1.0      [required by archsat]
  - install iter              1.4      [required by archsat]
  - install menhir            20220210 [required by dolmen]
  - install menhirLib         20220210 [required by menhir]
  - install menhirSdk         20220210 [required by menhir]
  - install msat              0.7      [required by archsat]
  - install mtime             1.3.0    [required by archsat]
  - install ocamlbuild        0.14.1   [required by archsat]
  - install ocamlfind         1.9.5    [required by archsat]
  - install ocamlgraph        2.0.0    [required by archsat]
  - install result            1.5      [required by iter]
  - install seq               base     [required by gen, containers, spelll]
  - install spelll            0.4      [required by archsat]
  - install stdlib-shims      0.3.0    [required by ocamlgraph, spelll]
  - install topkg             1.0.5    [required by mtime, uucp]
  - install uucp              14.0.0   [required by archsat]
  - install uutf              1.0.3    [required by archsat]
  - install zarith            1.12     [required by archsat]

The following system packages will first need to be installed:
    libgmp-dev

<><> Handling external dependencies <><><><><><><><><><><><><><><><><><><><><><>

opam believes some required external dependencies are missing. opam can:
> 1. Run apt-get to install them (may need root/sudo access)
  2. Display the recommended apt-get command and wait while you run it manually (e.g. in another terminal)
  3. Attempt installation anyway, and permanently register that this external dependency is present, but not detectable
  4. Abort the installation

[1/2/3/4] 1
+ /usr/bin/sudo "apt-get" "install" "-qq" "-yy" "libgmp-dev"
- debconf: delaying package configuration, since apt-utils is not installed
- Selecting previously unselected package libgmpxx4ldbl:amd64.
- (Reading database ... 
(Reading database ... 5%
(Reading database ... 10%
(Reading database ... 15%
(Reading database ... 20%
(Reading database ... 25%
(Reading database ... 30%
(Reading database ... 35%
(Reading database ... 40%
(Reading database ... 45%
(Reading database ... 50%
(Reading database ... 55%
(Reading database ... 60%
(Reading database ... 65%
(Reading database ... 70%
(Reading database ... 75%
(Reading database ... 80%
(Reading database ... 85%
(Reading database ... 90%
(Reading database ... 95%
(Reading database ... 100%
(Reading database ... 18686 files and directories currently installed.)
- Preparing to unpack .../libgmpxx4ldbl_2%3a6.2.1+dfsg1-1_amd64.deb ...
- Unpacking libgmpxx4ldbl:amd64 (2:6.2.1+dfsg1-1) ...
- Selecting previously unselected package libgmp-dev:amd64.
- Preparing to unpack .../libgmp-dev_2%3a6.2.1+dfsg1-1_amd64.deb ...
- Unpacking libgmp-dev:amd64 (2:6.2.1+dfsg1-1) ...
- Setting up libgmpxx4ldbl:amd64 (2:6.2.1+dfsg1-1) ...
- Setting up libgmp-dev:amd64 (2:6.2.1+dfsg1-1) ...
- Processing triggers for libc-bin (2.33-7) ...

<><> Processing actions <><><><><><><><><><><><><><><><><><><><><><><><><><><><>
Processing  1/78:
Processing  2/78:
Processing  3/78:
Processing  4/78:
Processing  5/78:
Processing  6/78: [conf-gmp: sh]
-> retrieved containers.2.8.1  (cached)
Processing  7/78: [conf-gmp: sh]
-> retrieved archsat.1.1  (cached)
Processing  8/78: [dolmen.0.4.1: http] [conf-gmp: sh]
-> retrieved cmdliner.1.1.1  (cached)
Processing  9/78: [dolmen.0.4.1: http] [conf-gmp: sh]
Processing 10/78: [dolmen.0.4.1: http] [cmdliner: make all] [conf-gmp: sh]
+ /home/opam/.opam/opam-init/hooks/sandbox.sh "build" "sh" "-exc" "cc -c $CFLAGS -I/usr/local/include test.c" (CWD=/home/opam/.opam/5.0/.opam-switch/build/conf-gmp.4)
- + cc -c -I/usr/local/include test.c
-> compiled  conf-gmp.4
Processing 10/78: [dolmen.0.4.1: http] [cmdliner: make all]
-> installed conf-gmp.4
Processing 11/78: [dolmen.0.4.1: http] [cmdliner: make all]
-> retrieved csexp.1.5.1  (cached)
Processing 12/78: [dolmen.0.4.1: http] [cmdliner: make all]
-> retrieved gen.1.0  (cached)
Processing 13/78: [dolmen.0.4.1: http] [cmdliner: make all]
-> retrieved iter.1.4  (cached)
Processing 14/78: [dolmen.0.4.1: http] [cmdliner: make all]
Processing 14/78: [cmdliner: make all]
-> retrieved menhir.20220210, menhirLib.20220210, menhirSdk.20220210  (cached)
Processing 15/78: [cmdliner: make all]
-> retrieved dolmen.0.4.1  (https://github.com/ocaml/opam-source-archives/raw/main/dolmen-0.4.1.tar.gz)
Processing 16/78: [cmdliner: make all]
-> retrieved msat.0.7  (cached)
Processing 17/78: [cmdliner: make all]
-> retrieved dune.3.3.0, dune-configurator.3.3.0  (cached)
Processing 18/78: [cmdliner: make all]
Processing 19/78: [cmdliner: make all] [dune: ocaml bootstrap.ml]
-> retrieved mtime.1.3.0  (cached)
Processing 20/78: [cmdliner: make all] [dune: ocaml bootstrap.ml]
-> retrieved ocamlbuild.0.14.1  (cached)
Processing 21/78: [cmdliner: make all] [dune: ocaml bootstrap.ml]
Processing 22/78: [cmdliner: make all] [dune: ocaml bootstrap.ml] [ocamlbuild: make configure.make]
-> retrieved ocamlfind.1.9.5  (cached)
Processing 23/78: [cmdliner: make all] [dune: ocaml bootstrap.ml] [ocamlbuild: make configure.make]
Processing 24/78: [cmdliner: make all] [dune: ocaml bootstrap.ml] [ocamlbuild: make configure.make]
Processing 25/78: [cmdliner: make all] [dune: ocaml bootstrap.ml] [ocamlbuild: make configure.make] [ocamlfind: ./configure]
Processing 26/78: [cmdliner: make all] [dune: ocaml bootstrap.ml] [ocamlbuild: make configure.make] [ocamlfind: ./configure]
-> installed seq.base
Processing 27/78: [cmdliner: make all] [dune: ocaml bootstrap.ml] [ocamlbuild: make configure.make] [ocamlfind: ./configure]
-> retrieved ocamlgraph.2.0.0  (cached)
Processing 28/78: [cmdliner: make all] [dune: ocaml bootstrap.ml] [ocamlbuild: make configure.make] [ocamlfind: ./configure]
-> retrieved result.1.5  (cached)
Processing 29/78: [cmdliner: make all] [dune: ocaml bootstrap.ml] [ocamlbuild: make configure.make] [ocamlfind: ./configure]
-> retrieved spelll.0.4  (cached)
Processing 30/78: [cmdliner: make all] [dune: ocaml bootstrap.ml] [ocamlbuild: make configure.make] [ocamlfind: ./configure]
-> retrieved stdlib-shims.0.3.0  (cached)
Processing 31/78: [cmdliner: make all] [dune: ocaml bootstrap.ml] [ocamlbuild: make configure.make] [ocamlfind: ./configure]
-> retrieved uutf.1.0.3  (cached)
Processing 32/78: [cmdliner: make all] [dune: ocaml bootstrap.ml] [ocamlbuild: make configure.make] [ocamlfind: ./configure]
+ /home/opam/.opam/opam-init/hooks/sandbox.sh "build" "make" "-f" "configure.make" "all" "OCAMLBUILD_PREFIX=/home/opam/.opam/5.0" "OCAMLBUILD_BINDIR=/home/opam/.opam/5.0/bin" "OCAMLBUILD_LIBDIR=/home/opam/.opam/5.0/lib" "OCAMLBUILD_MANDIR=/home/opam/.opam/5.0/man" "OCAML_NATIVE=true" "OCAML_NATIVE_TOOLS=true" (CWD=/home/opam/.opam/5.0/.opam-switch/build/ocamlbuild.0.14.1)
- (echo "# This file was generated from configure.make"; \
- echo ;\
- echo "OCAML_PREFIX="; \
- echo "OCAML_BINDIR=/home/opam/.opam/5.0/bin"; \
- echo "OCAML_LIBDIR=/home/opam/.opam/5.0/lib/ocaml"; \
- echo "OCAML_MANDIR=/home/opam/.opam/5.0/man"; \
- echo ;\
- echo "EXT_OBJ=.o"; \
- echo "EXT_ASM=.s"; \
- echo "EXT_LIB=.a"; \
- echo "EXT_DLL=.so"; \
- echo "EXE="; \
- echo ;\
- echo "OCAML_NATIVE=true"; \
- echo "OCAML_NATIVE_TOOLS=true"; \
- echo "NATDYNLINK=true"; \
- echo "SUPPORT_SHARED_LIBRARIES=true"; \
- echo ;\
- echo "PREFIX=/home/opam/.opam/5.0"; \
- echo "BINDIR=/home/opam/.opam/5.0/bin"; \
- echo "LIBDIR=/home/opam/.opam/5.0/lib"; \
- echo "MANDIR=/home/opam/.opam/5.0/man"; \
- ) > Makefile.config
- (echo "(* This file was generated from ../configure.make *)"; \
- echo ;\
- echo 'let bindir = "/home/opam/.opam/5.0/bin"'; \
- echo 'let libdir = "/home/opam/.opam/5.0/lib"'; \
- echo 'let ocaml_libdir = "/home/opam/.opam/5.0/lib/ocaml"'; \
- echo 'let libdir_abs = "/home/opam/.opam/5.0/lib"'; \
- echo 'let ocaml_native = true'; \
- echo 'let ocaml_native_tools = true'; \
- echo 'let supports_shared_libraries = true';\
- echo 'let a = "a"'; \
- echo 'let o = "o"'; \
- echo 'let so = "so"'; \
- echo 'let ext_dll = ".so"'; \
- echo 'let exe = ""'; \
- echo 'let version = "0.14.1"'; \
- ) > src/ocamlbuild_config.ml
Processing 32/78: [cmdliner: make all] [dune: ocaml bootstrap.ml] [ocamlbuild: make check-if-preinstalled] [ocamlfind: ./configure]
-> retrieved zarith.1.12  (cached)
-> retrieved topkg.1.0.5  (cached)
-> retrieved uucp.14.0.0  (cached)
+ /home/opam/.opam/opam-init/hooks/sandbox.sh "build" "./configure" "-bindir" "/home/opam/.opam/5.0/bin" "-sitelib" "/home/opam/.opam/5.0/lib" "-mandir" "/home/opam/.opam/5.0/man" "-config" "/home/opam/.opam/5.0/lib/findlib.conf" "-no-custom" "-no-camlp4" (CWD=/home/opam/.opam/5.0/.opam-switch/build/ocamlfind.1.9.5)
- Welcome to findlib version 1.9.5
- Configuring core...
- Checking for #remove_directory...
- Testing threading model...
- systhread_supported: true
- Testing DLLs...
- Testing whether ppxopt can be supported...
- Checking for ocamlc -opaque...
- Querying installation: META list not found
- make install will double-check installed META files
- Configuring libraries...
- unix: found (in +unix)
- dynlink: found (in +dynlink)
- bigarray: not present (possible since 4.08)
- compiler-libs: found
- dbm: not present (normal since 4.00)
- graphics: not present (normal since 4.09)
- num: not present (normal since 4.06)
- ocamlbuild: not present (normal since 4.03)
- ocamldoc: found (in +ocamldoc)
- raw_spacetime: not present (normal since 4.12)
- threads: found (in +threads)
- runtime_events: found (in +runtime_events)
- str: found (in +str)
- labltk: not present (normal since 4.02)
- native dynlink: found
- camlp4: disabled
- bytes: found, installing fake library
- Configuration for stdlib written to site-lib-src/stdlib/META
- Configuration for unix written to site-lib-src/unix/META
- Configuration for dynlink written to site-lib-src/dynlink/META
- Configuration for compiler-libs written to site-lib-src/compiler-libs/META
- Configuration for ocamldoc written to site-lib-src/ocamldoc/META
- Configuration for threads written to site-lib-src/threads/META
- Configuration for runtime_events written to site-lib-src/runtime_events/META
- Configuration for str written to site-lib-src/str/META
- Configuration for bytes written to site-lib-src/bytes/META
- Detecting compiler arguments: (extractor built) ok
- 
- About the OCAML core installation:
-     Standard library:      /home/opam/.opam/5.0/lib/ocaml
-     Binaries:              /home/opam/.opam/5.0/bin
-     Manual pages:          /home/opam/.opam/5.0/man
-     Multi-threading type:  posix
- The directory of site-specific packages will be
-     site-lib:              /home/opam/.opam/5.0/lib
- The configuration file is written to:
-     findlib config file:   /home/opam/.opam/5.0/lib/findlib.conf
- Software will be installed:
-     Libraries:             in <site-lib>/findlib
-     Binaries:              /home/opam/.opam/5.0/bin
-     Manual pages:          /home/opam/.opam/5.0/man
-     topfind script:        /home/opam/.opam/5.0/lib/ocaml
- Topfind ppxopt support:    yes
- Toolbox:                   no
- Link custom runtime:       no
- Need bytes compatibility:  no
- 
- Configuration has been written to Makefile.config
- 
- You can now do 'make all', and optionally 'make opt', to build ocamlfind.
Processing 32/78: [cmdliner: make all] [dune: ocaml bootstrap.ml] [ocamlbuild: make check-if-preinstalled] [ocamlfind: make all]
+ /home/opam/.opam/opam-init/hooks/sandbox.sh "build" "make" "all" "PREFIX=/home/opam/.opam/5.0" (CWD=/home/opam/.opam/5.0/.opam-switch/build/cmdliner.1.1.1)
- ocaml build.ml cma
- ocaml build.ml cmxa
- ocaml build.ml cmxs
-> compiled  cmdliner.1.1.1
Processing 32/78: [dune: ocaml bootstrap.ml] [ocamlbuild: make check-if-preinstalled] [ocamlfind: make all]
Processing 33/78: [dune: ocaml bootstrap.ml] [ocamlbuild: make check-if-preinstalled] [ocamlfind: make all] [cmdliner: make install]
+ /home/opam/.opam/opam-init/hooks/sandbox.sh "build" "make" "all" (CWD=/home/opam/.opam/5.0/.opam-switch/build/ocamlfind.1.9.5)
- for p in findlib; do ( cd src/$p; make all ) || exit; done
- make[1]: Entering directory '/home/opam/.opam/5.0/.opam-switch/build/ocamlfind.1.9.5/src/findlib'
- ocamllex fl_meta.mll
- 22 states, 392 transitions, table size 1700 bytes
- USE_CYGPATH="0"; \
- export USE_CYGPATH; \
- cat findlib_config.mlp | \
-          ../../tools/patch '@CONFIGFILE@' '/home/opam/.opam/5.0/lib/findlib.conf' | \
-          ../../tools/patch '@STDLIB@' '/home/opam/.opam/5.0/lib/ocaml' | \
- 	sed -e 's;@AUTOLINK@;true;g' \
- 	    -e 's;@SYSTEM@;linux;g' \
- 	     >findlib_config.ml
- if [ "true" = "true" ]; then                 \
- 	cp topfind.ml.in topfind.ml;                             \
- else                                                             \
- 	sed -e '/PPXOPT_BEGIN/,/PPXOPT_END/ d' topfind.ml.in     \
- 		> topfind.ml ;                                   \
- fi
- ocamldep *.ml *.mli >depend
- ocamlc -I +compiler-libs -opaque   -I +unix -I +dynlink -g -c findlib_config.ml
- ocamlc -I +compiler-libs -opaque   -I +unix -I +dynlink -g -c fl_split.ml
- ocamlc -I +compiler-libs -opaque   -I +unix -I +dynlink -g -c fl_metatoken.ml
- ocamlc -I +compiler-libs -opaque   -I +unix -I +dynlink -g -c fl_meta.ml
- ocamlc -I +compiler-libs -opaque   -I +unix -I +dynlink -c fl_metascanner.mli
- ocamlc -I +compiler-libs -opaque   -I +unix -I +dynlink -g -c fl_metascanner.ml
- ocamlc -I +compiler-libs -opaque   -I +unix -I +dynlink -c fl_topo.mli
- ocamlc -I +compiler-libs -opaque   -I +unix -I +dynlink -g -c fl_topo.ml
- ocamlc -I +compiler-libs -opaque   -I +unix -I +dynlink -c fl_package_base.mli
- ocamlc -I +compiler-libs -opaque   -I +unix -I +dynlink -g -c fl_package_base.ml
- File "fl_package_base.ml", line 304, characters 22-40:
- 304 | 	 let pkg_ancestors = query_requirements predlist pkg in
-       	                     ^^^^^^^^^^^^^^^^^^
- Warning 6 [labels-omitted]: label preds was omitted in the application of this function.
- File "fl_package_base.ml", line 350, characters 18-36:
- 350 |   let ancestors = query_requirements predlist package_name in
-                         ^^^^^^^^^^^^^^^^^^
- Warning 6 [labels-omitted]: label preds was omitted in the application of this function.
- File "fl_package_base.ml", line 375, characters 23-41:
- 375 | 	  let pkg_ancestors = query_requirements predlist pkg in
-       	                      ^^^^^^^^^^^^^^^^^^
- Warning 6 [labels-omitted]: label preds was omitted in the application of this function.
- File "fl_package_base.ml", line 510, characters 16-35:
- 510 | 	     ( let c = package_definitions search_path pkg.package_name in
-       	               ^^^^^^^^^^^^^^^^^^^
- Warning 6 [labels-omitted]: label search_path was omitted in the application of this function.
- ocamlc -I +compiler-libs -opaque   -I +unix -I +dynlink -c findlib.mli
- ocamlc -I +compiler-libs -opaque   -I +unix -I +dynlink -g -c findlib.ml
- File "findlib.ml", line 390, characters 2-26:
- 390 |   Fl_package_base.requires predlist pkg
-         ^^^^^^^^^^^^^^^^^^^^^^^^
- Warning 6 [labels-omitted]: label preds was omitted in the application of this function.
- File "findlib.ml", line 396, characters 2-33:
- 396 |   Fl_package_base.requires_deeply predlist pkglist
-         ^^^^^^^^^^^^^^^^^^^^^^^^^^^^^^^
- Warning 6 [labels-omitted]: label preds was omitted in the application of this function.
- ocamlc -I +compiler-libs -opaque   -I +unix -I +dynlink -g -c fl_args.ml
- ocamlc -I +compiler-libs -opaque   -I +unix -I +dynlink -g -c fl_lint.ml
- ocamlc -I +compiler-libs -a -o findlib.cma findlib_config.cmo fl_split.cmo fl_metatoken.cmo fl_meta.cmo fl_metascanner.cmo fl_topo.cmo fl_package_base.cmo findlib.cmo fl_args.cmo fl_lint.cmo
- ocamlc -I +compiler-libs -opaque   -I +unix -I +dynlink -g -c ocaml_args.ml
- ocamlc -I +compiler-libs -opaque   -I +unix -I +dynlink -g -c frontend.ml
- File "frontend.ml", line 859, characters 10-39:
- 859 |           Fl_package_base.package_users predicates1 packages1
-                 ^^^^^^^^^^^^^^^^^^^^^^^^^^^^^
- Warning 6 [labels-omitted]: label preds was omitted in the application of this function.
- ocamlc -I +compiler-libs  -o ocamlfind -g findlib.cma unix.cma \
-            -I +unix -I +dynlink ocaml_args.cmo frontend.cmo
- ocamlc -I +compiler-libs -opaque   -I +unix -I +dynlink -c topfind.mli
- ocamlc -I +compiler-libs -opaque   -I +unix -I +dynlink -g -c topfind.ml
- File "topfind.ml", line 126, characters 40-63:
- 126 |                      match Hashtbl.find Toploop.directive_table "ppx" with
-                                               ^^^^^^^^^^^^^^^^^^^^^^^
- Alert deprecated: Toploop.directive_table
- File "topfind.ml", line 256, characters 4-27:
- 256 |     Toploop.directive_table
-           ^^^^^^^^^^^^^^^^^^^^^^^
- Alert deprecated: Toploop.directive_table
- File "topfind.ml", line 266, characters 4-27:
- 266 |     Toploop.directive_table
-           ^^^^^^^^^^^^^^^^^^^^^^^
- Alert deprecated: Toploop.directive_table
- File "topfind.ml", line 278, characters 4-27:
- 278 |     Toploop.directive_table
-           ^^^^^^^^^^^^^^^^^^^^^^^
- Alert deprecated: Toploop.directive_table
- File "topfind.ml", line 291, characters 4-27:
- 291 |     Toploop.directive_table
-           ^^^^^^^^^^^^^^^^^^^^^^^
- Alert deprecated: Toploop.directive_table
- File "topfind.ml", line 305, characters 4-27:
- 305 |     Toploop.directive_table
-           ^^^^^^^^^^^^^^^^^^^^^^^
- Alert deprecated: Toploop.directive_table
- File "topfind.ml", line 317, characters 4-27:
- 317 |     Toploop.directive_table
-           ^^^^^^^^^^^^^^^^^^^^^^^
- Alert deprecated: Toploop.directive_table
- ocamlc -I +compiler-libs -a -o findlib_top.cma topfind.cmo
- USE_CYGPATH="0"; \
- export USE_CYGPATH; \
- cat topfind_rd1.p | \
-          ../../tools/patch '@SITELIB@' '/home/opam/.opam/5.0/lib' \
-     	    >topfind
- ocamlc -I +compiler-libs -opaque   -I +unix -I +dynlink -c fl_dynload.mli
- ocamlc -I +compiler-libs -opaque   -I +unix -I +dynlink -g -c fl_dynload.ml
- ocamlc -I +compiler-libs -a -o findlib_dynload.cma fl_dynload.cmo
- make[1]: Leaving directory '/home/opam/.opam/5.0/.opam-switch/build/ocamlfind.1.9.5/src/findlib'
- make all-config
- make[1]: Entering directory '/home/opam/.opam/5.0/.opam-switch/build/ocamlfind.1.9.5'
- USE_CYGPATH="0"; \
- export USE_CYGPATH; \
- cat findlib.conf.in | \
-      tools/patch '@SITELIB@' '/home/opam/.opam/5.0/lib' >findlib.conf
- if ./tools/cmd_from_same_dir ocamlc; then \
- 	echo 'ocamlc="ocamlc.opt"' >>findlib.conf; \
- fi
- if ./tools/cmd_from_same_dir ocamlopt; then \
- 	echo 'ocamlopt="ocamlopt.opt"' >>findlib.conf; \
- fi
- if ./tools/cmd_from_same_dir ocamldep; then \
- 	echo 'ocamldep="ocamldep.opt"' >>findlib.conf; \
- fi
- if ./tools/cmd_from_same_dir ocamldoc; then \
- 	echo 'ocamldoc="ocamldoc.opt"' >>findlib.conf; \
- fi
- make[1]: Leaving directory '/home/opam/.opam/5.0/.opam-switch/build/ocamlfind.1.9.5'
Processing 33/78: [dune: ocaml bootstrap.ml] [ocamlbuild: make check-if-preinstalled] [ocamlfind: make opt] [cmdliner: make install]
+ /home/opam/.opam/opam-init/hooks/sandbox.sh "install" "make" "install" "LIBDIR=/home/opam/.opam/5.0/lib/cmdliner" "DOCDIR=/home/opam/.opam/5.0/doc/cmdliner" (CWD=/home/opam/.opam/5.0/.opam-switch/build/cmdliner.1.1.1)
- install -d /home/opam/.opam/5.0/lib/cmdliner
- install pkg/META _build/cmdliner.mli _build/cmdliner.cmi _build/cmdliner.cmti /home/opam/.opam/5.0/lib/cmdliner
- install cmdliner.opam /home/opam/.opam/5.0/lib/cmdliner/opam
- install _build/cmdliner.cma /home/opam/.opam/5.0/lib/cmdliner
- install _build/cmdliner.cmxa _build/cmdliner.a _build/cmdliner.cmx _build/cmdliner_arg.cmx _build/cmdliner_base.cmx _build/cmdliner_cline.cmx _build/cmdliner_cmd.cmx _build/cmdliner_docgen.cmx _build/cmdliner_eval.cmx _build/cmdliner_exit.cmx _build/cmdliner_info.cmx _build/cmdliner_manpage.cmx _build/cmdliner_msg.cmx _build/cmdliner_term.cmx _build/cmdliner_term_deprecated.cmx _build/cmdliner_trie.cmx \
-   /home/opam/.opam/5.0/lib/cmdliner
- install _build/cmdliner.cmxs /home/opam/.opam/5.0/lib/cmdliner
Processing 33/78: [dune: ocaml bootstrap.ml] [ocamlbuild: make check-if-preinstalled] [ocamlfind: make opt] [cmdliner: make install-doc]
+ /home/opam/.opam/opam-init/hooks/sandbox.sh "install" "make" "install-doc" "LIBDIR=/home/opam/.opam/5.0/lib/cmdliner" "DOCDIR=/home/opam/.opam/5.0/doc/cmdliner" (CWD=/home/opam/.opam/5.0/.opam-switch/build/cmdliner.1.1.1)
- install -d /home/opam/.opam/5.0/doc/cmdliner/odoc-pages
- install CHANGES.md LICENSE.md README.md /home/opam/.opam/5.0/doc/cmdliner
- install doc/index.mld doc/cli.mld doc/examples.mld doc/tutorial.mld \
-            doc/tool_man.mld /home/opam/.opam/5.0/doc/cmdliner/odoc-pages
-> installed cmdliner.1.1.1
Processing 33/78: [dune: ocaml bootstrap.ml] [ocamlbuild: make check-if-preinstalled] [ocamlfind: make opt]
+ /home/opam/.opam/opam-init/hooks/sandbox.sh "build" "make" "opt" (CWD=/home/opam/.opam/5.0/.opam-switch/build/ocamlfind.1.9.5)
- for p in findlib; do ( cd src/$p; make opt ) || exit; done
- make[1]: Entering directory '/home/opam/.opam/5.0/.opam-switch/build/ocamlfind.1.9.5/src/findlib'
- ocamlopt -I +compiler-libs -g -opaque  -I +unix -I +dynlink -c findlib_config.ml
- ocamlopt -I +compiler-libs -g -opaque  -I +unix -I +dynlink -c fl_split.ml
- ocamlopt -I +compiler-libs -g -opaque  -I +unix -I +dynlink -c fl_metatoken.ml
- ocamlopt -I +compiler-libs -g -opaque  -I +unix -I +dynlink -c fl_meta.ml
- ocamlopt -I +compiler-libs -g -opaque  -I +unix -I +dynlink -c fl_metascanner.ml
- ocamlopt -I +compiler-libs -g -opaque  -I +unix -I +dynlink -c fl_topo.ml
- ocamlopt -I +compiler-libs -g -opaque  -I +unix -I +dynlink -c fl_package_base.ml
- File "fl_package_base.ml", line 304, characters 22-40:
- 304 | 	 let pkg_ancestors = query_requirements predlist pkg in
-       	                     ^^^^^^^^^^^^^^^^^^
- Warning 6 [labels-omitted]: label preds was omitted in the application of this function.
- File "fl_package_base.ml", line 350, characters 18-36:
- 350 |   let ancestors = query_requirements predlist package_name in
-                         ^^^^^^^^^^^^^^^^^^
- Warning 6 [labels-omitted]: label preds was omitted in the application of this function.
- File "fl_package_base.ml", line 375, characters 23-41:
- 375 | 	  let pkg_ancestors = query_requirements predlist pkg in
-       	                      ^^^^^^^^^^^^^^^^^^
- Warning 6 [labels-omitted]: label preds was omitted in the application of this function.
- File "fl_package_base.ml", line 510, characters 16-35:
- 510 | 	     ( let c = package_definitions search_path pkg.package_name in
-       	               ^^^^^^^^^^^^^^^^^^^
- Warning 6 [labels-omitted]: label search_path was omitted in the application of this function.
- ocamlopt -I +compiler-libs -g -opaque  -I +unix -I +dynlink -c findlib.ml
- File "findlib.ml", line 390, characters 2-26:
- 390 |   Fl_package_base.requires predlist pkg
-         ^^^^^^^^^^^^^^^^^^^^^^^^
- Warning 6 [labels-omitted]: label preds was omitted in the application of this function.
- File "findlib.ml", line 396, characters 2-33:
- 396 |   Fl_package_base.requires_deeply predlist pkglist
-         ^^^^^^^^^^^^^^^^^^^^^^^^^^^^^^^
- Warning 6 [labels-omitted]: label preds was omitted in the application of this function.
- ocamlopt -I +compiler-libs -g -opaque  -I +unix -I +dynlink -c fl_args.ml
- ocamlopt -I +compiler-libs -g -opaque  -I +unix -I +dynlink -c fl_lint.ml
- ocamlopt -I +compiler-libs -g -a -o findlib.cmxa findlib_config.cmx fl_split.cmx fl_metatoken.cmx fl_meta.cmx fl_metascanner.cmx fl_topo.cmx fl_package_base.cmx findlib.cmx fl_args.cmx fl_lint.cmx
- if [ 1 -gt 0 ]; then \
-     ocamlopt -I +compiler-libs -g -shared -o findlib.cmxs findlib_config.cmx fl_split.cmx fl_metatoken.cmx fl_meta.cmx fl_metascanner.cmx fl_topo.cmx fl_package_base.cmx findlib.cmx fl_args.cmx fl_lint.cmx; \
- fi
- ocamlopt -I +compiler-libs -g -opaque  -I +unix -I +dynlink -c ocaml_args.ml
- ocamlopt -I +compiler-libs -g -opaque  -I +unix -I +dynlink -c frontend.ml
- File "frontend.ml", line 859, characters 10-39:
- 859 |           Fl_package_base.package_users predicates1 packages1
-                 ^^^^^^^^^^^^^^^^^^^^^^^^^^^^^
- Warning 6 [labels-omitted]: label preds was omitted in the application of this function.
- ocamlopt -I +compiler-libs -g -o ocamlfind_opt findlib.cmxa unix.cmxa \
- 	   -I +unix -I +dynlink ocaml_args.cmx frontend.cmx
- ocamlopt -I +compiler-libs -g -opaque  -I +unix -I +dynlink -c topfind.ml
- File "topfind.ml", line 126, characters 40-63:
- 126 |                      match Hashtbl.find Toploop.directive_table "ppx" with
-                                               ^^^^^^^^^^^^^^^^^^^^^^^
- Alert deprecated: Toploop.directive_table
- File "topfind.ml", line 256, characters 4-27:
- 256 |     Toploop.directive_table
-           ^^^^^^^^^^^^^^^^^^^^^^^
- Alert deprecated: Toploop.directive_table
- File "topfind.ml", line 266, characters 4-27:
- 266 |     Toploop.directive_table
-           ^^^^^^^^^^^^^^^^^^^^^^^
- Alert deprecated: Toploop.directive_table
- File "topfind.ml", line 278, characters 4-27:
- 278 |     Toploop.directive_table
-           ^^^^^^^^^^^^^^^^^^^^^^^
- Alert deprecated: Toploop.directive_table
- File "topfind.ml", line 291, characters 4-27:
- 291 |     Toploop.directive_table
-           ^^^^^^^^^^^^^^^^^^^^^^^
- Alert deprecated: Toploop.directive_table
- File "topfind.ml", line 305, characters 4-27:
- 305 |     Toploop.directive_table
-           ^^^^^^^^^^^^^^^^^^^^^^^
- Alert deprecated: Toploop.directive_table
- File "topfind.ml", line 317, characters 4-27:
- 317 |     Toploop.directive_table
-           ^^^^^^^^^^^^^^^^^^^^^^^
- Alert deprecated: Toploop.directive_table
- ocamlopt -I +compiler-libs -g -a -o findlib_top.cmxa topfind.cmx
- if [ 1 -gt 0 ]; then \
-     ocamlopt -I +compiler-libs -g -shared -o findlib_top.cmxs topfind.cmx; \
- fi
- ocamlopt -I +compiler-libs -g -opaque  -I +unix -I +dynlink -c fl_dynload.ml
- ocamlopt -I +compiler-libs -g -a -o findlib_dynload.cmxa fl_dynload.cmx
- if [ 1 -gt 0 ]; then \
-     ocamlopt -I +compiler-libs -g -shared -o findlib_dynload.cmxs fl_dynload.cmx; \
- fi
- make[1]: Leaving directory '/home/opam/.opam/5.0/.opam-switch/build/ocamlfind.1.9.5/src/findlib'
-> compiled  ocamlfind.1.9.5
Processing 33/78: [dune: ocaml bootstrap.ml] [ocamlbuild: make check-if-preinstalled]
Processing 34/78: [dune: ocaml bootstrap.ml] [ocamlbuild: make check-if-preinstalled] [ocamlfind: make install]
+ /home/opam/.opam/opam-init/hooks/sandbox.sh "install" "make" "install" (CWD=/home/opam/.opam/5.0/.opam-switch/build/ocamlfind.1.9.5)
- if [ "1" -eq 1 ]; then \
-     for x in camlp4 dbm graphics labltk num ocamlbuild; do \
-       if [ -f "/home/opam/.opam/5.0/lib/$x/META" ]; then \
-         if ! grep -Fq '[distributed with Ocaml]' "//home/opam/.opam/5.0/lib/$x/META"; then \
-           rm -f site-lib-src/$x/META; \
-         fi; \
-       fi; \
-     done; \
-     test -f "site-lib-src/num/META" || rm -f "site-lib-src/num-top/META"; \
-   fi
- echo 'SITELIB_META =' > Makefile.packages.in
- for x in `ls site-lib-src`; do test ! -f "site-lib-src/$x/META" || echo $x >> Makefile.packages.in; done
- tr '\n' ' ' < Makefile.packages.in > Makefile.packages
- rm Makefile.packages.in
- install -d "/home/opam/.opam/5.0/bin"
- install -d "/home/opam/.opam/5.0/man"
- make install-config
- make[1]: Entering directory '/home/opam/.opam/5.0/.opam-switch/build/ocamlfind.1.9.5'
- install -d "`dirname \"/home/opam/.opam/5.0/lib/findlib.conf\"`"
- test -f "/home/opam/.opam/5.0/lib/findlib.conf" || install -c findlib.conf "/home/opam/.opam/5.0/lib/findlib.conf"
- make[1]: Leaving directory '/home/opam/.opam/5.0/.opam-switch/build/ocamlfind.1.9.5'
- for p in findlib; do ( cd src/$p; make install ); done
- make[1]: Entering directory '/home/opam/.opam/5.0/.opam-switch/build/ocamlfind.1.9.5/src/findlib'
- install -d "/home/opam/.opam/5.0/lib/findlib"
- install -d "/home/opam/.opam/5.0/bin"
- install -d "/home/opam/.opam/5.0/lib/ocaml"
- test 1 -eq 0 || install -c topfind "/home/opam/.opam/5.0/lib/ocaml/"
- files=` ../../tools/collect_files ../../Makefile.config \
- findlib.cmi findlib.mli findlib.cma findlib.cmxa findlib.a findlib.cmxs \
- findlib_config.cmi findlib_config.ml topfind.cmi topfind.mli \
- fl_args.cmi fl_lint.cmi fl_meta.cmi fl_split.cmi fl_topo.cmi ocaml_args.cmi \
- fl_package_base.mli fl_package_base.cmi fl_metascanner.mli fl_metascanner.cmi \
- fl_metatoken.cmi findlib_top.cma findlib_top.cmxa findlib_top.a findlib_top.cmxs \
- findlib_dynload.cma findlib_dynload.cmxa findlib_dynload.a findlib_dynload.cmxs fl_dynload.mli fl_dynload.cmi \
- META` && \
- install -c $files "/home/opam/.opam/5.0/lib/findlib/"
- f="ocamlfind"; { test -f ocamlfind_opt && f="ocamlfind_opt"; }; \
- install -c $f "/home/opam/.opam/5.0/bin/ocamlfind"
- # the following "if" block is only needed for 4.00beta2
- if [ 1 -eq 0 -a -f "/home/opam/.opam/5.0/lib/ocaml/compiler-libs/topdirs.cmi" ]; then \
-     cd "/home/opam/.opam/5.0/lib/ocaml/compiler-libs/"; \
-     install -c topdirs.cmi toploop.cmi "/home/opam/.opam/5.0/lib/findlib/"; \
- fi
- make[1]: Leaving directory '/home/opam/.opam/5.0/.opam-switch/build/ocamlfind.1.9.5/src/findlib'
- make install-meta
- make[1]: Entering directory '/home/opam/.opam/5.0/.opam-switch/build/ocamlfind.1.9.5'
- for x in bytes compiler-libs dynlink ocamldoc runtime_events stdlib str threads unix ; do install -d "/home/opam/.opam/5.0/lib/$x"; install -c site-lib-src/$x/META "/home/opam/.opam/5.0/lib/$x/META.tmp" && mv "/home/opam/.opam/5.0/lib/$x/META.tmp" "/home/opam/.opam/5.0/lib/$x/META"; done
- install -d "/home/opam/.opam/5.0/lib/findlib"; install -c Makefile.packages "/home/opam/.opam/5.0/lib/findlib/Makefile.packages"
- make[1]: Leaving directory '/home/opam/.opam/5.0/.opam-switch/build/ocamlfind.1.9.5'
- test ! -f 'site-lib-src/num-top/META' || { cd src/findlib; make install-num-top; }
- test ! -f 'site-lib-src/camlp4/META' ||	install -c tools/safe_camlp4 "/home/opam/.opam/5.0/bin"
- make install-doc
- make[1]: Entering directory '/home/opam/.opam/5.0/.opam-switch/build/ocamlfind.1.9.5'
- install -d "/home/opam/.opam/5.0/man/man1" "/home/opam/.opam/5.0/man/man3" "/home/opam/.opam/5.0/man/man5"
- install -c doc/ref-man/ocamlfind.1 "/home/opam/.opam/5.0/man/man1"
- install -c doc/ref-man/META.5 doc/ref-man/site-lib.5 doc/ref-man/findlib.conf.5 "/home/opam/.opam/5.0/man/man5"
- make[1]: Leaving directory '/home/opam/.opam/5.0/.opam-switch/build/ocamlfind.1.9.5'
-> installed ocamlfind.1.9.5
Processing 34/78: [dune: ocaml bootstrap.ml] [ocamlbuild: make check-if-preinstalled]
Processing 35/78: [dune: ocaml bootstrap.ml] [ocamlbuild: make check-if-preinstalled]
Processing 36/78: [dune: ocaml bootstrap.ml] [ocamlbuild: make check-if-preinstalled] [zarith: ./configure]
-> installed base-bytes.base
Processing 37/78: [dune: ocaml bootstrap.ml] [ocamlbuild: make check-if-preinstalled] [zarith: ./configure]
+ /home/opam/.opam/opam-init/hooks/sandbox.sh "build" "./configure" (CWD=/home/opam/.opam/5.0/.opam-switch/build/zarith.1.12)
- binary ocaml: found in /home/opam/.opam/5.0/bin
- binary ocamlc: found in /home/opam/.opam/5.0/bin
- binary ocamldep: found in /home/opam/.opam/5.0/bin
- binary ocamlmklib: found in /home/opam/.opam/5.0/bin
- binary ocamldoc: found in /home/opam/.opam/5.0/bin
- binary gcc: found in /usr/bin
- binary ocamlopt: found in /home/opam/.opam/5.0/bin
- checking compilation with gcc -O3 -Wall -Wextra : working
- include caml/mlvalues.h: found
- library dynlink.cmxa: found
- binary ocamlfind: found in /home/opam/.opam/5.0/bin
- OCaml's word size is 64
- binary uname: found in /bin
- include gmp.h: found
- library gmp: found
- OCaml supports -bin-annot to produce documentation
- 
- detected configuration:
- 
-   native-code:          yes
-   dynamic linking:      yes
-   defines:              -DHAS_GMP 
-   libraries:             -lgmp
-   C options:            -O3 -Wall -Wextra 
-   installation path:    /home/opam/.opam/5.0/lib
-   installation method   findlib
- 
- configuration successful!
- now type "make" to build
- then type "make install" or "sudo make install" to install
Processing 37/78: [dune: ocaml bootstrap.ml] [ocamlbuild: make check-if-preinstalled] [zarith: make]
+ /home/opam/.opam/opam-init/hooks/sandbox.sh "build" "make" (CWD=/home/opam/.opam/5.0/.opam-switch/build/zarith.1.12)
- (echo "let"; grep "version" META | head -1) > zarith_version.ml
- ocamldep -native  zarith_version.ml z.ml q.ml big_int_Z.ml z.mli q.mli big_int_Z.mli > depend
- ocamlc -I +compiler-libs -bin-annot  -c zarith_version.ml
- ocamlc -I +compiler-libs -bin-annot  -c z.mli
- ocamlc -I +compiler-libs -bin-annot  -c z.ml
- ocamlc -I +compiler-libs -bin-annot  -c q.mli
- ocamlc -I +compiler-libs -bin-annot  -c q.ml
- File "q.ml", line 537, characters 9-23:
- 537 |         (Z.of_substring s 0 i)
-                ^^^^^^^^^^^^^^
- Warning 6 [labels-omitted]: labels pos, len were omitted in the application of this function.
- File "q.ml", line 538, characters 9-23:
- 538 |         (Z.of_substring s (i+1) (String.length s-i-1))
-                ^^^^^^^^^^^^^^
- Warning 6 [labels-omitted]: labels pos, len were omitted in the application of this function.
- ocamlc -I +compiler-libs -bin-annot  -c big_int_Z.mli
- ocamlc -I +compiler-libs -bin-annot  -c big_int_Z.ml
- ocamlmklib -failsafe -o zarith zarith_version.cmo z.cmo q.cmo big_int_Z.cmo -lgmp
- ocamlc -ccopt "-I/home/opam/.opam/5.0/lib/ocaml  -DHAS_GMP  -O3 -Wall -Wextra " -c caml_z.c
- ocamlmklib -failsafe -o zarith caml_z.o -lgmp
- ocamlc -I +compiler-libs -bin-annot  -c zarith_top.ml
- ocamlc -o zarith_top.cma -a zarith_top.cmo
- ocamlopt -I +compiler-libs  -c zarith_version.ml
- ocamlopt -I +compiler-libs  -c z.ml
- ocamlopt -I +compiler-libs  -c q.ml
- File "q.ml", line 537, characters 9-23:
- 537 |         (Z.of_substring s 0 i)
-                ^^^^^^^^^^^^^^
- Warning 6 [labels-omitted]: labels pos, len were omitted in the application of this function.
- File "q.ml", line 538, characters 9-23:
- 538 |         (Z.of_substring s (i+1) (String.length s-i-1))
-                ^^^^^^^^^^^^^^
- Warning 6 [labels-omitted]: labels pos, len were omitted in the application of this function.
- ocamlopt -I +compiler-libs  -c big_int_Z.ml
- ocamlmklib -failsafe -o zarith zarith_version.cmx z.cmx q.cmx big_int_Z.cmx -lgmp
- ocamlopt -shared -o zarith.cmxs -I . zarith.cmxa -linkall
-> compiled  zarith.1.12
Processing 37/78: [dune: ocaml bootstrap.ml] [ocamlbuild: make check-if-preinstalled]
Processing 38/78: [dune: ocaml bootstrap.ml] [ocamlbuild: make check-if-preinstalled] [zarith: make install]
+ /home/opam/.opam/opam-init/hooks/sandbox.sh "install" "make" "install" (CWD=/home/opam/.opam/5.0/.opam-switch/build/zarith.1.12)
- ocamlfind install -destdir "/home/opam/.opam/5.0/lib" zarith META zarith.cma libzarith.a z.cmi q.cmi big_int_Z.cmi zarith_top.cma z.mli zarith.cmxa z.cmx q.cmx big_int_Z.cmx zarith.cmxs zarith.h q.mli big_int_Z.mli zarith.a z.cmti q.cmti big_int_Z.cmti -optional dllzarith.so
- Installed /home/opam/.opam/5.0/lib/zarith/big_int_Z.cmti
- Installed /home/opam/.opam/5.0/lib/zarith/q.cmti
- Installed /home/opam/.opam/5.0/lib/zarith/z.cmti
- Installed /home/opam/.opam/5.0/lib/zarith/zarith.a
- Installed /home/opam/.opam/5.0/lib/zarith/big_int_Z.mli
- Installed /home/opam/.opam/5.0/lib/zarith/q.mli
- Installed /home/opam/.opam/5.0/lib/zarith/zarith.h
- Installed /home/opam/.opam/5.0/lib/zarith/zarith.cmxs
- Installed /home/opam/.opam/5.0/lib/zarith/big_int_Z.cmx
- Installed /home/opam/.opam/5.0/lib/zarith/q.cmx
- Installed /home/opam/.opam/5.0/lib/zarith/z.cmx
- Installed /home/opam/.opam/5.0/lib/zarith/zarith.cmxa
- Installed /home/opam/.opam/5.0/lib/zarith/z.mli
- Installed /home/opam/.opam/5.0/lib/zarith/zarith_top.cma
- Installed /home/opam/.opam/5.0/lib/zarith/big_int_Z.cmi
- Installed /home/opam/.opam/5.0/lib/zarith/q.cmi
- Installed /home/opam/.opam/5.0/lib/zarith/z.cmi
- Installed /home/opam/.opam/5.0/lib/zarith/libzarith.a
- Installed /home/opam/.opam/5.0/lib/zarith/zarith.cma
- Installed /home/opam/.opam/5.0/lib/stublibs/dllzarith.so
- Installed /home/opam/.opam/5.0/lib/stublibs/dllzarith.so.owner
- ocamlfind: [WARNING] You have installed DLLs but the directory /home/opam/.opam/5.0/lib/stublibs is not mentioned in ld.conf
- Installed /home/opam/.opam/5.0/lib/zarith/META
-> installed zarith.1.12
Processing 38/78: [dune: ocaml bootstrap.ml] [ocamlbuild: make check-if-preinstalled]
+ /home/opam/.opam/opam-init/hooks/sandbox.sh "build" "make" "check-if-preinstalled" "all" "opam-install" (CWD=/home/opam/.opam/5.0/.opam-switch/build/ocamlbuild.0.14.1)
- if test -d /home/opam/.opam/5.0/lib/ocaml/ocamlbuild; then\
-   >&2 echo "ERROR: Preinstalled ocamlbuild detected at"\
-        "/home/opam/.opam/5.0/lib/ocaml/ocamlbuild";\
-   >&2 echo "Installation aborted; if you want to bypass this"\
-         "safety check, pass CHECK_IF_PREINSTALLED=false to make";\
-   exit 2;\
- fi
- ocamlc.opt -w +L -w +R -w +Z -I src -I +unix -safe-string -bin-annot -strict-sequence -c src/const.ml
- ocamlc.opt -w +L -w +R -w +Z -I src -I +unix -safe-string -bin-annot -strict-sequence -c src/loc.mli
- ocamlc.opt -w +L -w +R -w +Z -I src -I +unix -safe-string -bin-annot -strict-sequence -c src/loc.ml
- ocamlc.opt -w +L -w +R -w +Z -I src -I +unix -safe-string -bin-annot -strict-sequence -c src/discard_printf.mli
- ocamlc.opt -w +L -w +R -w +Z -I src -I +unix -safe-string -bin-annot -strict-sequence -c src/discard_printf.ml
- ocamlc.opt -w +L -w +R -w +Z -I src -I +unix -safe-string -bin-annot -strict-sequence -c src/signatures.mli
- ocamlc.opt -w +L -w +R -w +Z -I src -I +unix -safe-string -bin-annot -strict-sequence -c src/my_std.mli
- ocamlc.opt -w +L -w +R -w +Z -I src -I +unix -safe-string -bin-annot -strict-sequence -c src/my_std.ml
- ocamlc.opt -w +L -w +R -w +Z -I src -I +unix -safe-string -bin-annot -strict-sequence -c src/my_unix.mli
- ocamlc.opt -w +L -w +R -w +Z -I src -I +unix -safe-string -bin-annot -strict-sequence -c src/my_unix.ml
- ocamlc.opt -w +L -w +R -w +Z -I src -I +unix -safe-string -bin-annot -strict-sequence -c src/tags.mli
- ocamlc.opt -w +L -w +R -w +Z -I src -I +unix -safe-string -bin-annot -strict-sequence -c src/tags.ml
- ocamlc.opt -w +L -w +R -w +Z -I src -I +unix -safe-string -bin-annot -strict-sequence -c src/display.mli
- ocamlc.opt -w +L -w +R -w +Z -I src -I +unix -safe-string -bin-annot -strict-sequence -c src/display.ml
- ocamlc.opt -w +L -w +R -w +Z -I src -I +unix -safe-string -bin-annot -strict-sequence -c src/log.mli
- ocamlc.opt -w +L -w +R -w +Z -I src -I +unix -safe-string -bin-annot -strict-sequence -c src/log.ml
- ocamlc.opt -w +L -w +R -w +Z -I src -I +unix -safe-string -bin-annot -strict-sequence -c src/shell.mli
- ocamlc.opt -w +L -w +R -w +Z -I src -I +unix -safe-string -bin-annot -strict-sequence -c src/shell.ml
- ocamlc.opt -w +L -w +R -w +Z -I src -I +unix -safe-string -bin-annot -strict-sequence -c src/bool.mli
- ocamlc.opt -w +L -w +R -w +Z -I src -I +unix -safe-string -bin-annot -strict-sequence -c src/bool.ml
- ocamlc.opt -w +L -w +R -w +Z -I src -I +unix -safe-string -bin-annot -strict-sequence -c src/glob_ast.mli
- ocamlc.opt -w +L -w +R -w +Z -I src -I +unix -safe-string -bin-annot -strict-sequence -c src/glob_ast.ml
- ocamllex.opt src/glob_lexer.mll
- 55 states, 419 transitions, table size 2006 bytes
- ocamlc.opt -w +L -w +R -w +Z -I src -I +unix -safe-string -bin-annot -strict-sequence -c src/glob_lexer.mli
- ocamlc.opt -w +L -w +R -w +Z -I src -I +unix -safe-string -bin-annot -strict-sequence -c src/glob_lexer.ml
- ocamlc.opt -w +L -w +R -w +Z -I src -I +unix -safe-string -bin-annot -strict-sequence -c src/glob.mli
- ocamlc.opt -w +L -w +R -w +Z -I src -I +unix -safe-string -bin-annot -strict-sequence -c src/glob.ml
- ocamllex.opt src/lexers.mll
- 251 states, 1051 transitions, table size 5710 bytes
- 4334 additional bytes used for bindings
- ocamlc.opt -w +L -w +R -w +Z -I src -I +unix -safe-string -bin-annot -strict-sequence -c src/lexers.mli
- ocamlc.opt -w +L -w +R -w +Z -I src -I +unix -safe-string -bin-annot -strict-sequence -c src/lexers.ml
- ocamlc.opt -w +L -w +R -w +Z -I src -I +unix -safe-string -bin-annot -strict-sequence -c src/param_tags.mli
- ocamlc.opt -w +L -w +R -w +Z -I src -I +unix -safe-string -bin-annot -strict-sequence -c src/param_tags.ml
- ocamlc.opt -w +L -w +R -w +Z -I src -I +unix -safe-string -bin-annot -strict-sequence -c src/command.mli
- ocamlc.opt -w +L -w +R -w +Z -I src -I +unix -safe-string -bin-annot -strict-sequence -c src/command.ml
- ocamlc.opt -w +L -w +R -w +Z -I src -I +unix -safe-string -bin-annot -strict-sequence -c src/ocamlbuild_config.ml
- ocamlc.opt -w +L -w +R -w +Z -I src -I +unix -safe-string -bin-annot -strict-sequence -c src/ocamlbuild_where.mli
- ocamlc.opt -w +L -w +R -w +Z -I src -I +unix -safe-string -bin-annot -strict-sequence -c src/ocamlbuild_where.ml
- ocamlc.opt -w +L -w +R -w +Z -I src -I +unix -safe-string -bin-annot -strict-sequence -c src/slurp.mli
- ocamlc.opt -w +L -w +R -w +Z -I src -I +unix -safe-string -bin-annot -strict-sequence -c src/slurp.ml
- ocamlc.opt -w +L -w +R -w +Z -I src -I +unix -safe-string -bin-annot -strict-sequence -c src/options.mli
- ocamlc.opt -w +L -w +R -w +Z -I src -I +unix -safe-string -bin-annot -strict-sequence -c src/options.ml
- ocamlc.opt -w +L -w +R -w +Z -I src -I +unix -safe-string -bin-annot -strict-sequence -c src/pathname.mli
- ocamlc.opt -w +L -w +R -w +Z -I src -I +unix -safe-string -bin-annot -strict-sequence -c src/pathname.ml
- ocamlc.opt -w +L -w +R -w +Z -I src -I +unix -safe-string -bin-annot -strict-sequence -c src/configuration.mli
- ocamlc.opt -w +L -w +R -w +Z -I src -I +unix -safe-string -bin-annot -strict-sequence -c src/configuration.ml
- ocamlc.opt -w +L -w +R -w +Z -I src -I +unix -safe-string -bin-annot -strict-sequence -c src/flags.mli
- ocamlc.opt -w +L -w +R -w +Z -I src -I +unix -safe-string -bin-annot -strict-sequence -c src/flags.ml
- ocamlc.opt -w +L -w +R -w +Z -I src -I +unix -safe-string -bin-annot -strict-sequence -c src/hygiene.mli
- ocamlc.opt -w +L -w +R -w +Z -I src -I +unix -safe-string -bin-annot -strict-sequence -c src/hygiene.ml
- ocamlc.opt -w +L -w +R -w +Z -I src -I +unix -safe-string -bin-annot -strict-sequence -c src/digest_cache.mli
- ocamlc.opt -w +L -w +R -w +Z -I src -I +unix -safe-string -bin-annot -strict-sequence -c src/digest_cache.ml
- ocamlc.opt -w +L -w +R -w +Z -I src -I +unix -safe-string -bin-annot -strict-sequence -c src/resource.mli
- ocamlc.opt -w +L -w +R -w +Z -I src -I +unix -safe-string -bin-annot -strict-sequence -c src/resource.ml
- ocamlc.opt -w +L -w +R -w +Z -I src -I +unix -safe-string -bin-annot -strict-sequence -c src/rule.mli
- ocamlc.opt -w +L -w +R -w +Z -I src -I +unix -safe-string -bin-annot -strict-sequence -c src/rule.ml
- ocamlc.opt -w +L -w +R -w +Z -I src -I +unix -safe-string -bin-annot -strict-sequence -c src/solver.mli
- ocamlc.opt -w +L -w +R -w +Z -I src -I +unix -safe-string -bin-annot -strict-sequence -c src/solver.ml
- ocamlc.opt -w +L -w +R -w +Z -I src -I +unix -safe-string -bin-annot -strict-sequence -c src/report.mli
- ocamlc.opt -w +L -w +R -w +Z -I src -I +unix -safe-string -bin-annot -strict-sequence -c src/report.ml
- ocamlc.opt -w +L -w +R -w +Z -I src -I +unix -safe-string -bin-annot -strict-sequence -c src/tools.mli
- ocamlc.opt -w +L -w +R -w +Z -I src -I +unix -safe-string -bin-annot -strict-sequence -c src/tools.ml
- ocamlc.opt -w +L -w +R -w +Z -I src -I +unix -safe-string -bin-annot -strict-sequence -c src/fda.mli
- ocamlc.opt -w +L -w +R -w +Z -I src -I +unix -safe-string -bin-annot -strict-sequence -c src/fda.ml
- ocamlc.opt -w +L -w +R -w +Z -I src -I +unix -safe-string -bin-annot -strict-sequence -c src/findlib.mli
- ocamlc.opt -w +L -w +R -w +Z -I src -I +unix -safe-string -bin-annot -strict-sequence -c src/findlib.ml
- ocamlc.opt -w +L -w +R -w +Z -I src -I +unix -safe-string -bin-annot -strict-sequence -c src/ocaml_arch.mli
- ocamlc.opt -w +L -w +R -w +Z -I src -I +unix -safe-string -bin-annot -strict-sequence -c src/ocaml_arch.ml
- ocamlc.opt -w +L -w +R -w +Z -I src -I +unix -safe-string -bin-annot -strict-sequence -c src/ocaml_utils.mli
- ocamlc.opt -w +L -w +R -w +Z -I src -I +unix -safe-string -bin-annot -strict-sequence -c src/ocaml_utils.ml
- ocamlc.opt -w +L -w +R -w +Z -I src -I +unix -safe-string -bin-annot -strict-sequence -c src/ocaml_dependencies.mli
- ocamlc.opt -w +L -w +R -w +Z -I src -I +unix -safe-string -bin-annot -strict-sequence -c src/ocaml_dependencies.ml
- ocamlc.opt -w +L -w +R -w +Z -I src -I +unix -safe-string -bin-annot -strict-sequence -c src/ocaml_compiler.mli
- ocamlc.opt -w +L -w +R -w +Z -I src -I +unix -safe-string -bin-annot -strict-sequence -c src/ocaml_compiler.ml
- ocamlc.opt -w +L -w +R -w +Z -I src -I +unix -safe-string -bin-annot -strict-sequence -c src/ocaml_tools.mli
- ocamlc.opt -w +L -w +R -w +Z -I src -I +unix -safe-string -bin-annot -strict-sequence -c src/ocaml_tools.ml
- ocamlc.opt -w +L -w +R -w +Z -I src -I +unix -safe-string -bin-annot -strict-sequence -c src/ocaml_specific.mli
- ocamlc.opt -w +L -w +R -w +Z -I src -I +unix -safe-string -bin-annot -strict-sequence -c src/ocaml_specific.ml
- ocamlc.opt -w +L -w +R -w +Z -I src -I +unix -safe-string -bin-annot -strict-sequence -c src/exit_codes.mli
- ocamlc.opt -w +L -w +R -w +Z -I src -I +unix -safe-string -bin-annot -strict-sequence -c src/exit_codes.ml
- ocamlc.opt -w +L -w +R -w +Z -I src -I +unix -safe-string -bin-annot -strict-sequence -c src/plugin.mli
- ocamlc.opt -w +L -w +R -w +Z -I src -I +unix -safe-string -bin-annot -strict-sequence -c src/plugin.ml
- ocamlc.opt -w +L -w +R -w +Z -I src -I +unix -safe-string -bin-annot -strict-sequence -c src/hooks.mli
- ocamlc.opt -w +L -w +R -w +Z -I src -I +unix -safe-string -bin-annot -strict-sequence -c src/hooks.ml
- ocamlc.opt -w +L -w +R -w +Z -I src -I +unix -safe-string -bin-annot -strict-sequence -c src/main.mli
- ocamlc.opt -w +L -w +R -w +Z -I src -I +unix -safe-string -bin-annot -strict-sequence -c src/main.ml
- mkdir -p tmp
- ocamlc.opt -pack src/const.cmo src/loc.cmo src/discard_printf.cmo src/signatures.cmi src/my_std.cmo src/my_unix.cmo src/tags.cmo src/display.cmo src/log.cmo src/shell.cmo src/bool.cmo src/glob_ast.cmo src/glob_lexer.cmo src/glob.cmo src/lexers.cmo src/param_tags.cmo src/command.cmo src/ocamlbuild_config.cmo src/ocamlbuild_where.cmo src/slurp.cmo src/options.cmo src/pathname.cmo src/configuration.cmo src/flags.cmo src/hygiene.cmo src/digest_cache.cmo src/resource.cmo src/rule.cmo src/solver.cmo src/report.cmo src/tools.cmo src/fda.cmo src/findlib.cmo src/ocaml_arch.cmo src/ocaml_utils.cmo src/ocaml_dependencies.cmo src/ocaml_compiler.cmo src/ocaml_tools.cmo src/ocaml_specific.cmo src/exit_codes.cmo src/plugin.cmo src/hooks.cmo src/main.cmo -o tmp/ocamlbuild_pack.cmo
- mv tmp/ocamlbuild_pack.cmi src/ocamlbuild_pack.cmi
- mv tmp/ocamlbuild_pack.cmo src/ocamlbuild_pack.cmo
- ocamlc.opt -w +L -w +R -w +Z -I src -I +unix -safe-string -bin-annot -strict-sequence -c src/ocamlbuild_plugin.mli
- ocamlc.opt -w +L -w +R -w +Z -I src -I +unix -safe-string -bin-annot -strict-sequence -c src/ocamlbuild_plugin.ml
- ocamlc.opt -w +L -w +R -w +Z -I src -I +unix -safe-string -bin-annot -strict-sequence -c src/ocamlbuild_executor.mli
- ocamlc.opt -w +L -w +R -w +Z -I src -I +unix -safe-string -bin-annot -strict-sequence -c src/ocamlbuild_executor.ml
- ocamlc.opt -w +L -w +R -w +Z -I src -I +unix -safe-string -bin-annot -strict-sequence -c src/ocamlbuild_unix_plugin.mli
- ocamlc.opt -w +L -w +R -w +Z -I src -I +unix -safe-string -bin-annot -strict-sequence -c src/ocamlbuild_unix_plugin.ml
- ocamlc.opt -w +L -w +R -w +Z -I src -I +unix -safe-string -bin-annot -strict-sequence -c src/ocamlbuild.mli
- ocamlc.opt -w +L -w +R -w +Z -I src -I +unix -safe-string -bin-annot -strict-sequence -c src/ocamlbuild.ml
- ocamlc.opt -I +unix -I src -o ocamlbuild.byte unix.cma src/ocamlbuild_pack.cmo src/ocamlbuild_plugin.cmo src/ocamlbuild_executor.cmo src/ocamlbuild_unix_plugin.cmo src/ocamlbuild.cmo
- ocamlc.opt -a -o src/ocamlbuildlib.cma src/ocamlbuild_pack.cmo src/ocamlbuild_plugin.cmo src/ocamlbuild_executor.cmo src/ocamlbuild_unix_plugin.cmo
- ocamlopt.opt -for-pack Ocamlbuild_pack -w +L -w +R -w +Z -I src -I +unix -safe-string -bin-annot -strict-sequence -c src/const.ml
- ocamlopt.opt -for-pack Ocamlbuild_pack -w +L -w +R -w +Z -I src -I +unix -safe-string -bin-annot -strict-sequence -c src/loc.ml
- ocamlopt.opt -for-pack Ocamlbuild_pack -w +L -w +R -w +Z -I src -I +unix -safe-string -bin-annot -strict-sequence -c src/discard_printf.ml
- ocamlopt.opt -for-pack Ocamlbuild_pack -w +L -w +R -w +Z -I src -I +unix -safe-string -bin-annot -strict-sequence -c src/my_std.ml
- ocamlopt.opt -for-pack Ocamlbuild_pack -w +L -w +R -w +Z -I src -I +unix -safe-string -bin-annot -strict-sequence -c src/my_unix.ml
- ocamlopt.opt -for-pack Ocamlbuild_pack -w +L -w +R -w +Z -I src -I +unix -safe-string -bin-annot -strict-sequence -c src/tags.ml
- ocamlopt.opt -for-pack Ocamlbuild_pack -w +L -w +R -w +Z -I src -I +unix -safe-string -bin-annot -strict-sequence -c src/display.ml
- ocamlopt.opt -for-pack Ocamlbuild_pack -w +L -w +R -w +Z -I src -I +unix -safe-string -bin-annot -strict-sequence -c src/log.ml
- ocamlopt.opt -for-pack Ocamlbuild_pack -w +L -w +R -w +Z -I src -I +unix -safe-string -bin-annot -strict-sequence -c src/shell.ml
- ocamlopt.opt -for-pack Ocamlbuild_pack -w +L -w +R -w +Z -I src -I +unix -safe-string -bin-annot -strict-sequence -c src/bool.ml
- ocamlopt.opt -for-pack Ocamlbuild_pack -w +L -w +R -w +Z -I src -I +unix -safe-string -bin-annot -strict-sequence -c src/glob_ast.ml
- ocamlopt.opt -for-pack Ocamlbuild_pack -w +L -w +R -w +Z -I src -I +unix -safe-string -bin-annot -strict-sequence -c src/glob_lexer.ml
- ocamlopt.opt -for-pack Ocamlbuild_pack -w +L -w +R -w +Z -I src -I +unix -safe-string -bin-annot -strict-sequence -c src/glob.ml
- ocamlopt.opt -for-pack Ocamlbuild_pack -w +L -w +R -w +Z -I src -I +unix -safe-string -bin-annot -strict-sequence -c src/lexers.ml
- ocamlopt.opt -for-pack Ocamlbuild_pack -w +L -w +R -w +Z -I src -I +unix -safe-string -bin-annot -strict-sequence -c src/param_tags.ml
- ocamlopt.opt -for-pack Ocamlbuild_pack -w +L -w +R -w +Z -I src -I +unix -safe-string -bin-annot -strict-sequence -c src/command.ml
- ocamlopt.opt -for-pack Ocamlbuild_pack -w +L -w +R -w +Z -I src -I +unix -safe-string -bin-annot -strict-sequence -c src/ocamlbuild_config.ml
- ocamlopt.opt -for-pack Ocamlbuild_pack -w +L -w +R -w +Z -I src -I +unix -safe-string -bin-annot -strict-sequence -c src/ocamlbuild_where.ml
- ocamlopt.opt -for-pack Ocamlbuild_pack -w +L -w +R -w +Z -I src -I +unix -safe-string -bin-annot -strict-sequence -c src/slurp.ml
- ocamlopt.opt -for-pack Ocamlbuild_pack -w +L -w +R -w +Z -I src -I +unix -safe-string -bin-annot -strict-sequence -c src/options.ml
- ocamlopt.opt -for-pack Ocamlbuild_pack -w +L -w +R -w +Z -I src -I +unix -safe-string -bin-annot -strict-sequence -c src/pathname.ml
- ocamlopt.opt -for-pack Ocamlbuild_pack -w +L -w +R -w +Z -I src -I +unix -safe-string -bin-annot -strict-sequence -c src/configuration.ml
- ocamlopt.opt -for-pack Ocamlbuild_pack -w +L -w +R -w +Z -I src -I +unix -safe-string -bin-annot -strict-sequence -c src/flags.ml
- ocamlopt.opt -for-pack Ocamlbuild_pack -w +L -w +R -w +Z -I src -I +unix -safe-string -bin-annot -strict-sequence -c src/hygiene.ml
- ocamlopt.opt -for-pack Ocamlbuild_pack -w +L -w +R -w +Z -I src -I +unix -safe-string -bin-annot -strict-sequence -c src/digest_cache.ml
- ocamlopt.opt -for-pack Ocamlbuild_pack -w +L -w +R -w +Z -I src -I +unix -safe-string -bin-annot -strict-sequence -c src/resource.ml
- ocamlopt.opt -for-pack Ocamlbuild_pack -w +L -w +R -w +Z -I src -I +unix -safe-string -bin-annot -strict-sequence -c src/rule.ml
- ocamlopt.opt -for-pack Ocamlbuild_pack -w +L -w +R -w +Z -I src -I +unix -safe-string -bin-annot -strict-sequence -c src/solver.ml
- ocamlopt.opt -for-pack Ocamlbuild_pack -w +L -w +R -w +Z -I src -I +unix -safe-string -bin-annot -strict-sequence -c src/report.ml
- ocamlopt.opt -for-pack Ocamlbuild_pack -w +L -w +R -w +Z -I src -I +unix -safe-string -bin-annot -strict-sequence -c src/tools.ml
- ocamlopt.opt -for-pack Ocamlbuild_pack -w +L -w +R -w +Z -I src -I +unix -safe-string -bin-annot -strict-sequence -c src/fda.ml
- ocamlopt.opt -for-pack Ocamlbuild_pack -w +L -w +R -w +Z -I src -I +unix -safe-string -bin-annot -strict-sequence -c src/findlib.ml
- ocamlopt.opt -for-pack Ocamlbuild_pack -w +L -w +R -w +Z -I src -I +unix -safe-string -bin-annot -strict-sequence -c src/ocaml_arch.ml
- ocamlopt.opt -for-pack Ocamlbuild_pack -w +L -w +R -w +Z -I src -I +unix -safe-string -bin-annot -strict-sequence -c src/ocaml_utils.ml
- ocamlopt.opt -for-pack Ocamlbuild_pack -w +L -w +R -w +Z -I src -I +unix -safe-string -bin-annot -strict-sequence -c src/ocaml_dependencies.ml
- ocamlopt.opt -for-pack Ocamlbuild_pack -w +L -w +R -w +Z -I src -I +unix -safe-string -bin-annot -strict-sequence -c src/ocaml_compiler.ml
- ocamlopt.opt -for-pack Ocamlbuild_pack -w +L -w +R -w +Z -I src -I +unix -safe-string -bin-annot -strict-sequence -c src/ocaml_tools.ml
- ocamlopt.opt -for-pack Ocamlbuild_pack -w +L -w +R -w +Z -I src -I +unix -safe-string -bin-annot -strict-sequence -c src/ocaml_specific.ml
- ocamlopt.opt -for-pack Ocamlbuild_pack -w +L -w +R -w +Z -I src -I +unix -safe-string -bin-annot -strict-sequence -c src/exit_codes.ml
- ocamlopt.opt -for-pack Ocamlbuild_pack -w +L -w +R -w +Z -I src -I +unix -safe-string -bin-annot -strict-sequence -c src/plugin.ml
- ocamlopt.opt -for-pack Ocamlbuild_pack -w +L -w +R -w +Z -I src -I +unix -safe-string -bin-annot -strict-sequence -c src/hooks.ml
- ocamlopt.opt -for-pack Ocamlbuild_pack -w +L -w +R -w +Z -I src -I +unix -safe-string -bin-annot -strict-sequence -c src/main.ml
- mkdir -p tmp
- ocamlopt.opt -pack src/const.cmx src/loc.cmx src/discard_printf.cmx src/signatures.cmi src/my_std.cmx src/my_unix.cmx src/tags.cmx src/display.cmx src/log.cmx src/shell.cmx src/bool.cmx src/glob_ast.cmx src/glob_lexer.cmx src/glob.cmx src/lexers.cmx src/param_tags.cmx src/command.cmx src/ocamlbuild_config.cmx src/ocamlbuild_where.cmx src/slurp.cmx src/options.cmx src/pathname.cmx src/configuration.cmx src/flags.cmx src/hygiene.cmx src/digest_cache.cmx src/resource.cmx src/rule.cmx src/solver.cmx src/report.cmx src/tools.cmx src/fda.cmx src/findlib.cmx src/ocaml_arch.cmx src/ocaml_utils.cmx src/ocaml_dependencies.cmx src/ocaml_compiler.cmx src/ocaml_tools.cmx src/ocaml_specific.cmx src/exit_codes.cmx src/plugin.cmx src/hooks.cmx src/main.cmx -o tmp/ocamlbuild_pack.cmx
- mv tmp/ocamlbuild_pack.cmx src/ocamlbuild_pack.cmx
- mv tmp/ocamlbuild_pack.o src/ocamlbuild_pack.o
- ocamlopt.opt -for-pack Ocamlbuild_pack -w +L -w +R -w +Z -I src -I +unix -safe-string -bin-annot -strict-sequence -c src/ocamlbuild_plugin.ml
- ocamlopt.opt -for-pack Ocamlbuild_pack -w +L -w +R -w +Z -I src -I +unix -safe-string -bin-annot -strict-sequence -c src/ocamlbuild_executor.ml
- ocamlopt.opt -for-pack Ocamlbuild_pack -w +L -w +R -w +Z -I src -I +unix -safe-string -bin-annot -strict-sequence -c src/ocamlbuild_unix_plugin.ml
- ocamlopt.opt -for-pack Ocamlbuild_pack -w +L -w +R -w +Z -I src -I +unix -safe-string -bin-annot -strict-sequence -c src/ocamlbuild.ml
- ocamlopt.opt -I +unix -I src -o ocamlbuild.native unix.cmxa src/ocamlbuild_pack.cmx src/ocamlbuild_plugin.cmx src/ocamlbuild_executor.cmx src/ocamlbuild_unix_plugin.cmx src/ocamlbuild.cmx
- ocamlopt.opt -a -o src/ocamlbuildlib.cmxa src/ocamlbuild_pack.cmx src/ocamlbuild_plugin.cmx src/ocamlbuild_executor.cmx src/ocamlbuild_unix_plugin.cmx
- ocamlc.opt src/ocamlbuild_pack.cmo -I src man/options_man.ml -o man/options_man.byte
- ./man/options_man.byte > man/ocamlbuild.options.1
- cat man/ocamlbuild.header.1 man/ocamlbuild.options.1 man/ocamlbuild.footer.1 > man/ocamlbuild.1
- make ocamlbuild.install
- make[1]: Entering directory '/home/opam/.opam/5.0/.opam-switch/build/ocamlbuild.0.14.1'
- rm -f ocamlbuild.install
- touch ocamlbuild.install
- make install-bin-opam
- make[2]: Entering directory '/home/opam/.opam/5.0/.opam-switch/build/ocamlbuild.0.14.1'
- echo 'bin: [' >> ocamlbuild.install
- echo '  "ocamlbuild.byte" {"ocamlbuild.byte"}' >> ocamlbuild.install
- echo '  "ocamlbuild.native" {"ocamlbuild.native"}' >> ocamlbuild.install
- echo '  "ocamlbuild.native" {"ocamlbuild"}' >> ocamlbuild.install
- echo ']' >> ocamlbuild.install
- echo >> ocamlbuild.install
- make[2]: Leaving directory '/home/opam/.opam/5.0/.opam-switch/build/ocamlbuild.0.14.1'
- make install-lib-opam
- make[2]: Entering directory '/home/opam/.opam/5.0/.opam-switch/build/ocamlbuild.0.14.1'
- echo 'lib: [' >> ocamlbuild.install
- make install-lib-basics-opam
- make[3]: Entering directory '/home/opam/.opam/5.0/.opam-switch/build/ocamlbuild.0.14.1'
- echo '  "ocamlbuild.opam" {"opam"}' >> ocamlbuild.install
- echo '  "META"' >> ocamlbuild.install
- for lib in src/signatures.mli src/signatures.cmi src/signatures.cmti; do \
-   echo "  \"$lib\" {\"$(basename $lib)\"}" >> ocamlbuild.install; \
- done
- make[3]: Leaving directory '/home/opam/.opam/5.0/.opam-switch/build/ocamlbuild.0.14.1'
- make install-lib-byte-opam
- make[3]: Entering directory '/home/opam/.opam/5.0/.opam-switch/build/ocamlbuild.0.14.1'
- for lib in src/ocamlbuildlib.cma src/ocamlbuild.cmo src/ocamlbuild_pack.cmi src/ocamlbuild_plugin.cmi src/ocamlbuild_executor.cmi src/ocamlbuild_unix_plugin.cmi; do \
-   echo "  \"$lib\" {\"$(basename $lib)\"}" >> ocamlbuild.install; \
- done
- make[3]: Leaving directory '/home/opam/.opam/5.0/.opam-switch/build/ocamlbuild.0.14.1'
- make install-lib-native-opam
- make[3]: Entering directory '/home/opam/.opam/5.0/.opam-switch/build/ocamlbuild.0.14.1'
- for lib in src/ocamlbuildlib.cmxa src/ocamlbuildlib.a src/ocamlbuild.cmx src/ocamlbuild.o src/ocamlbuild_pack.cmx src/ocamlbuild_plugin.cmx src/ocamlbuild_executor.cmx src/ocamlbuild_unix_plugin.cmx src/ocamlbuild_plugin.o src/ocamlbuild_executor.o src/ocamlbuild_unix_plugin.o; do \
-   echo "  \"$lib\" {\"$(basename $lib)\"}" >> ocamlbuild.install; \
- done
- make[3]: Leaving directory '/home/opam/.opam/5.0/.opam-switch/build/ocamlbuild.0.14.1'
- echo ']' >> ocamlbuild.install
- echo >> ocamlbuild.install
- make[2]: Leaving directory '/home/opam/.opam/5.0/.opam-switch/build/ocamlbuild.0.14.1'
- make install-man-opam
- make[2]: Entering directory '/home/opam/.opam/5.0/.opam-switch/build/ocamlbuild.0.14.1'
- echo 'man: [' >> ocamlbuild.install
- echo '  "man/ocamlbuild.1" {"man1/ocamlbuild.1"}' >> ocamlbuild.install
- echo ']' >> ocamlbuild.install
- echo >> ocamlbuild.install
- make[2]: Leaving directory '/home/opam/.opam/5.0/.opam-switch/build/ocamlbuild.0.14.1'
- make install-doc-opam
- make[2]: Entering directory '/home/opam/.opam/5.0/.opam-switch/build/ocamlbuild.0.14.1'
- echo 'doc: [' >> ocamlbuild.install
- echo '  "LICENSE"' >> ocamlbuild.install
- echo '  "Changes"' >> ocamlbuild.install
- echo '  "Readme.md"' >> ocamlbuild.install
- echo ']' >> ocamlbuild.install
- make[2]: Leaving directory '/home/opam/.opam/5.0/.opam-switch/build/ocamlbuild.0.14.1'
- make[1]: Leaving directory '/home/opam/.opam/5.0/.opam-switch/build/ocamlbuild.0.14.1'
-> compiled  ocamlbuild.0.14.1
Processing 38/78: [dune: ocaml bootstrap.ml]
-> installed ocamlbuild.0.14.1
Processing 39/78: [dune: ocaml bootstrap.ml]
Processing 40/78: [dune: ocaml bootstrap.ml] [msat: make disable_log]
Processing 41/78: [dune: ocaml bootstrap.ml] [msat: make disable_log] [topkg: ocaml build]
+ /home/opam/.opam/opam-init/hooks/sandbox.sh "build" "make" "disable_log" (CWD=/home/opam/.opam/5.0/.opam-switch/build/msat.0.7)
- cd src/util; ln -sf log_dummy.ml log.ml
Processing 41/78: [dune: ocaml bootstrap.ml] [msat: make lib] [topkg: ocaml build]
+ /home/opam/.opam/opam-init/hooks/sandbox.sh "build" "make" "lib" (CWD=/home/opam/.opam/5.0/.opam-switch/build/msat.0.7)
- ocamlbuild -log build.log -use-ocamlfind  msat.cma msat.cmxa msat.cmxs
- ocamlfind ocamlopt unix.cmxa -I /home/opam/.opam/5.0/lib/ocamlbuild /home/opam/.opam/5.0/lib/ocamlbuild/ocamlbuildlib.cmxa -linkpkg myocamlbuild.ml /home/opam/.opam/5.0/lib/ocamlbuild/ocamlbuild.cmx -o myocamlbuild
- ocamlfind ocamldep -modules src/util/log.mli > src/util/log.mli.depends
- ocamlfind ocamlc -c -bin-annot -color always -I src/util -I src -I src/solver -I src/smt -I src/sat -I src/mcsat -I src/core -I src/backend -o src/util/log.cmi src/util/log.mli
- ocamlfind ocamldep -modules src/util/log.ml > src/util/log.ml.depends
- ocamlfind ocamldep -modules src/core/formula_intf.ml > src/core/formula_intf.ml.depends
- ocamlfind ocamldep -modules src/core/theory_intf.ml > src/core/theory_intf.ml.depends
- ocamlfind ocamldep -modules src/core/plugin_intf.ml > src/core/plugin_intf.ml.depends
- ocamlfind ocamlc -c -g -bin-annot -safe-string -short-paths -w K -w X -w Y -strict-sequence -color always -I src/core -I src -I src/util -I src/solver -I src/smt -I src/sat -I src/mcsat -I src/backend -o src/core/plugin_intf.cmo src/core/plugin_intf.ml
- ocamlfind ocamldep -modules src/core/expr_intf.ml > src/core/expr_intf.ml.depends
- ocamlfind ocamlc -c -g -bin-annot -safe-string -short-paths -w K -w X -w Y -strict-sequence -color always -I src/core -I src -I src/util -I src/solver -I src/smt -I src/sat -I src/mcsat -I src/backend -o src/core/formula_intf.cmo src/core/formula_intf.ml
- ocamlfind ocamldep -modules src/solver/tseitin_intf.ml > src/solver/tseitin_intf.ml.depends
- ocamlfind ocamldep -modules src/core/res_intf.ml > src/core/res_intf.ml.depends
- ocamlfind ocamldep -modules src/core/solver_types.mli > src/core/solver_types.mli.depends
- ocamlfind ocamlc -c -g -bin-annot -safe-string -short-paths -w K -w X -w Y -strict-sequence -color always -I src/core -I src -I src/util -I src/solver -I src/smt -I src/sat -I src/mcsat -I src/backend -o src/core/expr_intf.cmo src/core/expr_intf.ml
- ocamlfind ocamldep -modules src/core/solver_types_intf.ml > src/core/solver_types_intf.ml.depends
- ocamlfind ocamldep -modules src/util/vec.mli > src/util/vec.mli.depends
- ocamlfind ocamlc -c -bin-annot -color always -I src/util -I src -I src/solver -I src/smt -I src/sat -I src/mcsat -I src/core -I src/backend -o src/util/vec.cmi src/util/vec.mli
- ocamlfind ocamlc -c -g -bin-annot -safe-string -short-paths -w K -w X -w Y -strict-sequence -color always -I src/core -I src -I src/util -I src/solver -I src/smt -I src/sat -I src/mcsat -I src/backend -o src/core/solver_types_intf.cmo src/core/solver_types_intf.ml
- ocamlfind ocamlc -c -bin-annot -color always -I src/core -I src -I src/util -I src/solver -I src/smt -I src/sat -I src/mcsat -I src/backend -o src/core/solver_types.cmi src/core/solver_types.mli
- ocamlfind ocamldep -modules src/core/solver_intf.ml > src/core/solver_intf.ml.depends
- ocamlfind ocamldep -modules src/core/res.mli > src/core/res.mli.depends
- ocamlfind ocamlc -c -g -bin-annot -safe-string -short-paths -w K -w X -w Y -strict-sequence -color always -I src/core -I src -I src/util -I src/solver -I src/smt -I src/sat -I src/mcsat -I src/backend -o src/core/res_intf.cmo src/core/res_intf.ml
- ocamlfind ocamlc -c -bin-annot -color always -I src/core -I src -I src/util -I src/solver -I src/smt -I src/sat -I src/mcsat -I src/backend -o src/core/res.cmi src/core/res.mli
- ocamlfind ocamldep -modules src/core/internal.mli > src/core/internal.mli.depends
- ocamlfind ocamlc -c -bin-annot -color always -I src/core -I src -I src/util -I src/solver -I src/smt -I src/sat -I src/mcsat -I src/backend -o src/core/internal.cmi src/core/internal.mli
- ocamlfind ocamldep -modules src/core/internal.ml > src/core/internal.ml.depends
- ocamlfind ocamldep -modules src/util/array_util.ml > src/util/array_util.ml.depends
- ocamlfind ocamldep -modules src/util/iheap.mli > src/util/iheap.mli.depends
- ocamlfind ocamlc -c -g -bin-annot -safe-string -short-paths -w K -w X -w Y -strict-sequence -color always -I src/util -I src -I src/solver -I src/smt -I src/sat -I src/mcsat -I src/core -I src/backend -o src/util/array_util.cmo src/util/array_util.ml
- ocamlfind ocamlc -c -bin-annot -color always -I src/util -I src -I src/solver -I src/smt -I src/sat -I src/mcsat -I src/core -I src/backend -o src/util/iheap.cmi src/util/iheap.mli
- ocamlfind ocamldep -modules src/core/external.mli > src/core/external.mli.depends
- ocamlfind ocamlc -c -g -bin-annot -safe-string -short-paths -w K -w X -w Y -strict-sequence -color always -I src/core -I src -I src/util -I src/solver -I src/smt -I src/sat -I src/mcsat -I src/backend -o src/core/solver_intf.cmo src/core/solver_intf.ml
- ocamlfind ocamlc -c -bin-annot -color always -I src/core -I src -I src/util -I src/solver -I src/smt -I src/sat -I src/mcsat -I src/backend -o src/core/external.cmi src/core/external.mli
- ocamlfind ocamldep -modules src/core/external.ml > src/core/external.ml.depends
- ocamlfind ocamldep -modules src/backend/dimacs.mli > src/backend/dimacs.mli.depends
- ocamlfind ocamlc -c -bin-annot -color always -I src/backend -I src -I src/util -I src/solver -I src/smt -I src/sat -I src/mcsat -I src/core -o src/backend/dimacs.cmi src/backend/dimacs.mli
- ocamlfind ocamldep -modules src/solver/solver.mli > src/solver/solver.mli.depends
- ocamlfind ocamlc -c -g -bin-annot -safe-string -short-paths -w K -w X -w Y -strict-sequence -color always -I src/core -I src -I src/util -I src/solver -I src/smt -I src/sat -I src/mcsat -I src/backend -o src/core/theory_intf.cmo src/core/theory_intf.ml
- ocamlfind ocamlc -c -bin-annot -color always -I src/solver -I src -I src/util -I src/smt -I src/sat -I src/mcsat -I src/core -I src/backend -o src/solver/solver.cmi src/solver/solver.mli
- ocamlfind ocamldep -modules src/solver/solver.ml > src/solver/solver.ml.depends
- ocamlfind ocamldep -modules src/solver/mcsolver.mli > src/solver/mcsolver.mli.depends
- ocamlfind ocamlc -c -bin-annot -color always -I src/solver -I src -I src/util -I src/smt -I src/sat -I src/mcsat -I src/core -I src/backend -o src/solver/mcsolver.cmi src/solver/mcsolver.mli
- ocamlfind ocamldep -modules src/solver/mcsolver.ml > src/solver/mcsolver.ml.depends
- ocamlfind ocamldep -modules src/core/solver_types.ml > src/core/solver_types.ml.depends
- ocamlfind ocamldep -modules src/core/res.ml > src/core/res.ml.depends
- ocamlfind ocamldep -modules src/backend/backend_intf.ml > src/backend/backend_intf.ml.depends
- ocamlfind ocamldep -modules src/backend/dot.mli > src/backend/dot.mli.depends
- ocamlfind ocamlc -c -g -bin-annot -safe-string -short-paths -w K -w X -w Y -strict-sequence -color always -I src/backend -I src -I src/util -I src/solver -I src/smt -I src/sat -I src/mcsat -I src/core -o src/backend/backend_intf.cmo src/backend/backend_intf.ml
- ocamlfind ocamlc -c -bin-annot -color always -I src/backend -I src -I src/util -I src/solver -I src/smt -I src/sat -I src/mcsat -I src/core -o src/backend/dot.cmi src/backend/dot.mli
- ocamlfind ocamldep -modules src/backend/dot.ml > src/backend/dot.ml.depends
- ocamlfind ocamldep -modules src/backend/coq.mli > src/backend/coq.mli.depends
- ocamlfind ocamlc -c -bin-annot -color always -I src/backend -I src -I src/util -I src/solver -I src/smt -I src/sat -I src/mcsat -I src/core -o src/backend/coq.cmi src/backend/coq.mli
- ocamlfind ocamldep -modules src/backend/coq.ml > src/backend/coq.ml.depends
- ocamlfind ocamldep -modules src/backend/dimacs.ml > src/backend/dimacs.ml.depends
- ocamlfind ocamldep -modules src/backend/dedukti.mli > src/backend/dedukti.mli.depends
- ocamlfind ocamlc -c -bin-annot -color always -I src/backend -I src -I src/util -I src/solver -I src/smt -I src/sat -I src/mcsat -I src/core -o src/backend/dedukti.cmi src/backend/dedukti.mli
- ocamlfind ocamldep -modules src/backend/dedukti.ml > src/backend/dedukti.ml.depends
- ocamlfind ocamldep -modules src/solver/tseitin.mli > src/solver/tseitin.mli.depends
- ocamlfind ocamlc -c -g -bin-annot -safe-string -short-paths -w K -w X -w Y -strict-sequence -color always -I src/solver -I src -I src/util -I src/smt -I src/sat -I src/mcsat -I src/core -I src/backend -o src/solver/tseitin_intf.cmo src/solver/tseitin_intf.ml
- ocamlfind ocamlc -c -bin-annot -color always -I src/solver -I src -I src/util -I src/smt -I src/sat -I src/mcsat -I src/core -I src/backend -o src/solver/tseitin.cmi src/solver/tseitin.mli
- ocamlfind ocamldep -modules src/solver/tseitin.ml > src/solver/tseitin.ml.depends
- ocamlfind ocamldep -modules src/sat/sat.mli > src/sat/sat.mli.depends
- ocamlfind ocamlc -c -bin-annot -color always -I src/sat -I src -I src/util -I src/solver -I src/smt -I src/mcsat -I src/core -I src/backend -o src/sat/sat.cmi src/sat/sat.mli
- ocamlfind ocamldep -modules src/sat/sat.ml > src/sat/sat.ml.depends
- ocamlfind ocamlc -c -g -bin-annot -safe-string -short-paths -w K -w X -w Y -strict-sequence -color always -I src/util -I src -I src/solver -I src/smt -I src/sat -I src/mcsat -I src/core -I src/backend -o src/util/log.cmo src/util/log.ml
- ocamlfind ocamlc -c -g -bin-annot -safe-string -short-paths -w K -w X -w Y -strict-sequence -color always -I src/core -I src -I src/util -I src/solver -I src/smt -I src/sat -I src/mcsat -I src/backend -o src/core/internal.cmo src/core/internal.ml
- + ocamlfind ocamlc -c -g -bin-annot -safe-string -short-paths -w K -w X -w Y -strict-sequence -color always -I src/core -I src -I src/util -I src/solver -I src/smt -I src/sat -I src/mcsat -I src/backend -o src/core/internal.cmo src/core/internal.ml
- File "src/core/internal.ml", line 546, characters 6-18:
- 546 |       enqueue_bool a lvl Semantic
-             ^^^^^^^^^^^^
- Warning 6 [labels-omitted]: label level was omitted in the application of this function.
- File "src/core/internal.ml", line 837, characters 12-24:
- 837 |             enqueue_bool a lvl (Bcp clause)
-                   ^^^^^^^^^^^^
- Warning 6 [labels-omitted]: label level was omitted in the application of this function.
- File "src/core/internal.ml", line 901, characters 12-24:
- 901 |             enqueue_bool first (decision_level ()) (Bcp c)
-                   ^^^^^^^^^^^^
- Warning 6 [labels-omitted]: label level was omitted in the application of this function.
- File "src/core/internal.ml", line 976, characters 10-22:
- 976 |           enqueue_bool p lvl (Bcp c)
-                 ^^^^^^^^^^^^
- Warning 6 [labels-omitted]: label level was omitted in the application of this function.
- File "src/core/internal.ml", line 1070, characters 8-20:
- 1070 |         enqueue_bool atom current_level Decision
-                ^^^^^^^^^^^^
- Warning 6 [labels-omitted]: label level was omitted in the application of this function.
- ocamlfind ocamlc -c -g -bin-annot -safe-string -short-paths -w K -w X -w Y -strict-sequence -color always -I src/core -I src -I src/util -I src/solver -I src/smt -I src/sat -I src/mcsat -I src/backend -o src/core/external.cmo src/core/external.ml
- ocamlfind ocamlc -c -g -bin-annot -safe-string -short-paths -w K -w X -w Y -strict-sequence -color always -I src/solver -I src -I src/util -I src/smt -I src/sat -I src/mcsat -I src/core -I src/backend -o src/solver/solver.cmo src/solver/solver.ml
- ocamlfind ocamlc -c -g -bin-annot -safe-string -short-paths -w K -w X -w Y -strict-sequence -color always -I src/solver -I src -I src/util -I src/smt -I src/sat -I src/mcsat -I src/core -I src/backend -o src/solver/mcsolver.cmo src/solver/mcsolver.ml
- ocamlfind ocamlc -c -g -bin-annot -safe-string -short-paths -w K -w X -w Y -strict-sequence -color always -I src/core -I src -I src/util -I src/solver -I src/smt -I src/sat -I src/mcsat -I src/backend -o src/core/solver_types.cmo src/core/solver_types.ml
- ocamlfind ocamlc -c -g -bin-annot -safe-string -short-paths -w K -w X -w Y -strict-sequence -color always -I src/core -I src -I src/util -I src/solver -I src/smt -I src/sat -I src/mcsat -I src/backend -o src/core/res.cmo src/core/res.ml
- + ocamlfind ocamlc -c -g -bin-annot -safe-string -short-paths -w K -w X -w Y -strict-sequence -color always -I src/core -I src -I src/util -I src/solver -I src/smt -I src/sat -I src/mcsat -I src/backend -o src/core/res.cmo src/core/res.ml
- File "src/core/res.ml", line 29, characters 26-44:
- 29 |   let compare_atoms a b = Pervasives.compare St.(a.aid) St.(b.aid)
-                                ^^^^^^^^^^^^^^^^^^
- Error: Unbound module Pervasives
- Command exited with code 2.
- + ocamlfind ocamlopt unix.cmxa -I /home/opam/.opam/5.0/lib/ocamlbuild /home/opam/.opam/5.0/lib/ocamlbuild/ocamlbuildlib.cmxa -linkpkg myocamlbuild.ml /home/opam/.opam/5.0/lib/ocamlbuild/ocamlbuild.cmx -o myocamlbuild
- File "_none_", line 1:
- Alert ocaml_deprecated_auto_include: 
- OCaml's lib directory layout changed in 5.0. The unix subdirectory has been
- automatically added to the search path, but you should add -I +unix to the
- command-line to silence this alert (e.g. by adding unix to the list of
- libraries in your dune file, or adding use_unix to your _tags file for
- ocamlbuild, or using -package unix for ocamlfind).
- make: *** [Makefile:17: lib] Error 10
Processing 41/78: [dune: ocaml bootstrap.ml] [topkg: ocaml build]
Processing 42/78: [dune: ocaml bootstrap.ml] [topkg: ocaml build]
[ERROR] The compilation of msat.0.7 failed at "make lib".
+ /home/opam/.opam/opam-init/hooks/sandbox.sh "build" "ocaml" "pkg/pkg.ml" "build" "--pkg-name" "topkg" "--dev-pkg" "false" (CWD=/home/opam/.opam/5.0/.opam-switch/build/topkg.1.0.5)
- ocamlfind ocamldep -modules src/topkg.ml > src/topkg.ml.depends
- ocamlfind ocamldep -modules src/topkg.mli > src/topkg.mli.depends
- ocamlfind ocamlc -c -g -bin-annot -safe-string -I src -I test -I src-care -I src-bin -o src/topkg.cmi src/topkg.mli
- ocamlfind ocamldep -modules src/topkg_build.ml > src/topkg_build.ml.depends
- ocamlfind ocamldep -modules src/topkg_build.mli > src/topkg_build.mli.depends
- ocamlfind ocamldep -modules src/topkg_cmd.mli > src/topkg_cmd.mli.depends
- ocamlfind ocamldep -modules src/topkg_fpath.mli > src/topkg_fpath.mli.depends
- ocamlfind ocamlc -c -g -bin-annot -safe-string -I src -I test -I src-care -I src-bin -o src/topkg_fpath.cmi src/topkg_fpath.mli
- ocamlfind ocamldep -modules src/topkg_codec.mli > src/topkg_codec.mli.depends
- ocamlfind ocamlc -c -g -bin-annot -safe-string -I src -I test -I src-care -I src-bin -o src/topkg_cmd.cmi src/topkg_cmd.mli
- ocamlfind ocamldep -modules src/topkg_result.mli > src/topkg_result.mli.depends
- ocamlfind ocamlc -c -g -bin-annot -safe-string -I src -I test -I src-care -I src-bin -o src/topkg_result.cmi src/topkg_result.mli
- ocamlfind ocamldep -modules src/topkg_conf.mli > src/topkg_conf.mli.depends
- ocamlfind ocamlc -c -g -bin-annot -safe-string -I src -I test -I src-care -I src-bin -o src/topkg_codec.cmi src/topkg_codec.mli
- ocamlfind ocamlc -c -g -bin-annot -safe-string -I src -I test -I src-care -I src-bin -o src/topkg_conf.cmi src/topkg_conf.mli
- ocamlfind ocamlc -c -g -bin-annot -safe-string -I src -I test -I src-care -I src-bin -o src/topkg_build.cmi src/topkg_build.mli
- ocamlfind ocamldep -modules src/topkg_cmd.ml > src/topkg_cmd.ml.depends
- ocamlfind ocamldep -modules src/topkg_fpath.ml > src/topkg_fpath.ml.depends
- ocamlfind ocamldep -modules src/topkg_string.ml > src/topkg_string.ml.depends
- ocamlfind ocamldep -modules src/topkg_string.mli > src/topkg_string.mli.depends
- ocamlfind ocamlc -c -g -bin-annot -safe-string -I src -I test -I src-care -I src-bin -o src/topkg_string.cmi src/topkg_string.mli
- ocamlfind ocamlopt -c -g -bin-annot -safe-string -I src -I test -I src-care -I src-bin -o src/topkg_string.cmx src/topkg_string.ml
- ocamlfind ocamlopt -c -g -bin-annot -safe-string -I src -I test -I src-care -I src-bin -o src/topkg_fpath.cmx src/topkg_fpath.ml
- ocamlfind ocamldep -modules src/topkg_codec.ml > src/topkg_codec.ml.depends
- ocamlfind ocamlopt -c -g -bin-annot -safe-string -I src -I test -I src-care -I src-bin -o src/topkg_cmd.cmx src/topkg_cmd.ml
- ocamlfind ocamldep -modules src/topkg_os.ml > src/topkg_os.ml.depends
- ocamlfind ocamldep -modules src/topkg_os.mli > src/topkg_os.mli.depends
- ocamlfind ocamlc -c -g -bin-annot -safe-string -I src -I test -I src-care -I src-bin -o src/topkg_os.cmi src/topkg_os.mli
- ocamlfind ocamldep -modules src/topkg_log.ml > src/topkg_log.ml.depends
- ocamlfind ocamldep -modules src/topkg_log.mli > src/topkg_log.mli.depends
- ocamlfind ocamlc -c -g -bin-annot -safe-string -I src -I test -I src-care -I src-bin -o src/topkg_log.cmi src/topkg_log.mli
- ocamlfind ocamldep -modules src/topkg_result.ml > src/topkg_result.ml.depends
- ocamlfind ocamlopt -c -g -bin-annot -safe-string -I src -I test -I src-care -I src-bin -o src/topkg_result.cmx src/topkg_result.ml
- ocamlfind ocamlopt -c -g -bin-annot -safe-string -I src -I test -I src-care -I src-bin -o src/topkg_log.cmx src/topkg_log.ml
- ocamlfind ocamlopt -c -g -bin-annot -safe-string -I src -I test -I src-care -I src-bin -o src/topkg_os.cmx src/topkg_os.ml
- ocamlfind ocamldep -modules src/topkg_conf.ml > src/topkg_conf.ml.depends
- ocamlfind ocamlopt -c -g -bin-annot -safe-string -I src -I test -I src-care -I src-bin -o src/topkg_codec.cmx src/topkg_codec.ml
- ocamlfind ocamldep -modules src/topkg_vcs.ml > src/topkg_vcs.ml.depends
- ocamlfind ocamldep -modules src/topkg_vcs.mli > src/topkg_vcs.mli.depends
- ocamlfind ocamlc -c -g -bin-annot -safe-string -I src -I test -I src-care -I src-bin -o src/topkg_vcs.cmi src/topkg_vcs.mli
- ocamlfind ocamlopt -c -g -bin-annot -safe-string -I src -I test -I src-care -I src-bin -o src/topkg_vcs.cmx src/topkg_vcs.ml
- ocamlfind ocamlopt -c -g -bin-annot -safe-string -I src -I test -I src-care -I src-bin -o src/topkg_conf.cmx src/topkg_conf.ml
- ocamlfind ocamldep -modules src/topkg_distrib.ml > src/topkg_distrib.ml.depends
- ocamlfind ocamldep -modules src/topkg_distrib.mli > src/topkg_distrib.mli.depends
- ocamlfind ocamlc -c -g -bin-annot -safe-string -I src -I test -I src-care -I src-bin -o src/topkg_distrib.cmi src/topkg_distrib.mli
- ocamlfind ocamldep -modules src/topkg_opam.ml > src/topkg_opam.ml.depends
- ocamlfind ocamldep -modules src/topkg_opam.mli > src/topkg_opam.mli.depends
- ocamlfind ocamlc -c -g -bin-annot -safe-string -I src -I test -I src-care -I src-bin -o src/topkg_opam.cmi src/topkg_opam.mli
- ocamlfind ocamlopt -c -g -bin-annot -safe-string -I src -I test -I src-care -I src-bin -o src/topkg_opam.cmx src/topkg_opam.ml
- ocamlfind ocamldep -modules src/topkg_fexts.ml > src/topkg_fexts.ml.depends
- ocamlfind ocamldep -modules src/topkg_fexts.mli > src/topkg_fexts.mli.depends
- ocamlfind ocamlc -c -g -bin-annot -safe-string -I src -I test -I src-care -I src-bin -o src/topkg_fexts.cmi src/topkg_fexts.mli
- ocamlfind ocamldep -modules src/topkg_install.ml > src/topkg_install.ml.depends
- ocamlfind ocamldep -modules src/topkg_install.mli > src/topkg_install.mli.depends
- ocamlfind ocamldep -modules src/topkg_test.mli > src/topkg_test.mli.depends
- ocamlfind ocamlc -c -g -bin-annot -safe-string -I src -I test -I src-care -I src-bin -o src/topkg_test.cmi src/topkg_test.mli
- ocamlfind ocamlc -c -g -bin-annot -safe-string -I src -I test -I src-care -I src-bin -o src/topkg_install.cmi src/topkg_install.mli
- ocamlfind ocamlopt -c -g -bin-annot -safe-string -I src -I test -I src-care -I src-bin -o src/topkg_fexts.cmx src/topkg_fexts.ml
- ocamlfind ocamldep -modules src/topkg_test.ml > src/topkg_test.ml.depends
- ocamlfind ocamlopt -c -g -bin-annot -safe-string -I src -I test -I src-care -I src-bin -o src/topkg_test.cmx src/topkg_test.ml
- ocamlfind ocamldep -modules src/topkg_ipc.ml > src/topkg_ipc.ml.depends
- ocamlfind ocamldep -modules src/topkg_ipc.mli > src/topkg_ipc.mli.depends
- ocamlfind ocamldep -modules src/topkg_pkg.mli > src/topkg_pkg.mli.depends
- ocamlfind ocamldep -modules src/topkg_publish.mli > src/topkg_publish.mli.depends
- ocamlfind ocamlc -c -g -bin-annot -safe-string -I src -I test -I src-care -I src-bin -o src/topkg_publish.cmi src/topkg_publish.mli
- ocamlfind ocamlc -c -g -bin-annot -safe-string -I src -I test -I src-care -I src-bin -o src/topkg_pkg.cmi src/topkg_pkg.mli
- ocamlfind ocamlc -c -g -bin-annot -safe-string -I src -I test -I src-care -I src-bin -o src/topkg_ipc.cmi src/topkg_ipc.mli
- ocamlfind ocamldep -modules src/topkg_pkg.ml > src/topkg_pkg.ml.depends
- ocamlfind ocamlopt -c -g -bin-annot -safe-string -I src -I test -I src-care -I src-bin -o src/topkg_build.cmx src/topkg_build.ml
- ocamlfind ocamlopt -c -g -bin-annot -safe-string -I src -I test -I src-care -I src-bin -o src/topkg_distrib.cmx src/topkg_distrib.ml
- ocamlfind ocamlopt -c -g -bin-annot -safe-string -I src -I test -I src-care -I src-bin -o src/topkg_install.cmx src/topkg_install.ml
- ocamlfind ocamldep -modules src/topkg_publish.ml > src/topkg_publish.ml.depends
- ocamlfind ocamlopt -c -g -bin-annot -safe-string -I src -I test -I src-care -I src-bin -o src/topkg_publish.cmx src/topkg_publish.ml
- ocamlfind ocamlopt -c -g -bin-annot -safe-string -I src -I test -I src-care -I src-bin -o src/topkg_pkg.cmx src/topkg_pkg.ml
- ocamlfind ocamldep -modules src/topkg_main.ml > src/topkg_main.ml.depends
- ocamlfind ocamldep -modules src/topkg_main.mli > src/topkg_main.mli.depends
- ocamlfind ocamlc -c -g -bin-annot -safe-string -I src -I test -I src-care -I src-bin -o src/topkg_main.cmi src/topkg_main.mli
- ocamlfind ocamlopt -c -g -bin-annot -safe-string -I src -I test -I src-care -I src-bin -o src/topkg_ipc.cmx src/topkg_ipc.ml
- ocamlfind ocamlopt -c -g -bin-annot -safe-string -I src -I test -I src-care -I src-bin -o src/topkg_main.cmx src/topkg_main.ml
- ocamlfind ocamlopt -c -g -bin-annot -safe-string -I src -I test -I src-care -I src-bin -o src/topkg.cmx src/topkg.ml
- ocamlfind ocamlopt -a -I src src/topkg_string.cmx src/topkg_fpath.cmx src/topkg_cmd.cmx src/topkg_result.cmx src/topkg_log.cmx src/topkg_os.cmx src/topkg_codec.cmx src/topkg_vcs.cmx src/topkg_conf.cmx src/topkg_build.cmx src/topkg_opam.cmx src/topkg_distrib.cmx src/topkg_fexts.cmx src/topkg_test.cmx src/topkg_install.cmx src/topkg_publish.cmx src/topkg_pkg.cmx src/topkg_ipc.cmx src/topkg_main.cmx src/topkg.cmx -o src/topkg.cmxa
- ocamlfind ocamlc -c -g -bin-annot -safe-string -I src -I test -I src-care -I src-bin -o src/topkg.cmo src/topkg.ml
- ocamlfind ocamlc -c -g -bin-annot -safe-string -I src -I test -I src-care -I src-bin -o src/topkg_build.cmo src/topkg_build.ml
- ocamlfind ocamlc -c -g -bin-annot -safe-string -I src -I test -I src-care -I src-bin -o src/topkg_cmd.cmo src/topkg_cmd.ml
- ocamlfind ocamlc -c -g -bin-annot -safe-string -I src -I test -I src-care -I src-bin -o src/topkg_codec.cmo src/topkg_codec.ml
- ocamlfind ocamlc -c -g -bin-annot -safe-string -I src -I test -I src-care -I src-bin -o src/topkg_conf.cmo src/topkg_conf.ml
- ocamlfind ocamlc -c -g -bin-annot -safe-string -I src -I test -I src-care -I src-bin -o src/topkg_distrib.cmo src/topkg_distrib.ml
- ocamlfind ocamlc -c -g -bin-annot -safe-string -I src -I test -I src-care -I src-bin -o src/topkg_fexts.cmo src/topkg_fexts.ml
- ocamlfind ocamlc -c -g -bin-annot -safe-string -I src -I test -I src-care -I src-bin -o src/topkg_fpath.cmo src/topkg_fpath.ml
- ocamlfind ocamlc -c -g -bin-annot -safe-string -I src -I test -I src-care -I src-bin -o src/topkg_install.cmo src/topkg_install.ml
- ocamlfind ocamlc -c -g -bin-annot -safe-string -I src -I test -I src-care -I src-bin -o src/topkg_ipc.cmo src/topkg_ipc.ml
- ocamlfind ocamlc -c -g -bin-annot -safe-string -I src -I test -I src-care -I src-bin -o src/topkg_log.cmo src/topkg_log.ml
- ocamlfind ocamlc -c -g -bin-annot -safe-string -I src -I test -I src-care -I src-bin -o src/topkg_main.cmo src/topkg_main.ml
- ocamlfind ocamlc -c -g -bin-annot -safe-string -I src -I test -I src-care -I src-bin -o src/topkg_opam.cmo src/topkg_opam.ml
- ocamlfind ocamlc -c -g -bin-annot -safe-string -I src -I test -I src-care -I src-bin -o src/topkg_os.cmo src/topkg_os.ml
- ocamlfind ocamlc -c -g -bin-annot -safe-string -I src -I test -I src-care -I src-bin -o src/topkg_pkg.cmo src/topkg_pkg.ml
- ocamlfind ocamlc -c -g -bin-annot -safe-string -I src -I test -I src-care -I src-bin -o src/topkg_publish.cmo src/topkg_publish.ml
- ocamlfind ocamlc -c -g -bin-annot -safe-string -I src -I test -I src-care -I src-bin -o src/topkg_result.cmo src/topkg_result.ml
- ocamlfind ocamlc -c -g -bin-annot -safe-string -I src -I test -I src-care -I src-bin -o src/topkg_string.cmo src/topkg_string.ml
- ocamlfind ocamlc -c -g -bin-annot -safe-string -I src -I test -I src-care -I src-bin -o src/topkg_test.cmo src/topkg_test.ml
- ocamlfind ocamlc -c -g -bin-annot -safe-string -I src -I test -I src-care -I src-bin -o src/topkg_vcs.cmo src/topkg_vcs.ml
- ocamlfind ocamlc -a -I src src/topkg_string.cmo src/topkg_fpath.cmo src/topkg_cmd.cmo src/topkg_result.cmo src/topkg_log.cmo src/topkg_os.cmo src/topkg_codec.cmo src/topkg_vcs.cmo src/topkg_conf.cmo src/topkg_build.cmo src/topkg_opam.cmo src/topkg_distrib.cmo src/topkg_fexts.cmo src/topkg_test.cmo src/topkg_install.cmo src/topkg_publish.cmo src/topkg_pkg.cmo src/topkg_ipc.cmo src/topkg_main.cmo src/topkg.cmo -o src/topkg.cma
- # Parallel statistics: { count(total): 2(83), max: 20, min: 2, average(total): 11.000(1.241) }
-> compiled  topkg.1.0.5
Processing 42/78: [dune: ocaml bootstrap.ml]
-> installed topkg.1.0.5
Processing 43/78: [dune: ocaml bootstrap.ml]
Processing 44/78: [dune: ocaml bootstrap.ml] [mtime: ocaml build]
Processing 45/78: [dune: ocaml bootstrap.ml] [mtime: ocaml build] [uutf: ocaml build]
+ /home/opam/.opam/opam-init/hooks/sandbox.sh "build" "ocaml" "pkg/pkg.ml" "build" "--dev-pkg" "false" "--with-cmdliner" "true" (CWD=/home/opam/.opam/5.0/.opam-switch/build/uutf.1.0.3)
- ocamlfind ocamldep -modules src/uutf.ml > src/uutf.ml.depends
- ocamlfind ocamldep -modules src/uutf.mli > src/uutf.mli.depends
- ocamlfind ocamlc -c -g -bin-annot -safe-string -I src -I test -o src/uutf.cmi src/uutf.mli
- ocamlfind ocamlopt -c -g -bin-annot -safe-string -I src -I test -o src/uutf.cmx src/uutf.ml
- ocamlfind ocamlopt -a -I src src/uutf.cmx -o src/uutf.cmxa
- ocamlfind ocamlc -c -g -bin-annot -safe-string -I src -I test -o src/uutf.cmo src/uutf.ml
- ocamlfind ocamlc -a -I src src/uutf.cmo -o src/uutf.cma
- ocamlfind ocamldep -package unix -package cmdliner -modules test/utftrip.ml > test/utftrip.ml.depends
- ocamlfind ocamlc -c -g -bin-annot -safe-string -package unix -package cmdliner -I test -I src -o test/utftrip.cmo test/utftrip.ml
- + ocamlfind ocamlc -c -g -bin-annot -safe-string -package unix -package cmdliner -I test -I src -o test/utftrip.cmo test/utftrip.ml
- File "test/utftrip.ml", line 385, characters 8-12:
- 385 |   Term.(pure do_cmd $ cmd $ file $ sin $ sout $ use_unix $ usize $
-               ^^^^
- Alert deprecated: Cmdliner.Term.pure
- Use Term.const instead.
- File "test/utftrip.ml", line 387, characters 2-11:
- 387 |   Term.info "utftrip" ~version:"v1.0.3" ~doc ~man
-         ^^^^^^^^^
- Alert deprecated: Cmdliner.Term.info
- Use Cmd.info instead.
- File "test/utftrip.ml", line 389, characters 15-24:
- 389 | let () = match Term.eval cmd with
-                      ^^^^^^^^^
- Alert deprecated: Cmdliner.Term.eval
- Use Cmd.v and one of Cmd.eval* instead.
- ocamlfind ocamlopt -c -g -bin-annot -safe-string -package unix -package cmdliner -I test -I src -o test/utftrip.cmx test/utftrip.ml
- + ocamlfind ocamlopt -c -g -bin-annot -safe-string -package unix -package cmdliner -I test -I src -o test/utftrip.cmx test/utftrip.ml
- File "test/utftrip.ml", line 385, characters 8-12:
- 385 |   Term.(pure do_cmd $ cmd $ file $ sin $ sout $ use_unix $ usize $
-               ^^^^
- Alert deprecated: Cmdliner.Term.pure
- Use Term.const instead.
- File "test/utftrip.ml", line 387, characters 2-11:
- 387 |   Term.info "utftrip" ~version:"v1.0.3" ~doc ~man
-         ^^^^^^^^^
- Alert deprecated: Cmdliner.Term.info
- Use Cmd.info instead.
- File "test/utftrip.ml", line 389, characters 15-24:
- 389 | let () = match Term.eval cmd with
-                      ^^^^^^^^^
- Alert deprecated: Cmdliner.Term.eval
- Use Cmd.v and one of Cmd.eval* instead.
- ocamlfind ocamlopt -linkpkg -g -package unix -package cmdliner -I src -I test src/uutf.cmx test/utftrip.cmx -o test/utftrip.native
- # No parallelism done
-> compiled  uutf.1.0.3
Processing 45/78: [dune: ocaml bootstrap.ml] [mtime: ocaml build]
-> installed uutf.1.0.3
Processing 46/78: [dune: ocaml bootstrap.ml] [mtime: ocaml build]
Processing 47/78: [dune: ocaml bootstrap.ml] [mtime: ocaml build] [uucp: ocaml build]
+ /home/opam/.opam/opam-init/hooks/sandbox.sh "build" "ocaml" "pkg/pkg.ml" "build" "--dev-pkg" "false" "--with-js_of_ocaml" "false" (CWD=/home/opam/.opam/5.0/.opam-switch/build/mtime.1.3.0)
- ocamlfind ocamlopt unix.cmxa -I /home/opam/.opam/5.0/lib/ocamlbuild /home/opam/.opam/5.0/lib/ocamlbuild/ocamlbuildlib.cmxa -linkpkg myocamlbuild.ml /home/opam/.opam/5.0/lib/ocamlbuild/ocamlbuild.cmx -o myocamlbuild
- ocamlfind ocamldep -modules src/mtime.ml > src/mtime.ml.depends
- ocamlfind ocamldep -modules src/mtime.mli > src/mtime.mli.depends
- ocamlfind ocamlc -c -g -bin-annot -safe-string -I src -o src/mtime.cmi src/mtime.mli
- ocamlfind ocamlopt -c -g -bin-annot -safe-string -I src -o src/mtime.cmx src/mtime.ml
- ocamlfind ocamlopt -a -I src src/mtime.cmx -o src/mtime.cmxa
- ocamlfind ocamlc -c -g -bin-annot -safe-string -I src -o src/mtime.cmo src/mtime.ml
- ocamlfind ocamlc -a -I src src/mtime.cmo -o src/mtime.cma
- ocamlfind ocamldep -package compiler-libs.toplevel -modules src/mtime_top.ml > src/mtime_top.ml.depends
- ocamlfind ocamlc -c -g -bin-annot -safe-string -package compiler-libs.toplevel -I src -o src/mtime_top.cmo src/mtime_top.ml
- ocamlfind ocamlopt -c -g -bin-annot -safe-string -package compiler-libs.toplevel -I src -o src/mtime_top.cmx src/mtime_top.ml
- ocamlfind ocamlopt -a -package compiler-libs.toplevel -I src src/mtime_top.cmx -o src/mtime_top.cmxa
- ocamlfind ocamlc -a -package compiler-libs.toplevel -I src src/mtime_top.cmo -o src/mtime_top.cma
- ocamlfind ocamlc -g -c src-os/mtime_clock_stubs.c
- mv mtime_clock_stubs.o src-os/mtime_clock_stubs.o
- ocamlfind ocamlmklib -o src-os/mtime_clock_stubs -g src-os/mtime_clock_stubs.o
- ocamlfind ocamldep -modules src-os/mtime_clock.ml > src-os/mtime_clock.ml.depends
- ocamlfind ocamldep -modules src-os/mtime_clock.mli > src-os/mtime_clock.mli.depends
- ocamlfind ocamlc -c -g -bin-annot -safe-string -I src-os -I src -o src-os/mtime_clock.cmi src-os/mtime_clock.mli
- ocamlfind ocamlopt -c -g -bin-annot -safe-string -I src-os -I src -o src-os/mtime_clock.cmx src-os/mtime_clock.ml
- ocamlfind ocamlopt -a -cclib -lmtime_clock_stubs -cclib -lrt -I src-os src-os/mtime_clock.cmx -o src-os/mtime_clock.cmxa
- ocamlfind ocamlc -c -g -bin-annot -safe-string -I src-os -I src -o src-os/mtime_clock.cmo src-os/mtime_clock.ml
- ocamlfind ocamlc -a -dllib -lmtime_clock_stubs -cclib -lrt -cclib -lmtime_clock_stubs -cclib -lrt -I src-os src-os/mtime_clock.cmo -o src-os/mtime_clock.cma
- # No parallelism done
- + ocamlfind ocamlopt unix.cmxa -I /home/opam/.opam/5.0/lib/ocamlbuild /home/opam/.opam/5.0/lib/ocamlbuild/ocamlbuildlib.cmxa -linkpkg myocamlbuild.ml /home/opam/.opam/5.0/lib/ocamlbuild/ocamlbuild.cmx -o myocamlbuild
- File "_none_", line 1:
- Alert ocaml_deprecated_auto_include: 
- OCaml's lib directory layout changed in 5.0. The unix subdirectory has been
- automatically added to the search path, but you should add -I +unix to the
- command-line to silence this alert (e.g. by adding unix to the list of
- libraries in your dune file, or adding use_unix to your _tags file for
- ocamlbuild, or using -package unix for ocamlfind).
-> compiled  mtime.1.3.0
Processing 47/78: [dune: ocaml bootstrap.ml] [uucp: ocaml build]
-> installed mtime.1.3.0
Processing 48/78: [dune: ocaml bootstrap.ml] [uucp: ocaml build]
+ /home/opam/.opam/opam-init/hooks/sandbox.sh "build" "ocaml" "bootstrap.ml" "-j" "31" (CWD=/home/opam/.opam/5.0/.opam-switch/build/dune.3.3.0)
- ocamlc -output-complete-exe -w -24 -g -o .duneboot.exe -I boot -I +unix unix.cma boot/libs.ml boot/duneboot.ml
- ./.duneboot.exe -j 31
- cd _boot && /home/opam/.opam/5.0/bin/ocamlopt.opt -c -g -no-alias-deps -w -49-6 -alert -unstable -I +unix -I +threads build_path_prefix_map.ml
- File "vendor/build_path_prefix_map/src/build_path_prefix_map.ml", line 5, characters 17-31:
- Alert deprecated: Stdlib.Printf.kprintf
- Use Printf.ksprintf instead.
- cd _boot && /home/opam/.opam/5.0/bin/ocamlopt.opt -c -g -no-alias-deps -w -49-6 -alert -unstable -I +unix -I +threads opamLexer.ml
- File "vendor/opam-file-format/src/opamLexer.mll", line 21, characters 2-16:
- Alert deprecated: Stdlib.Printf.kprintf
- Use Printf.ksprintf instead.
- 

Processing 48/78: [dune: ./dune.exe build] [uucp: ocaml build]
+ /home/opam/.opam/opam-init/hooks/sandbox.sh "build" "./dune.exe" "build" "dune.install" "--release" "--profile" "dune-bootstrap" "-j" "31" (CWD=/home/opam/.opam/5.0/.opam-switch/build/dune.3.3.0)
-> compiled  dune.3.3.0
Processing 48/78: [uucp: ocaml build]
-> installed dune.3.3.0
Processing 49/78: [uucp: ocaml build]
Processing 50/78: [csexp: dune build] [uucp: ocaml build]
Processing 51/78: [csexp: dune build] [menhirLib: dune build] [uucp: ocaml build]
Processing 52/78: [csexp: dune build] [menhirLib: dune build] [menhirSdk: dune build] [uucp: ocaml build]
Processing 53/78: [csexp: dune build] [menhirLib: dune build] [menhirSdk: dune build] [result: dune build] [uucp: ocaml build]
Processing 54/78: [csexp: dune build] [menhirLib: dune build] [menhirSdk: dune build] [result: dune build] [stdlib-shims: dune build] [uucp: ocaml build]
+ /home/opam/.opam/opam-init/hooks/sandbox.sh "build" "dune" "build" "-p" "csexp" "-j" "31" "@install" (CWD=/home/opam/.opam/5.0/.opam-switch/build/csexp.1.5.1)
-> compiled  csexp.1.5.1
Processing 54/78: [menhirLib: dune build] [menhirSdk: dune build] [result: dune build] [stdlib-shims: dune build] [uucp: ocaml build]
-> installed csexp.1.5.1
Processing 55/78: [menhirLib: dune build] [menhirSdk: dune build] [result: dune build] [stdlib-shims: dune build] [uucp: ocaml build]
Processing 56/78: [dune-configurator: rm] [menhirLib: dune build] [menhirSdk: dune build] [result: dune build] [stdlib-shims: dune build] [uucp: ocaml build]
+ /home/opam/.opam/opam-init/hooks/sandbox.sh "build" "dune" "build" "-p" "result" "-j" "31" (CWD=/home/opam/.opam/5.0/.opam-switch/build/result.1.5)
-> compiled  result.1.5
Processing 56/78: [dune-configurator: rm] [menhirLib: dune build] [menhirSdk: dune build] [stdlib-shims: dune build] [uucp: ocaml build]
-> installed result.1.5
Processing 57/78: [dune-configurator: rm] [menhirLib: dune build] [menhirSdk: dune build] [stdlib-shims: dune build] [uucp: ocaml build]
+ /home/opam/.opam/opam-init/hooks/sandbox.sh "build" "dune" "build" "-p" "stdlib-shims" "-j" "31" (CWD=/home/opam/.opam/5.0/.opam-switch/build/stdlib-shims.0.3.0)
-> compiled  stdlib-shims.0.3.0
Processing 57/78: [dune-configurator: rm] [menhirLib: dune build] [menhirSdk: dune build] [uucp: ocaml build]
-> installed stdlib-shims.0.3.0
Processing 58/78: [dune-configurator: rm] [menhirLib: dune build] [menhirSdk: dune build] [uucp: ocaml build]
Processing 59/78: [dune-configurator: rm] [menhirLib: dune build] [menhirSdk: dune build] [ocamlgraph: dune build] [uucp: ocaml build]
Processing 60/78: [dune-configurator: rm] [menhirLib: dune build] [menhirSdk: dune build] [ocamlgraph: dune build] [spelll: dune build] [uucp: ocaml build]
+ /home/opam/.opam/opam-init/hooks/sandbox.sh "build" "dune" "build" "-p" "menhirSdk" "-j" "31" (CWD=/home/opam/.opam/5.0/.opam-switch/build/menhirSdk.20220210)
-> compiled  menhirSdk.20220210
Processing 60/78: [dune-configurator: rm] [menhirLib: dune build] [ocamlgraph: dune build] [spelll: dune build] [uucp: ocaml build]
-> installed menhirSdk.20220210
Processing 61/78: [dune-configurator: rm] [menhirLib: dune build] [ocamlgraph: dune build] [spelll: dune build] [uucp: ocaml build]
+ /home/opam/.opam/opam-init/hooks/sandbox.sh "build" "rm" "-rf" "vendor/csexp" (CWD=/home/opam/.opam/5.0/.opam-switch/build/dune-configurator.3.3.0)
+ /home/opam/.opam/opam-init/hooks/sandbox.sh "build" "rm" "-rf" "vendor/pp" (CWD=/home/opam/.opam/5.0/.opam-switch/build/dune-configurator.3.3.0)
Processing 61/78: [dune-configurator: dune build] [menhirLib: dune build] [ocamlgraph: dune build] [spelll: dune build] [uucp: ocaml build]
+ /home/opam/.opam/opam-init/hooks/sandbox.sh "build" "dune" "build" "-p" "menhirLib" "-j" "31" (CWD=/home/opam/.opam/5.0/.opam-switch/build/menhirLib.20220210)
- (cd _build/default/lib/pack && ./pack.exe)
- Creating menhirLib.ml...
- Creating menhirLib.mli...
-> compiled  menhirLib.20220210
Processing 61/78: [dune-configurator: dune build] [ocamlgraph: dune build] [spelll: dune build] [uucp: ocaml build]
-> installed menhirLib.20220210
Processing 62/78: [dune-configurator: dune build] [ocamlgraph: dune build] [spelll: dune build] [uucp: ocaml build]
Processing 63/78: [dune-configurator: dune build] [menhir: dune build] [ocamlgraph: dune build] [spelll: dune build] [uucp: ocaml build]
+ /home/opam/.opam/opam-init/hooks/sandbox.sh "build" "dune" "build" "@install" "-p" "spelll" "-j" "31" (CWD=/home/opam/.opam/5.0/.opam-switch/build/spelll.0.4)
-> compiled  spelll.0.4
Processing 63/78: [dune-configurator: dune build] [menhir: dune build] [ocamlgraph: dune build] [uucp: ocaml build]
-> installed spelll.0.4
Processing 64/78: [dune-configurator: dune build] [menhir: dune build] [ocamlgraph: dune build] [uucp: ocaml build]
+ /home/opam/.opam/opam-init/hooks/sandbox.sh "build" "dune" "build" "-p" "dune-configurator" "-j" "31" "@install" (CWD=/home/opam/.opam/5.0/.opam-switch/build/dune-configurator.3.3.0)
-> compiled  dune-configurator.3.3.0
Processing 64/78: [menhir: dune build] [ocamlgraph: dune build] [uucp: ocaml build]
-> installed dune-configurator.3.3.0
Processing 65/78: [menhir: dune build] [ocamlgraph: dune build] [uucp: ocaml build]
Processing 66/78: [containers: dune build] [menhir: dune build] [ocamlgraph: dune build] [uucp: ocaml build]
Processing 67/78: [containers: dune build] [gen: dune build] [menhir: dune build] [ocamlgraph: dune build] [uucp: ocaml build]
Processing 68/78: [containers: dune build] [gen: dune build] [iter: dune build] [menhir: dune build] [ocamlgraph: dune build] [uucp: ocaml build]
[ERROR] The compilation of iter.1.4 failed at "dune build @install -p iter -j 31".
+ /home/opam/.opam/opam-init/hooks/sandbox.sh "build" "dune" "build" "@install" "-p" "iter" "-j" "31" (CWD=/home/opam/.opam/5.0/.opam-switch/build/iter.1.4)
- (cd _build/default && /home/opam/.opam/5.0/bin/ocamlc.opt -w -40 -warn-error -a+8 -safe-string -strict-sequence -nolabels -g -bin-annot -I src/.iter.objs/byte -I /home/opam/.opam/5.0/lib/result -no-alias-deps -o src/.iter.objs/byte/iterLabels.cmi -c -intf src/IterLabels.mli)
- File "src/IterLabels.mli", line 534, characters 19-27:
- 534 | val of_stream : 'a Stream.t -> 'a t
-                          ^^^^^^^^
- Error: Unbound module Stream
- (cd _build/default && /home/opam/.opam/5.0/bin/ocamlc.opt -w -40 -warn-error -a+8 -safe-string -strict-sequence -nolabels -g -bin-annot -I src/.iter.objs/byte -I /home/opam/.opam/5.0/lib/result -no-alias-deps -o src/.iter.objs/byte/iter.cmi -c -intf src/Iter.mli)
- File "src/Iter.mli", line 570, characters 19-27:
- 570 | val of_stream : 'a Stream.t -> 'a t
-                          ^^^^^^^^
- Error: Unbound module Stream
Processing 68/78: [containers: dune build] [gen: dune build] [menhir: dune build] [ocamlgraph: dune build] [uucp: ocaml build]
Processing 69/78: [containers: dune build] [gen: dune build] [menhir: dune build] [ocamlgraph: dune build] [uucp: ocaml build]
+ /home/opam/.opam/opam-init/hooks/sandbox.sh "build" "dune" "build" "-p" "ocamlgraph" "-j" "31" "@install" (CWD=/home/opam/.opam/5.0/.opam-switch/build/ocamlgraph.2.0.0)
-> compiled  ocamlgraph.2.0.0
Processing 69/78: [containers: dune build] [gen: dune build] [menhir: dune build] [uucp: ocaml build]
-> installed ocamlgraph.2.0.0
Processing 70/78: [containers: dune build] [gen: dune build] [menhir: dune build] [uucp: ocaml build]
+ /home/opam/.opam/opam-init/hooks/sandbox.sh "build" "dune" "build" "@install" "-p" "gen" "-j" "31" (CWD=/home/opam/.opam/5.0/.opam-switch/build/gen.1.0)
-> compiled  gen.1.0
Processing 70/78: [containers: dune build] [menhir: dune build] [uucp: ocaml build]
-> installed gen.1.0
Processing 71/78: [containers: dune build] [menhir: dune build] [uucp: ocaml build]
[ERROR] The compilation of containers.2.8.1 failed at "dune build -p containers -j 31".
+ /home/opam/.opam/opam-init/hooks/sandbox.sh "build" "dune" "build" "-p" "containers" "-j" "31" (CWD=/home/opam/.opam/5.0/.opam-switch/build/containers.2.8.1)
- (cd _build/default && /home/opam/.opam/5.0/bin/ocamlc.opt -w -40 -warn-error -3 -w +a-4-42-44-48-50-58-32-60@8 -safe-string -g -bin-annot -I src/monomorphic/.containers_monomorphic.objs/byte -no-alias-deps -o src/monomorphic/.containers_monomorphic.objs/byte/cCMonomorphicShims_.cmo -c -impl src/monomorphic/CCMonomorphicShims_.ml)
- File "src/monomorphic/CCMonomorphicShims_.ml", line 1:
- Warning 70 [missing-mli]: Cannot find interface file.
- (cd _build/default && /home/opam/.opam/5.0/bin/ocamlc.opt -w -40 -warn-error -3 -w +a-4-42-44-48-50-58-32-60@8 -safe-string -nolabels -open CCMonomorphic -g -bin-annot -I src/core/.containers.objs/byte -I /home/opam/.opam/5.0/lib/seq -I src/monomorphic/.containers_monomorphic.objs/byte -no-alias-deps -o src/core/.containers.objs/byte/cCShimsArrayLabels_.cmo -c -impl src/core/CCShimsArrayLabels_.ml)
- File "src/core/CCShimsArrayLabels_.ml", line 1:
- Warning 70 [missing-mli]: Cannot find interface file.
- (cd _build/default && /home/opam/.opam/5.0/bin/ocamlc.opt -w -40 -warn-error -3 -w +a-4-42-44-48-50-58-32-60@8 -safe-string -nolabels -open CCMonomorphic -g -bin-annot -I src/core/.containers.objs/byte -I /home/opam/.opam/5.0/lib/seq -I src/monomorphic/.containers_monomorphic.objs/byte -no-alias-deps -o src/core/.containers.objs/byte/cCShimsArray_.cmo -c -impl src/core/CCShimsArray_.ml)
- File "src/core/CCShimsArray_.ml", line 1:
- Warning 70 [missing-mli]: Cannot find interface file.
- (cd _build/default && /home/opam/.opam/5.0/bin/ocamlc.opt -w -40 -warn-error -3 -w +a-4-42-44-48-50-58-32-60@8 -safe-string -nolabels -open CCMonomorphic -g -bin-annot -I src/core/.containers.objs/byte -I /home/opam/.opam/5.0/lib/seq -I src/monomorphic/.containers_monomorphic.objs/byte -no-alias-deps -o src/core/.containers.objs/byte/cCShimsFormat_.cmo -c -impl src/core/CCShimsFormat_.ml)
- File "src/core/CCShimsFormat_.ml", line 6, characters 18-29:
- 6 | let pp_open_tag = pp_open_tag
-                       ^^^^^^^^^^^
- Error: Unbound value pp_open_tag
- Hint: Did you mean pp_open_stag?
- (cd _build/default && /home/opam/.opam/5.0/bin/ocamlc.opt -w -40 -warn-error -3 -w +a-4-42-44-48-50-58-32-60@8 -safe-string -nolabels -open CCMonomorphic -g -bin-annot -I src/core/.containers.objs/byte -I /home/opam/.opam/5.0/lib/seq -I src/monomorphic/.containers_monomorphic.objs/byte -no-alias-deps -o src/core/.containers.objs/byte/cCShims_.cmo -c -impl src/core/CCShims_.ml)
- File "src/core/CCShims_.ml", line 1:
- Warning 70 [missing-mli]: Cannot find interface file.
- (cd _build/default && /home/opam/.opam/5.0/bin/ocamlc.opt -w -40 -warn-error -3 -w +a-4-42-44-48-50-58-32-60@8 -safe-string -nolabels -open CCMonomorphic -g -bin-annot -I src/core/.containers.objs/byte -I /home/opam/.opam/5.0/lib/seq -I src/monomorphic/.containers_monomorphic.objs/byte -no-alias-deps -o src/core/.containers.objs/byte/cCShimsList_.cmo -c -impl src/core/CCShimsList_.ml)
- File "src/core/CCShimsList_.ml", line 1:
- Warning 70 [missing-mli]: Cannot find interface file.
- (cd _build/default && /home/opam/.opam/5.0/bin/ocamlc.opt -w -40 -warn-error -3 -w +a-4-42-44-48-50-58-32-60@8 -safe-string -nolabels -open CCMonomorphic -g -bin-annot -I src/core/.containers.objs/byte -I /home/opam/.opam/5.0/lib/seq -I src/monomorphic/.containers_monomorphic.objs/byte -no-alias-deps -o src/core/.containers.objs/byte/cCShimsMkLet_.cmo -c -impl src/core/CCShimsMkLet_.ml)
- File "src/core/CCShimsMkLet_.ml", line 1:
- Warning 70 [missing-mli]: Cannot find interface file.
- (cd _build/default && /home/opam/.opam/5.0/bin/ocamlc.opt -w -40 -warn-error -3 -w +a-4-42-44-48-50-58-32-60@8 -safe-string -nolabels -open CCMonomorphic -g -bin-annot -I src/core/.containers.objs/byte -I /home/opam/.opam/5.0/lib/seq -I src/monomorphic/.containers_monomorphic.objs/byte -intf-suffix .ml -no-alias-deps -o src/core/.containers.objs/byte/cCArray.cmo -c -impl src/core/CCArray.ml)
- File "src/core/CCArray.ml", line 1:
- Error: The implementation src/core/CCArray.ml
-        does not match the interface src/core/.containers.objs/byte/cCArray.cmi:
-         The value `make_float' is required but not provided
-        File "src/core/CCArray.mli", line 24, characters 0-65:
-          Expected declaration
- (cd _build/default && /home/opam/.opam/5.0/bin/ocamlc.opt -w -40 -warn-error -3 -w +a-4-42-44-48-50-58-32-60@8 -safe-string -nolabels -open CCMonomorphic -g -bin-annot -I src/core/.containers.objs/byte -I /home/opam/.opam/5.0/lib/seq -I src/monomorphic/.containers_monomorphic.objs/byte -no-alias-deps -o src/core/.containers.objs/byte/containers.cmo -c -impl src/core/containers.ml)
- File "src/core/containers.ml", line 1:
- Warning 70 [missing-mli]: Cannot find interface file.
- (cd _build/default && /home/opam/.opam/5.0/bin/ocamlc.opt -w -40 -warn-error -3 -w +a-4-42-44-48-50-58-32-60@8 -safe-string -nolabels -open CCMonomorphic -g -bin-annot -I src/core/.containers.objs/byte -I /home/opam/.opam/5.0/lib/seq -I src/monomorphic/.containers_monomorphic.objs/byte -no-alias-deps -o src/core/.containers.objs/byte/containersLabels.cmo -c -impl src/core/containersLabels.ml)
- File "src/core/containersLabels.ml", line 1:
- Warning 70 [missing-mli]: Cannot find interface file.
- (cd _build/default && /home/opam/.opam/5.0/bin/ocamlopt.opt -w -40 -warn-error -3 -w +a-4-42-44-48-50-58-32-60@8 -safe-string -nolabels -open CCMonomorphic -O3 -unbox-closures -unbox-closures-factor 20 -color always -I src/core/.containers.objs/byte -I src/core/.containers.objs/native -I /home/opam/.opam/5.0/lib/seq -I src/monomorphic/.containers_monomorphic.objs/byte -I src/monomorphic/.containers_monomorphic.objs/native -intf-suffix .ml -no-alias-deps -o src/core/.containers.objs/native/cCArray.cmx -c -impl src/core/CCArray.ml)
- File "src/core/CCArray.ml", line 1:
- Error: The implementation src/core/CCArray.ml
-        does not match the interface src/core/.containers.objs/byte/cCArray.cmi:
-         The value `make_float' is required but not provided
-        File "src/core/CCArray.mli", line 24, characters 0-65:
-          Expected declaration
Processing 71/78: [menhir: dune build] [uucp: ocaml build]
Processing 72/78: [menhir: dune build] [uucp: ocaml build]
+ /home/opam/.opam/opam-init/hooks/sandbox.sh "build" "ocaml" "pkg/pkg.ml" "build" "--dev-pkg" "false" "--with-uutf" "true" "--with-uunf" "false" "--with-cmdliner" "true" (CWD=/home/opam/.opam/5.0/.opam-switch/build/uucp.14.0.0)
- ocamlfind ocamldep -modules src/uucp.ml > src/uucp.ml.depends
- ocamlfind ocamldep -modules src/uucp.mli > src/uucp.mli.depends
- ocamlfind ocamlc -c -g -bin-annot -safe-string -I src -I test -o src/uucp.cmi src/uucp.mli
- ocamlfind ocamldep -modules src/uucp_age.ml > src/uucp_age.ml.depends
- ocamlfind ocamldep -modules src/uucp_age_data.ml > src/uucp_age_data.ml.depends
- ocamlfind ocamldep -modules src/uucp_rmap.ml > src/uucp_rmap.ml.depends
- ocamlfind ocamldep -modules src/uucp_fmt.ml > src/uucp_fmt.ml.depends
- ocamlfind ocamlc -c -g -bin-annot -safe-string -I src -I test -o src/uucp_fmt.cmo src/uucp_fmt.ml
- ocamlfind ocamlc -c -g -bin-annot -safe-string -I src -I test -o src/uucp_rmap.cmo src/uucp_rmap.ml
- ocamlfind ocamlc -c -g -bin-annot -safe-string -I src -I test -o src/uucp_age_data.cmo src/uucp_age_data.ml
- ocamlfind ocamlc -c -g -bin-annot -safe-string -I src -I test -o src/uucp_age.cmo src/uucp_age.ml
- ocamlfind ocamlopt -c -g -bin-annot -safe-string -I src -I test -o src/uucp_fmt.cmx src/uucp_fmt.ml
- ocamlfind ocamlopt -c -g -bin-annot -safe-string -I src -I test -o src/uucp_rmap.cmx src/uucp_rmap.ml
- ocamlfind ocamlopt -c -g -bin-annot -safe-string -I src -I test -o src/uucp_age_data.cmx src/uucp_age_data.ml
- ocamlfind ocamldep -modules src/uucp_alpha.ml > src/uucp_alpha.ml.depends
- ocamlfind ocamldep -modules src/uucp_alpha_data.ml > src/uucp_alpha_data.ml.depends
- ocamlfind ocamldep -modules src/uucp_tmapbool.ml > src/uucp_tmapbool.ml.depends
- ocamlfind ocamlc -c -g -bin-annot -safe-string -I src -I test -o src/uucp_tmapbool.cmo src/uucp_tmapbool.ml
- ocamlfind ocamlc -c -g -bin-annot -safe-string -I src -I test -o src/uucp_alpha_data.cmo src/uucp_alpha_data.ml
- ocamlfind ocamlc -c -g -bin-annot -safe-string -I src -I test -o src/uucp_alpha.cmo src/uucp_alpha.ml
- ocamlfind ocamlopt -c -g -bin-annot -safe-string -I src -I test -o src/uucp_tmapbool.cmx src/uucp_tmapbool.ml
- ocamlfind ocamlopt -c -g -bin-annot -safe-string -I src -I test -o src/uucp_alpha_data.cmx src/uucp_alpha_data.ml
- ocamlfind ocamldep -modules src/uucp_block.ml > src/uucp_block.ml.depends
- ocamlfind ocamldep -modules src/uucp_block_base.ml > src/uucp_block_base.ml.depends
- ocamlfind ocamldep -modules src/uucp_block_data.ml > src/uucp_block_data.ml.depends
- ocamlfind ocamlc -c -g -bin-annot -safe-string -I src -I test -o src/uucp_block_base.cmo src/uucp_block_base.ml
- ocamlfind ocamlc -c -g -bin-annot -safe-string -I src -I test -o src/uucp_block_data.cmo src/uucp_block_data.ml
- ocamlfind ocamlc -c -g -bin-annot -safe-string -I src -I test -o src/uucp_block.cmo src/uucp_block.ml
- ocamlfind ocamlopt -c -g -bin-annot -safe-string -I src -I test -o src/uucp_block_base.cmx src/uucp_block_base.ml
- ocamlfind ocamlopt -c -g -bin-annot -safe-string -I src -I test -o src/uucp_block_data.cmx src/uucp_block_data.ml
- ocamlfind ocamldep -modules src/uucp_break.ml > src/uucp_break.ml.depends
- ocamlfind ocamldep -modules src/uucp_break_base.ml > src/uucp_break_base.ml.depends
- ocamlfind ocamldep -modules src/uucp_break_data.ml > src/uucp_break_data.ml.depends
- ocamlfind ocamlc -c -g -bin-annot -safe-string -I src -I test -o src/uucp_break_base.cmo src/uucp_break_base.ml
- ocamlfind ocamldep -modules src/uucp_tmapbyte.ml > src/uucp_tmapbyte.ml.depends
- ocamlfind ocamlc -c -g -bin-annot -safe-string -I src -I test -o src/uucp_tmapbyte.cmo src/uucp_tmapbyte.ml
- ocamlfind ocamldep -modules src/uucp_gc.ml > src/uucp_gc.ml.depends
- ocamlfind ocamldep -modules src/uucp_gc_base.ml > src/uucp_gc_base.ml.depends
- ocamlfind ocamldep -modules src/uucp_gc_data.ml > src/uucp_gc_data.ml.depends
- ocamlfind ocamlc -c -g -bin-annot -safe-string -I src -I test -o src/uucp_gc_base.cmo src/uucp_gc_base.ml
- ocamlfind ocamlc -c -g -bin-annot -safe-string -I src -I test -o src/uucp_gc_data.cmo src/uucp_gc_data.ml
- ocamlfind ocamlc -c -g -bin-annot -safe-string -I src -I test -o src/uucp_break_data.cmo src/uucp_break_data.ml
- ocamlfind ocamlc -c -g -bin-annot -safe-string -I src -I test -o src/uucp_gc.cmo src/uucp_gc.ml
- ocamlfind ocamlc -c -g -bin-annot -safe-string -I src -I test -o src/uucp_break.cmo src/uucp_break.ml
- ocamlfind ocamlopt -c -g -bin-annot -safe-string -I src -I test -o src/uucp_break_base.cmx src/uucp_break_base.ml
- ocamlfind ocamlopt -c -g -bin-annot -safe-string -I src -I test -o src/uucp_tmapbyte.cmx src/uucp_tmapbyte.ml
- ocamlfind ocamlopt -c -g -bin-annot -safe-string -I src -I test -o src/uucp_gc_base.cmx src/uucp_gc_base.ml
- ocamlfind ocamlopt -c -g -bin-annot -safe-string -I src -I test -o src/uucp_gc_data.cmx src/uucp_gc_data.ml
- ocamlfind ocamlopt -c -g -bin-annot -safe-string -I src -I test -o src/uucp_break_data.cmx src/uucp_break_data.ml
- ocamlfind ocamlopt -c -g -bin-annot -safe-string -I src -I test -o src/uucp_gc.cmx src/uucp_gc.ml
- ocamlfind ocamldep -modules src/uucp_case.ml > src/uucp_case.ml.depends
- ocamlfind ocamldep -modules src/uucp_case_data.ml > src/uucp_case_data.ml.depends
- ocamlfind ocamldep -modules src/uucp_case_fold.ml > src/uucp_case_fold.ml.depends
- ocamlfind ocamldep -modules src/uucp_case_fold_data.ml > src/uucp_case_fold_data.ml.depends
- ocamlfind ocamldep -modules src/uucp_tmap.ml > src/uucp_tmap.ml.depends
- ocamlfind ocamlc -c -g -bin-annot -safe-string -I src -I test -o src/uucp_tmap.cmo src/uucp_tmap.ml
- ocamlfind ocamlc -c -g -bin-annot -safe-string -I src -I test -o src/uucp_case_fold_data.cmo src/uucp_case_fold_data.ml
- ocamlfind ocamldep -modules src/uucp_case_map.ml > src/uucp_case_map.ml.depends
- ocamlfind ocamldep -modules src/uucp_case_map_data.ml > src/uucp_case_map_data.ml.depends
- ocamlfind ocamlc -c -g -bin-annot -safe-string -I src -I test -o src/uucp_case_map_data.cmo src/uucp_case_map_data.ml
- ocamlfind ocamldep -modules src/uucp_case_nfkc.ml > src/uucp_case_nfkc.ml.depends
- ocamlfind ocamldep -modules src/uucp_case_nfkc_data.ml > src/uucp_case_nfkc_data.ml.depends
- ocamlfind ocamlc -c -g -bin-annot -safe-string -I src -I test -o src/uucp_case_nfkc_data.cmo src/uucp_case_nfkc_data.ml
- ocamlfind ocamlc -c -g -bin-annot -safe-string -I src -I test -o src/uucp_case_data.cmo src/uucp_case_data.ml
- ocamlfind ocamlc -c -g -bin-annot -safe-string -I src -I test -o src/uucp_case_fold.cmo src/uucp_case_fold.ml
- ocamlfind ocamlc -c -g -bin-annot -safe-string -I src -I test -o src/uucp_case_map.cmo src/uucp_case_map.ml
- ocamlfind ocamlc -c -g -bin-annot -safe-string -I src -I test -o src/uucp_case_nfkc.cmo src/uucp_case_nfkc.ml
- ocamlfind ocamlc -c -g -bin-annot -safe-string -I src -I test -o src/uucp_case.cmo src/uucp_case.ml
- ocamlfind ocamlopt -c -g -bin-annot -safe-string -I src -I test -o src/uucp_tmap.cmx src/uucp_tmap.ml
- ocamlfind ocamlopt -c -g -bin-annot -safe-string -I src -I test -o src/uucp_case_fold_data.cmx src/uucp_case_fold_data.ml
- ocamlfind ocamlopt -c -g -bin-annot -safe-string -I src -I test -o src/uucp_case_map_data.cmx src/uucp_case_map_data.ml
- ocamlfind ocamlopt -c -g -bin-annot -safe-string -I src -I test -o src/uucp_case_nfkc_data.cmx src/uucp_case_nfkc_data.ml
- ocamlfind ocamlopt -c -g -bin-annot -safe-string -I src -I test -o src/uucp_case_data.cmx src/uucp_case_data.ml
- ocamlfind ocamlopt -c -g -bin-annot -safe-string -I src -I test -o src/uucp_case_fold.cmx src/uucp_case_fold.ml
- ocamlfind ocamlopt -c -g -bin-annot -safe-string -I src -I test -o src/uucp_case_map.cmx src/uucp_case_map.ml
- ocamlfind ocamlopt -c -g -bin-annot -safe-string -I src -I test -o src/uucp_case_nfkc.cmx src/uucp_case_nfkc.ml
- ocamlfind ocamldep -modules src/uucp_cjk.ml > src/uucp_cjk.ml.depends
- ocamlfind ocamldep -modules src/uucp_cjk_data.ml > src/uucp_cjk_data.ml.depends
- ocamlfind ocamlc -c -g -bin-annot -safe-string -I src -I test -o src/uucp_cjk_data.cmo src/uucp_cjk_data.ml
- ocamlfind ocamlc -c -g -bin-annot -safe-string -I src -I test -o src/uucp_cjk.cmo src/uucp_cjk.ml
- ocamlfind ocamlopt -c -g -bin-annot -safe-string -I src -I test -o src/uucp_cjk_data.cmx src/uucp_cjk_data.ml
- ocamlfind ocamldep -modules src/uucp_cmap.ml > src/uucp_cmap.ml.depends
- ocamlfind ocamlc -c -g -bin-annot -safe-string -I src -I test -o src/uucp_cmap.cmo src/uucp_cmap.ml
- ocamlfind ocamldep -modules src/uucp_emoji.ml > src/uucp_emoji.ml.depends
- ocamlfind ocamldep -modules src/uucp_emoji_data.ml > src/uucp_emoji_data.ml.depends
- ocamlfind ocamlc -c -g -bin-annot -safe-string -I src -I test -o src/uucp_emoji_data.cmo src/uucp_emoji_data.ml
- ocamlfind ocamlc -c -g -bin-annot -safe-string -I src -I test -o src/uucp_emoji.cmo src/uucp_emoji.ml
- ocamlfind ocamlopt -c -g -bin-annot -safe-string -I src -I test -o src/uucp_emoji_data.cmx src/uucp_emoji_data.ml
- ocamlfind ocamldep -modules src/uucp_func.ml > src/uucp_func.ml.depends
- ocamlfind ocamldep -modules src/uucp_func_data.ml > src/uucp_func_data.ml.depends
- ocamlfind ocamlc -c -g -bin-annot -safe-string -I src -I test -o src/uucp_func_data.cmo src/uucp_func_data.ml
- ocamlfind ocamlc -c -g -bin-annot -safe-string -I src -I test -o src/uucp_func.cmo src/uucp_func.ml
- ocamlfind ocamlopt -c -g -bin-annot -safe-string -I src -I test -o src/uucp_func_data.cmx src/uucp_func_data.ml
- ocamlfind ocamldep -modules src/uucp_gen.ml > src/uucp_gen.ml.depends
- ocamlfind ocamldep -modules src/uucp_gen_data.ml > src/uucp_gen_data.ml.depends
- ocamlfind ocamlc -c -g -bin-annot -safe-string -I src -I test -o src/uucp_gen_data.cmo src/uucp_gen_data.ml
- ocamlfind ocamlc -c -g -bin-annot -safe-string -I src -I test -o src/uucp_gen.cmo src/uucp_gen.ml
- ocamlfind ocamlopt -c -g -bin-annot -safe-string -I src -I test -o src/uucp_gen_data.cmx src/uucp_gen_data.ml
- ocamlfind ocamldep -modules src/uucp_hangul.ml > src/uucp_hangul.ml.depends
- ocamlfind ocamldep -modules src/uucp_hangul_base.ml > src/uucp_hangul_base.ml.depends
- ocamlfind ocamldep -modules src/uucp_hangul_data.ml > src/uucp_hangul_data.ml.depends
- ocamlfind ocamlc -c -g -bin-annot -safe-string -I src -I test -o src/uucp_hangul_base.cmo src/uucp_hangul_base.ml
- ocamlfind ocamlc -c -g -bin-annot -safe-string -I src -I test -o src/uucp_hangul_data.cmo src/uucp_hangul_data.ml
- ocamlfind ocamlc -c -g -bin-annot -safe-string -I src -I test -o src/uucp_hangul.cmo src/uucp_hangul.ml
- ocamlfind ocamlopt -c -g -bin-annot -safe-string -I src -I test -o src/uucp_hangul_base.cmx src/uucp_hangul_base.ml
- ocamlfind ocamlopt -c -g -bin-annot -safe-string -I src -I test -o src/uucp_hangul_data.cmx src/uucp_hangul_data.ml
- ocamlfind ocamldep -modules src/uucp_id.ml > src/uucp_id.ml.depends
- ocamlfind ocamldep -modules src/uucp_id_data.ml > src/uucp_id_data.ml.depends
- ocamlfind ocamlc -c -g -bin-annot -safe-string -I src -I test -o src/uucp_id_data.cmo src/uucp_id_data.ml
- ocamlfind ocamlc -c -g -bin-annot -safe-string -I src -I test -o src/uucp_id.cmo src/uucp_id.ml
- ocamlfind ocamlopt -c -g -bin-annot -safe-string -I src -I test -o src/uucp_id_data.cmx src/uucp_id_data.ml
- ocamlfind ocamldep -modules src/uucp_name.ml > src/uucp_name.ml.depends
- ocamlfind ocamldep -modules src/uucp_name_base.ml > src/uucp_name_base.ml.depends
- ocamlfind ocamldep -modules src/uucp_name_data.ml > src/uucp_name_data.ml.depends
- ocamlfind ocamlc -c -g -bin-annot -safe-string -I src -I test -o src/uucp_name_base.cmo src/uucp_name_base.ml
- ocamlfind ocamldep -modules src/uucp_tmap5bytes.ml > src/uucp_tmap5bytes.ml.depends
- ocamlfind ocamlc -c -g -bin-annot -safe-string -I src -I test -o src/uucp_tmap5bytes.cmo src/uucp_tmap5bytes.ml
- ocamlfind ocamlc -c -g -bin-annot -safe-string -I src -I test -o src/uucp_name_data.cmo src/uucp_name_data.ml
- ocamlfind ocamlc -c -g -bin-annot -safe-string -I src -I test -o src/uucp_name.cmo src/uucp_name.ml
- ocamlfind ocamlopt -c -g -bin-annot -safe-string -I src -I test -o src/uucp_cmap.cmx src/uucp_cmap.ml
- ocamlfind ocamlopt -c -g -bin-annot -safe-string -I src -I test -o src/uucp_name_base.cmx src/uucp_name_base.ml
- ocamlfind ocamlopt -c -g -bin-annot -safe-string -I src -I test -o src/uucp_tmap5bytes.cmx src/uucp_tmap5bytes.ml
- ocamlfind ocamlopt -c -g -bin-annot -safe-string -I src -I test -o src/uucp_name_data.cmx src/uucp_name_data.ml
- ocamlfind ocamldep -modules src/uucp_num.ml > src/uucp_num.ml.depends
- ocamlfind ocamldep -modules src/uucp_num_base.ml > src/uucp_num_base.ml.depends
- ocamlfind ocamldep -modules src/uucp_num_data.ml > src/uucp_num_data.ml.depends
- ocamlfind ocamlc -c -g -bin-annot -safe-string -I src -I test -o src/uucp_num_base.cmo src/uucp_num_base.ml
- ocamlfind ocamlc -c -g -bin-annot -safe-string -I src -I test -o src/uucp_num_data.cmo src/uucp_num_data.ml
- ocamlfind ocamlc -c -g -bin-annot -safe-string -I src -I test -o src/uucp_num.cmo src/uucp_num.ml
- ocamlfind ocamlopt -c -g -bin-annot -safe-string -I src -I test -o src/uucp_num_base.cmx src/uucp_num_base.ml
- ocamlfind ocamlopt -c -g -bin-annot -safe-string -I src -I test -o src/uucp_num_data.cmx src/uucp_num_data.ml
- ocamlfind ocamldep -modules src/uucp_script.ml > src/uucp_script.ml.depends
- ocamlfind ocamldep -modules src/uucp_script_base.ml > src/uucp_script_base.ml.depends
- ocamlfind ocamldep -modules src/uucp_script_data.ml > src/uucp_script_data.ml.depends
- ocamlfind ocamlc -c -g -bin-annot -safe-string -I src -I test -o src/uucp_script_base.cmo src/uucp_script_base.ml
- ocamlfind ocamlc -c -g -bin-annot -safe-string -I src -I test -o src/uucp_script_data.cmo src/uucp_script_data.ml
- ocamlfind ocamlc -c -g -bin-annot -safe-string -I src -I test -o src/uucp_script.cmo src/uucp_script.ml
- ocamlfind ocamlopt -c -g -bin-annot -safe-string -I src -I test -o src/uucp_script_base.cmx src/uucp_script_base.ml
- ocamlfind ocamlopt -c -g -bin-annot -safe-string -I src -I test -o src/uucp_script_data.cmx src/uucp_script_data.ml
- ocamlfind ocamldep -modules src/uucp_white.ml > src/uucp_white.ml.depends
- ocamlfind ocamldep -modules src/uucp_white_data.ml > src/uucp_white_data.ml.depends
- ocamlfind ocamlc -c -g -bin-annot -safe-string -I src -I test -o src/uucp_white_data.cmo src/uucp_white_data.ml
- ocamlfind ocamlc -c -g -bin-annot -safe-string -I src -I test -o src/uucp_white.cmo src/uucp_white.ml
- ocamlfind ocamlopt -c -g -bin-annot -safe-string -I src -I test -o src/uucp_white_data.cmx src/uucp_white_data.ml
- ocamlfind ocamlopt -c -g -bin-annot -safe-string -I src -I test -o src/uucp_age.cmx src/uucp_age.ml
- ocamlfind ocamlopt -c -g -bin-annot -safe-string -I src -I test -o src/uucp_alpha.cmx src/uucp_alpha.ml
- ocamlfind ocamlopt -c -g -bin-annot -safe-string -I src -I test -o src/uucp_block.cmx src/uucp_block.ml
- ocamlfind ocamlopt -c -g -bin-annot -safe-string -I src -I test -o src/uucp_break.cmx src/uucp_break.ml
- ocamlfind ocamlopt -c -g -bin-annot -safe-string -I src -I test -o src/uucp_case.cmx src/uucp_case.ml
- ocamlfind ocamlopt -c -g -bin-annot -safe-string -I src -I test -o src/uucp_cjk.cmx src/uucp_cjk.ml
- ocamlfind ocamlopt -c -g -bin-annot -safe-string -I src -I test -o src/uucp_emoji.cmx src/uucp_emoji.ml
- ocamlfind ocamlopt -c -g -bin-annot -safe-string -I src -I test -o src/uucp_func.cmx src/uucp_func.ml
- ocamlfind ocamlopt -c -g -bin-annot -safe-string -I src -I test -o src/uucp_gen.cmx src/uucp_gen.ml
- ocamlfind ocamlopt -c -g -bin-annot -safe-string -I src -I test -o src/uucp_hangul.cmx src/uucp_hangul.ml
- ocamlfind ocamlopt -c -g -bin-annot -safe-string -I src -I test -o src/uucp_id.cmx src/uucp_id.ml
- ocamlfind ocamlopt -c -g -bin-annot -safe-string -I src -I test -o src/uucp_name.cmx src/uucp_name.ml
- ocamlfind ocamlopt -c -g -bin-annot -safe-string -I src -I test -o src/uucp_num.cmx src/uucp_num.ml
- ocamlfind ocamlopt -c -g -bin-annot -safe-string -I src -I test -o src/uucp_script.cmx src/uucp_script.ml
- ocamlfind ocamlopt -c -g -bin-annot -safe-string -I src -I test -o src/uucp_white.cmx src/uucp_white.ml
- ocamlfind ocamlopt -c -g -bin-annot -safe-string -I src -I test -o src/uucp.cmx src/uucp.ml
- ocamlfind ocamlopt -a -I src src/uucp_fmt.cmx src/uucp_rmap.cmx src/uucp_age_data.cmx src/uucp_age.cmx src/uucp_tmapbool.cmx src/uucp_alpha_data.cmx src/uucp_alpha.cmx src/uucp_block_base.cmx src/uucp_block_data.cmx src/uucp_block.cmx src/uucp_break_base.cmx src/uucp_tmapbyte.cmx src/uucp_break_data.cmx src/uucp_gc_base.cmx src/uucp_gc_data.cmx src/uucp_gc.cmx src/uucp_break.cmx src/uucp_case_data.cmx src/uucp_tmap.cmx src/uucp_case_fold_data.cmx src/uucp_case_fold.cmx src/uucp_case_map_data.cmx src/uucp_case_map.cmx src/uucp_case_nfkc_data.cmx src/uucp_case_nfkc.cmx src/uucp_case.cmx src/uucp_cjk_data.cmx src/uucp_cjk.cmx src/uucp_cmap.cmx src/uucp_emoji_data.cmx src/uucp_emoji.cmx src/uucp_func_data.cmx src/uucp_func.cmx src/uucp_gen_data.cmx src/uucp_gen.cmx src/uucp_hangul_base.cmx src/uucp_hangul_data.cmx src/uucp_hangul.cmx src/uucp_id_data.cmx src/uucp_id.cmx src/uucp_name_base.cmx src/uucp_tmap5bytes.cmx src/uucp_name_data.cmx src/uucp_name.cmx src/uucp_num_base.cmx src/uucp_num_data.cmx src/uucp_num.cmx src/uucp_script_base.cmx src/uucp_script_data.cmx src/uucp_script.cmx src/uucp_white_data.cmx src/uucp_white.cmx src/uucp.cmx -o src/uucp.cmxa
- ocamlfind ocamlc -c -g -bin-annot -safe-string -I src -I test -o src/uucp.cmo src/uucp.ml
- ocamlfind ocamlc -a -I src src/uucp_fmt.cmo src/uucp_rmap.cmo src/uucp_age_data.cmo src/uucp_age.cmo src/uucp_tmapbool.cmo src/uucp_alpha_data.cmo src/uucp_alpha.cmo src/uucp_block_base.cmo src/uucp_block_data.cmo src/uucp_block.cmo src/uucp_break_base.cmo src/uucp_tmapbyte.cmo src/uucp_break_data.cmo src/uucp_gc_base.cmo src/uucp_gc_data.cmo src/uucp_gc.cmo src/uucp_break.cmo src/uucp_case_data.cmo src/uucp_tmap.cmo src/uucp_case_fold_data.cmo src/uucp_case_fold.cmo src/uucp_case_map_data.cmo src/uucp_case_map.cmo src/uucp_case_nfkc_data.cmo src/uucp_case_nfkc.cmo src/uucp_case.cmo src/uucp_cjk_data.cmo src/uucp_cjk.cmo src/uucp_cmap.cmo src/uucp_emoji_data.cmo src/uucp_emoji.cmo src/uucp_func_data.cmo src/uucp_func.cmo src/uucp_gen_data.cmo src/uucp_gen.cmo src/uucp_hangul_base.cmo src/uucp_hangul_data.cmo src/uucp_hangul.cmo src/uucp_id_data.cmo src/uucp_id.cmo src/uucp_name_base.cmo src/uucp_tmap5bytes.cmo src/uucp_name_data.cmo src/uucp_name.cmo src/uucp_num_base.cmo src/uucp_num_data.cmo src/uucp_num.cmo src/uucp_script_base.cmo src/uucp_script_data.cmo src/uucp_script.cmo src/uucp_white_data.cmo src/uucp_white.cmo src/uucp.cmo -o src/uucp.cma
- # Parallel statistics: { count(total): 5(142), max: 15, min: 2, average(total): 5.400(1.155) }
-> compiled  uucp.14.0.0
Processing 72/78: [menhir: dune build]
-> installed uucp.14.0.0
Processing 73/78: [menhir: dune build]
+ /home/opam/.opam/opam-init/hooks/sandbox.sh "build" "dune" "build" "-p" "menhir" "-j" "31" (CWD=/home/opam/.opam/5.0/.opam-switch/build/menhir.20220210)
- (cd _build/default/src/stage2 && .bin/menhir --exn-carries-state --no-pager --require-aliases --strict parser.mly --compare-errors parserMessages.auto.messages --compare-errors parserMessages.messages) > _build/default/src/stage2/parserMessages.check
- Read 101 sample input sentences and 101 error messages.
- Read 101 sample input sentences and 48 error messages.
- (cd _build/default && src/stage2/.bin/menhir --exn-carries-state --no-pager --require-aliases --strict -lg 1 -la 1 -lc 1 -v src/stage2/parser.mly --base src/stage2/parser --infer-read-reply src/stage2/parser__mock.mli.inferred)
- Grammar has 56 nonterminal symbols, among which 1 start symbols.
- Grammar has 37 terminal symbols.
- Grammar has 129 productions.
- Built an LR(0) automaton with 194 states.
- The grammar is not SLR(1) -- 5 states have a conflict.
- The construction mode is no-pager.
- Built an LR(1) automaton with 298 states.
- One shift/reduce conflict was silently solved.
- Extra reductions on error were added in 40 states.
- Priority played a role in 0 of these states.
- 152 out of 298 states have a default reduction.
- 102 out of 298 states are represented.
- 44 out of 96 symbols keep track of their start position.
- 41 out of 96 symbols keep track of their end position.
- 264 specialized copies of 64 functions have been created.
- The StackLang code contains 5161 instructions in 241 blocks.
- The StackLang code comprises 5 mutually recursive groups.
- (cd _build/default/src/stage2 && .bin/menhir --exn-carries-state --no-pager --require-aliases --strict parser.mly --compile-errors parserMessages.messages) > _build/default/src/stage2/parserMessages.ml
- Read 101 sample input sentences and 48 error messages.
-> compiled  menhir.20220210
-> installed menhir.20220210
Processing 75/78: [dolmen: dune build]
+ /home/opam/.opam/opam-init/hooks/sandbox.sh "build" "dune" "build" "-p" "dolmen" "-j" "31" (CWD=/home/opam/.opam/5.0/.opam-switch/build/dolmen.0.4.1)
- (cd _build/default && /home/opam/.opam/5.0/bin/ocamlc.opt -w -40 -g -bin-annot -I src/standard/.dolmen_std.objs/byte -I /home/opam/.opam/5.0/lib/menhirLib -I src/interface/.dolmen_intf.objs/byte -I src/languages/line/.dolmen_line.objs/byte -intf-suffix .ml -no-alias-deps -open Dolmen_std -o src/standard/.dolmen_std.objs/byte/dolmen_std__Id.cmo -c -impl src/standard/id.ml)
- File "src/standard/id.ml", line 18, characters 14-32:
- 18 | let compare = Pervasives.compare
-                    ^^^^^^^^^^^^^^^^^^
- Error: Unbound module Pervasives
- (cd _build/default && /home/opam/.opam/5.0/bin/ocamlopt.opt -w -40 -g -I src/standard/.dolmen_std.objs/byte -I src/standard/.dolmen_std.objs/native -I /home/opam/.opam/5.0/lib/menhirLib -I src/interface/.dolmen_intf.objs/byte -I src/interface/.dolmen_intf.objs/native -I src/languages/line/.dolmen_line.objs/byte -I src/languages/line/.dolmen_line.objs/native -intf-suffix .ml -no-alias-deps -open Dolmen_std -o src/standard/.dolmen_std.objs/native/dolmen_std__Id.cmx -c -impl src/standard/id.ml)
- File "src/standard/id.ml", line 18, characters 14-32:
- 18 | let compare = Pervasives.compare
-                    ^^^^^^^^^^^^^^^^^^
- Error: Unbound module Pervasives
- (cd _build/default && /home/opam/.opam/5.0/bin/ocamlc.opt -w -40 -g -bin-annot -I src/standard/.dolmen_std.objs/byte -I /home/opam/.opam/5.0/lib/menhirLib -I src/interface/.dolmen_intf.objs/byte -I src/languages/line/.dolmen_line.objs/byte -intf-suffix .ml -no-alias-deps -open Dolmen_std -o src/standard/.dolmen_std.objs/byte/dolmen_std__Term.cmo -c -impl src/standard/term.ml)
- File "src/standard/term.ml", line 205, characters 29-47:
- 205 |   | Builtin b, Builtin b' -> Pervasives.compare b b'
-                                    ^^^^^^^^^^^^^^^^^^
- Error: Unbound module Pervasives
[ERROR] The compilation of dolmen.0.4.1 failed at "dune build -p dolmen -j 31".

#=== ERROR while compiling msat.0.7 ===========================================#
# context              2.2.0~alpha~dev | linux/x86_64 | ocaml-variants.5.0.0+trunk | file:///home/opam/opam-repository
# path                 ~/.opam/5.0/.opam-switch/build/msat.0.7
# command              ~/.opam/opam-init/hooks/sandbox.sh build make lib
# exit-code            2
# env-file             ~/.opam/log/msat-9-e90cae.env
# output-file          ~/.opam/log/msat-9-e90cae.out
### output ###
# ocamlbuild -log build.log -use-ocamlfind  msat.cma msat.cmxa msat.cmxs
# ocamlfind ocamlopt unix.cmxa -I /home/opam/.opam/5.0/lib/ocamlbuild /home/opam/.opam/5.0/lib/ocamlbuild/ocamlbuildlib.cmxa -linkpkg myocamlbuild.ml /home/opam/.opam/5.0/lib/ocamlbuild/ocamlbuild.cmx -o myocamlbuild
# ocamlfind ocamldep -modules src/util/log.mli > src/util/log.mli.depends
# ocamlfind ocamlc -c -bin-annot -color always -I src/util -I src -I src/solver -I src/smt -I src/sat -I src/mcsat -I src/core -I src/backend -o src/util/log.cmi src/util/log.mli
# ocamlfind ocamldep -modules src/util/log.ml > src/util/log.ml.depends
# ocamlfind ocamldep -modules src/core/formula_intf.ml > src/core/formula_intf.ml.depends
# ocamlfind ocamldep -modules src/core/theory_intf.ml > src/core/theory_intf.ml.depends
# ocamlfind ocamldep -modules src/core/plugin_intf.ml > src/core/plugin_intf.ml.depends
# ocamlfind ocamlc -c -g -bin-annot -safe-string -short-paths -w K -w X -w Y -strict-sequence -color always -I src/core -I src -I src/util -I src/solver -I src/smt -I src/sat -I src/mcsat -I src/backend -o src/core/plugin_intf.cmo src/core/plugin_intf.ml
# ocamlfind ocamldep -modules src/core/expr_intf.ml > src/core/expr_intf.ml.depends
# ocamlfind ocamlc -c -g -bin-annot -safe-string -short-paths -w K -w X -w Y -strict-sequence -color always -I src/core -I src -I src/util -I src/solver -I src/smt -I src/sat -I src/mcsat -I src/backend -o src/core/formula_intf.cmo src/core/formula_intf.ml
# ocamlfind ocamldep -modules src/solver/tseitin_intf.ml > src/solver/tseitin_intf.ml.depends
# ocamlfind ocamldep -modules src/core/res_intf.ml > src/core/res_intf.ml.depends
# ocamlfind ocamldep -modules src/core/solver_types.mli > src/core/solver_types.mli.depends
# ocamlfind ocamlc -c -g -bin-annot -safe-string -short-paths -w K -w X -w Y -strict-sequence -color always -I src/core -I src -I src/util -I src/solver -I src/smt -I src/sat -I src/mcsat -I src/backend -o src/core/expr_intf.cmo src/core/expr_intf.ml
# ocamlfind ocamldep -modules src/core/solver_types_intf.ml > src/core/solver_types_intf.ml.depends
# ocamlfind ocamldep -modules src/util/vec.mli > src/util/vec.mli.depends
# ocamlfind ocamlc -c -bin-annot -color always -I src/util -I src -I src/solver -I src/smt -I src/sat -I src/mcsat -I src/core -I src/backend -o src/util/vec.cmi src/util/vec.mli
# ocamlfind ocamlc -c -g -bin-annot -safe-string -short-paths -w K -w X -w Y -strict-sequence -color always -I src/core -I src -I src/util -I src/solver -I src/smt -I src/sat -I src/mcsat -I src/backend -o src/core/solver_types_intf.cmo src/core/solver_types_intf.ml
# ocamlfind ocamlc -c -bin-annot -color always -I src/core -I src -I src/util -I src/solver -I src/smt -I src/sat -I src/mcsat -I src/backend -o src/core/solver_types.cmi src/core/solver_types.mli
# ocamlfind ocamldep -modules src/core/solver_intf.ml > src/core/solver_intf.ml.depends
# ocamlfind ocamldep -modules src/core/res.mli > src/core/res.mli.depends
# ocamlfind ocamlc -c -g -bin-annot -safe-string -short-paths -w K -w X -w Y -strict-sequence -color always -I src/core -I src -I src/util -I src/solver -I src/smt -I src/sat -I src/mcsat -I src/backend -o src/core/res_intf.cmo src/core/res_intf.ml
# ocamlfind ocamlc -c -bin-annot -color always -I src/core -I src -I src/util -I src/solver -I src/smt -I src/sat -I src/mcsat -I src/backend -o src/core/res.cmi src/core/res.mli
# ocamlfind ocamldep -modules src/core/internal.mli > src/core/internal.mli.depends
# ocamlfind ocamlc -c -bin-annot -color always -I src/core -I src -I src/util -I src/solver -I src/smt -I src/sat -I src/mcsat -I src/backend -o src/core/internal.cmi src/core/internal.mli
# ocamlfind ocamldep -modules src/core/internal.ml > src/core/internal.ml.depends
# ocamlfind ocamldep -modules src/util/array_util.ml > src/util/array_util.ml.depends
# ocamlfind ocamldep -modules src/util/iheap.mli > src/util/iheap.mli.depends
# ocamlfind ocamlc -c -g -bin-annot -safe-string -short-paths -w K -w X -w Y -strict-sequence -color always -I src/util -I src -I src/solver -I src/smt -I src/sat -I src/mcsat -I src/core -I src/backend -o src/util/array_util.cmo src/util/array_util.ml
# ocamlfind ocamlc -c -bin-annot -color always -I src/util -I src -I src/solver -I src/smt -I src/sat -I src/mcsat -I src/core -I src/backend -o src/util/iheap.cmi src/util/iheap.mli
# ocamlfind ocamldep -modules src/core/external.mli > src/core/external.mli.depends
# ocamlfind ocamlc -c -g -bin-annot -safe-string -short-paths -w K -w X -w Y -strict-sequence -color always -I src/core -I src -I src/util -I src/solver -I src/smt -I src/sat -I src/mcsat -I src/backend -o src/core/solver_intf.cmo src/core/solver_intf.ml
# ocamlfind ocamlc -c -bin-annot -color always -I src/core -I src -I src/util -I src/solver -I src/smt -I src/sat -I src/mcsat -I src/backend -o src/core/external.cmi src/core/external.mli
# ocamlfind ocamldep -modules src/core/external.ml > src/core/external.ml.depends
# ocamlfind ocamldep -modules src/backend/dimacs.mli > src/backend/dimacs.mli.depends
# ocamlfind ocamlc -c -bin-annot -color always -I src/backend -I src -I src/util -I src/solver -I src/smt -I src/sat -I src/mcsat -I src/core -o src/backend/dimacs.cmi src/backend/dimacs.mli
# ocamlfind ocamldep -modules src/solver/solver.mli > src/solver/solver.mli.depends
# ocamlfind ocamlc -c -g -bin-annot -safe-string -short-paths -w K -w X -w Y -strict-sequence -color always -I src/core -I src -I src/util -I src/solver -I src/smt -I src/sat -I src/mcsat -I src/backend -o src/core/theory_intf.cmo src/core/theory_intf.ml
# ocamlfind ocamlc -c -bin-annot -color always -I src/solver -I src -I src/util -I src/smt -I src/sat -I src/mcsat -I src/core -I src/backend -o src/solver/solver.cmi src/solver/solver.mli
# ocamlfind ocamldep -modules src/solver/solver.ml > src/solver/solver.ml.depends
# ocamlfind ocamldep -modules src/solver/mcsolver.mli > src/solver/mcsolver.mli.depends
# ocamlfind ocamlc -c -bin-annot -color always -I src/solver -I src -I src/util -I src/smt -I src/sat -I src/mcsat -I src/core -I src/backend -o src/solver/mcsolver.cmi src/solver/mcsolver.mli
# ocamlfind ocamldep -modules src/solver/mcsolver.ml > src/solver/mcsolver.ml.depends
# ocamlfind ocamldep -modules src/core/solver_types.ml > src/core/solver_types.ml.depends
# ocamlfind ocamldep -modules src/core/res.ml > src/core/res.ml.depends
# ocamlfind ocamldep -modules src/backend/backend_intf.ml > src/backend/backend_intf.ml.depends
# ocamlfind ocamldep -modules src/backend/dot.mli > src/backend/dot.mli.depends
# ocamlfind ocamlc -c -g -bin-annot -safe-string -short-paths -w K -w X -w Y -strict-sequence -color always -I src/backend -I src -I src/util -I src/solver -I src/smt -I src/sat -I src/mcsat -I src/core -o src/backend/backend_intf.cmo src/backend/backend_intf.ml
# ocamlfind ocamlc -c -bin-annot -color always -I src/backend -I src -I src/util -I src/solver -I src/smt -I src/sat -I src/mcsat -I src/core -o src/backend/dot.cmi src/backend/dot.mli
# ocamlfind ocamldep -modules src/backend/dot.ml > src/backend/dot.ml.depends
# ocamlfind ocamldep -modules src/backend/coq.mli > src/backend/coq.mli.depends
# ocamlfind ocamlc -c -bin-annot -color always -I src/backend -I src -I src/util -I src/solver -I src/smt -I src/sat -I src/mcsat -I src/core -o src/backend/coq.cmi src/backend/coq.mli
# ocamlfind ocamldep -modules src/backend/coq.ml > src/backend/coq.ml.depends
# ocamlfind ocamldep -modules src/backend/dimacs.ml > src/backend/dimacs.ml.depends
# ocamlfind ocamldep -modules src/backend/dedukti.mli > src/backend/dedukti.mli.depends
# ocamlfind ocamlc -c -bin-annot -color always -I src/backend -I src -I src/util -I src/solver -I src/smt -I src/sat -I src/mcsat -I src/core -o src/backend/dedukti.cmi src/backend/dedukti.mli
# ocamlfind ocamldep -modules src/backend/dedukti.ml > src/backend/dedukti.ml.depends
# ocamlfind ocamldep -modules src/solver/tseitin.mli > src/solver/tseitin.mli.depends
# ocamlfind ocamlc -c -g -bin-annot -safe-string -short-paths -w K -w X -w Y -strict-sequence -color always -I src/solver -I src -I src/util -I src/smt -I src/sat -I src/mcsat -I src/core -I src/backend -o src/solver/tseitin_intf.cmo src/solver/tseitin_intf.ml
# ocamlfind ocamlc -c -bin-annot -color always -I src/solver -I src -I src/util -I src/smt -I src/sat -I src/mcsat -I src/core -I src/backend -o src/solver/tseitin.cmi src/solver/tseitin.mli
# ocamlfind ocamldep -modules src/solver/tseitin.ml > src/solver/tseitin.ml.depends
# ocamlfind ocamldep -modules src/sat/sat.mli > src/sat/sat.mli.depends
# ocamlfind ocamlc -c -bin-annot -color always -I src/sat -I src -I src/util -I src/solver -I src/smt -I src/mcsat -I src/core -I src/backend -o src/sat/sat.cmi src/sat/sat.mli
# ocamlfind ocamldep -modules src/sat/sat.ml > src/sat/sat.ml.depends
# ocamlfind ocamlc -c -g -bin-annot -safe-string -short-paths -w K -w X -w Y -strict-sequence -color always -I src/util -I src -I src/solver -I src/smt -I src/sat -I src/mcsat -I src/core -I src/backend -o src/util/log.cmo src/util/log.ml
# ocamlfind ocamlc -c -g -bin-annot -safe-string -short-paths -w K -w X -w Y -strict-sequence -color always -I src/core -I src -I src/util -I src/solver -I src/smt -I src/sat -I src/mcsat -I src/backend -o src/core/internal.cmo src/core/internal.ml
# + ocamlfind ocamlc -c -g -bin-annot -safe-string -short-paths -w K -w X -w Y -strict-sequence -color always -I src/core -I src -I src/util -I src/solver -I src/smt -I src/sat -I src/mcsat -I src/backend -o src/core/internal.cmo src/core/internal.ml
# File "src/core/internal.ml", line 546, characters 6-18:
# 546 |       enqueue_bool a lvl Semantic
#             ^^^^^^^^^^^^
# Warning 6 [labels-omitted]: label level was omitted in the application of this function.
# File "src/core/internal.ml", line 837, characters 12-24:
# 837 |             enqueue_bool a lvl (Bcp clause)
#                   ^^^^^^^^^^^^
# Warning 6 [labels-omitted]: label level was omitted in the application of this function.
# File "src/core/internal.ml", line 901, characters 12-24:
# 901 |             enqueue_bool first (decision_level ()) (Bcp c)
#                   ^^^^^^^^^^^^
# Warning 6 [labels-omitted]: label level was omitted in the application of this function.
# File "src/core/internal.ml", line 976, characters 10-22:
# 976 |           enqueue_bool p lvl (Bcp c)
#                 ^^^^^^^^^^^^
# Warning 6 [labels-omitted]: label level was omitted in the application of this function.
# File "src/core/internal.ml", line 1070, characters 8-20:
# 1070 |         enqueue_bool atom current_level Decision
#                ^^^^^^^^^^^^
# Warning 6 [labels-omitted]: label level was omitted in the application of this function.
# ocamlfind ocamlc -c -g -bin-annot -safe-string -short-paths -w K -w X -w Y -strict-sequence -color always -I src/core -I src -I src/util -I src/solver -I src/smt -I src/sat -I src/mcsat -I src/backend -o src/core/external.cmo src/core/external.ml
# ocamlfind ocamlc -c -g -bin-annot -safe-string -short-paths -w K -w X -w Y -strict-sequence -color always -I src/solver -I src -I src/util -I src/smt -I src/sat -I src/mcsat -I src/core -I src/backend -o src/solver/solver.cmo src/solver/solver.ml
# ocamlfind ocamlc -c -g -bin-annot -safe-string -short-paths -w K -w X -w Y -strict-sequence -color always -I src/solver -I src -I src/util -I src/smt -I src/sat -I src/mcsat -I src/core -I src/backend -o src/solver/mcsolver.cmo src/solver/mcsolver.ml
# ocamlfind ocamlc -c -g -bin-annot -safe-string -short-paths -w K -w X -w Y -strict-sequence -color always -I src/core -I src -I src/util -I src/solver -I src/smt -I src/sat -I src/mcsat -I src/backend -o src/core/solver_types.cmo src/core/solver_types.ml
# ocamlfind ocamlc -c -g -bin-annot -safe-string -short-paths -w K -w X -w Y -strict-sequence -color always -I src/core -I src -I src/util -I src/solver -I src/smt -I src/sat -I src/mcsat -I src/backend -o src/core/res.cmo src/core/res.ml
# + ocamlfind ocamlc -c -g -bin-annot -safe-string -short-paths -w K -w X -w Y -strict-sequence -color always -I src/core -I src -I src/util -I src/solver -I src/smt -I src/sat -I src/mcsat -I src/backend -o src/core/res.cmo src/core/res.ml
# File "src/core/res.ml", line 29, characters 26-44:
# 29 |   let compare_atoms a b = Pervasives.compare St.(a.aid) St.(b.aid)
#                                ^^^^^^^^^^^^^^^^^^
# Error: Unbound module Pervasives
# Command exited with code 2.
# + ocamlfind ocamlopt unix.cmxa -I /home/opam/.opam/5.0/lib/ocamlbuild /home/opam/.opam/5.0/lib/ocamlbuild/ocamlbuildlib.cmxa -linkpkg myocamlbuild.ml /home/opam/.opam/5.0/lib/ocamlbuild/ocamlbuild.cmx -o myocamlbuild
# File "_none_", line 1:
# Alert ocaml_deprecated_auto_include: 
# OCaml's lib directory layout changed in 5.0. The unix subdirectory has been
# automatically added to the search path, but you should add -I +unix to the
# command-line to silence this alert (e.g. by adding unix to the list of
# libraries in your dune file, or adding use_unix to your _tags file for
# ocamlbuild, or using -package unix for ocamlfind).
# make: *** [Makefile:17: lib] Error 10


#=== ERROR while compiling iter.1.4 ===========================================#
# context              2.2.0~alpha~dev | linux/x86_64 | ocaml-variants.5.0.0+trunk | file:///home/opam/opam-repository
# path                 ~/.opam/5.0/.opam-switch/build/iter.1.4
# command              ~/.opam/opam-init/hooks/sandbox.sh build dune build @install -p iter -j 31
# exit-code            1
# env-file             ~/.opam/log/iter-9-5fef72.env
# output-file          ~/.opam/log/iter-9-5fef72.out
### output ###
# (cd _build/default && /home/opam/.opam/5.0/bin/ocamlc.opt -w -40 -warn-error -a+8 -safe-string -strict-sequence -nolabels -g -bin-annot -I src/.iter.objs/byte -I /home/opam/.opam/5.0/lib/result -no-alias-deps -o src/.iter.objs/byte/iterLabels.cmi -c -intf src/IterLabels.mli)
# File "src/IterLabels.mli", line 534, characters 19-27:
# 534 | val of_stream : 'a Stream.t -> 'a t
#                          ^^^^^^^^
# Error: Unbound module Stream
# (cd _build/default && /home/opam/.opam/5.0/bin/ocamlc.opt -w -40 -warn-error -a+8 -safe-string -strict-sequence -nolabels -g -bin-annot -I src/.iter.objs/byte -I /home/opam/.opam/5.0/lib/result -no-alias-deps -o src/.iter.objs/byte/iter.cmi -c -intf src/Iter.mli)
# File "src/Iter.mli", line 570, characters 19-27:
# 570 | val of_stream : 'a Stream.t -> 'a t
#                          ^^^^^^^^
# Error: Unbound module Stream


#=== ERROR while compiling dolmen.0.4.1 =======================================#
# context              2.2.0~alpha~dev | linux/x86_64 | ocaml-variants.5.0.0+trunk | file:///home/opam/opam-repository
# path                 ~/.opam/5.0/.opam-switch/build/dolmen.0.4.1
# command              ~/.opam/opam-init/hooks/sandbox.sh build dune build -p dolmen -j 31
# exit-code            1
# env-file             ~/.opam/log/dolmen-9-13c348.env
# output-file          ~/.opam/log/dolmen-9-13c348.out
### output ###
# (cd _build/default && /home/opam/.opam/5.0/bin/ocamlc.opt -w -40 -g -bin-annot -I src/standard/.dolmen_std.objs/byte -I /home/opam/.opam/5.0/lib/menhirLib -I src/interface/.dolmen_intf.objs/byte -I src/languages/line/.dolmen_line.objs/byte -intf-suffix .ml -no-alias-deps -open Dolmen_std -o src/standard/.dolmen_std.objs/byte/dolmen_std__Id.cmo -c -impl src/standard/id.ml)
# File "src/standard/id.ml", line 18, characters 14-32:
# 18 | let compare = Pervasives.compare
#                    ^^^^^^^^^^^^^^^^^^
# Error: Unbound module Pervasives
# (cd _build/default && /home/opam/.opam/5.0/bin/ocamlopt.opt -w -40 -g -I src/standard/.dolmen_std.objs/byte -I src/standard/.dolmen_std.objs/native -I /home/opam/.opam/5.0/lib/menhirLib -I src/interface/.dolmen_intf.objs/byte -I src/interface/.dolmen_intf.objs/native -I src/languages/line/.dolmen_line.objs/byte -I src/languages/line/.dolmen_line.objs/native -intf-suffix .ml -no-alias-deps -open Dolmen_std -o src/standard/.dolmen_std.objs/native/dolmen_std__Id.cmx -c -impl src/standard/id.ml)
# File "src/standard/id.ml", line 18, characters 14-32:
# 18 | let compare = Pervasives.compare
#                    ^^^^^^^^^^^^^^^^^^
# Error: Unbound module Pervasives
# (cd _build/default && /home/opam/.opam/5.0/bin/ocamlc.opt -w -40 -g -bin-annot -I src/standard/.dolmen_std.objs/byte -I /home/opam/.opam/5.0/lib/menhirLib -I src/interface/.dolmen_intf.objs/byte -I src/languages/line/.dolmen_line.objs/byte -intf-suffix .ml -no-alias-deps -open Dolmen_std -o src/standard/.dolmen_std.objs/byte/dolmen_std__Term.cmo -c -impl src/standard/term.ml)
# File "src/standard/term.ml", line 205, characters 29-47:
# 205 |   | Builtin b, Builtin b' -> Pervasives.compare b b'
#                                    ^^^^^^^^^^^^^^^^^^
# Error: Unbound module Pervasives


#=== ERROR while compiling containers.2.8.1 ===================================#
# context              2.2.0~alpha~dev | linux/x86_64 | ocaml-variants.5.0.0+trunk | file:///home/opam/opam-repository
# path                 ~/.opam/5.0/.opam-switch/build/containers.2.8.1
# command              ~/.opam/opam-init/hooks/sandbox.sh build dune build -p containers -j 31
# exit-code            1
# env-file             ~/.opam/log/containers-9-0ca11c.env
# output-file          ~/.opam/log/containers-9-0ca11c.out
### output ###
# (cd _build/default && /home/opam/.opam/5.0/bin/ocamlc.opt -w -40 -warn-error -3 -w +a-4-42-44-48-50-58-32-60@8 -safe-string -g -bin-annot -I src/monomorphic/.containers_monomorphic.objs/byte -no-alias-deps -o src/monomorphic/.containers_monomorphic.objs/byte/cCMonomorphicShims_.cmo -c -impl src/monomorphic/CCMonomorphicShims_.ml)
# File "src/monomorphic/CCMonomorphicShims_.ml", line 1:
# Warning 70 [missing-mli]: Cannot find interface file.
# (cd _build/default && /home/opam/.opam/5.0/bin/ocamlc.opt -w -40 -warn-error -3 -w +a-4-42-44-48-50-58-32-60@8 -safe-string -nolabels -open CCMonomorphic -g -bin-annot -I src/core/.containers.objs/byte -I /home/opam/.opam/5.0/lib/seq -I src/monomorphic/.containers_monomorphic.objs/byte -no-alias-deps -o src/core/.containers.objs/byte/cCShimsArrayLabels_.cmo -c -impl src/core/CCShimsArrayLabels_.ml)
# File "src/core/CCShimsArrayLabels_.ml", line 1:
# Warning 70 [missing-mli]: Cannot find interface file.
# (cd _build/default && /home/opam/.opam/5.0/bin/ocamlc.opt -w -40 -warn-error -3 -w +a-4-42-44-48-50-58-32-60@8 -safe-string -nolabels -open CCMonomorphic -g -bin-annot -I src/core/.containers.objs/byte -I /home/opam/.opam/5.0/lib/seq -I src/monomorphic/.containers_monomorphic.objs/byte -no-alias-deps -o src/core/.containers.objs/byte/cCShimsArray_.cmo -c -impl src/core/CCShimsArray_.ml)
# File "src/core/CCShimsArray_.ml", line 1:
# Warning 70 [missing-mli]: Cannot find interface file.
# (cd _build/default && /home/opam/.opam/5.0/bin/ocamlc.opt -w -40 -warn-error -3 -w +a-4-42-44-48-50-58-32-60@8 -safe-string -nolabels -open CCMonomorphic -g -bin-annot -I src/core/.containers.objs/byte -I /home/opam/.opam/5.0/lib/seq -I src/monomorphic/.containers_monomorphic.objs/byte -no-alias-deps -o src/core/.containers.objs/byte/cCShimsFormat_.cmo -c -impl src/core/CCShimsFormat_.ml)
# File "src/core/CCShimsFormat_.ml", line 6, characters 18-29:
# 6 | let pp_open_tag = pp_open_tag
#                       ^^^^^^^^^^^
# Error: Unbound value pp_open_tag
# Hint: Did you mean pp_open_stag?
# (cd _build/default && /home/opam/.opam/5.0/bin/ocamlc.opt -w -40 -warn-error -3 -w +a-4-42-44-48-50-58-32-60@8 -safe-string -nolabels -open CCMonomorphic -g -bin-annot -I src/core/.containers.objs/byte -I /home/opam/.opam/5.0/lib/seq -I src/monomorphic/.containers_monomorphic.objs/byte -no-alias-deps -o src/core/.containers.objs/byte/cCShims_.cmo -c -impl src/core/CCShims_.ml)
# File "src/core/CCShims_.ml", line 1:
# Warning 70 [missing-mli]: Cannot find interface file.
# (cd _build/default && /home/opam/.opam/5.0/bin/ocamlc.opt -w -40 -warn-error -3 -w +a-4-42-44-48-50-58-32-60@8 -safe-string -nolabels -open CCMonomorphic -g -bin-annot -I src/core/.containers.objs/byte -I /home/opam/.opam/5.0/lib/seq -I src/monomorphic/.containers_monomorphic.objs/byte -no-alias-deps -o src/core/.containers.objs/byte/cCShimsList_.cmo -c -impl src/core/CCShimsList_.ml)
# File "src/core/CCShimsList_.ml", line 1:
# Warning 70 [missing-mli]: Cannot find interface file.
# (cd _build/default && /home/opam/.opam/5.0/bin/ocamlc.opt -w -40 -warn-error -3 -w +a-4-42-44-48-50-58-32-60@8 -safe-string -nolabels -open CCMonomorphic -g -bin-annot -I src/core/.containers.objs/byte -I /home/opam/.opam/5.0/lib/seq -I src/monomorphic/.containers_monomorphic.objs/byte -no-alias-deps -o src/core/.containers.objs/byte/cCShimsMkLet_.cmo -c -impl src/core/CCShimsMkLet_.ml)
# File "src/core/CCShimsMkLet_.ml", line 1:
# Warning 70 [missing-mli]: Cannot find interface file.
# (cd _build/default && /home/opam/.opam/5.0/bin/ocamlc.opt -w -40 -warn-error -3 -w +a-4-42-44-48-50-58-32-60@8 -safe-string -nolabels -open CCMonomorphic -g -bin-annot -I src/core/.containers.objs/byte -I /home/opam/.opam/5.0/lib/seq -I src/monomorphic/.containers_monomorphic.objs/byte -intf-suffix .ml -no-alias-deps -o src/core/.containers.objs/byte/cCArray.cmo -c -impl src/core/CCArray.ml)
# File "src/core/CCArray.ml", line 1:
# Error: The implementation src/core/CCArray.ml
#        does not match the interface src/core/.containers.objs/byte/cCArray.cmi:
#         The value `make_float' is required but not provided
#        File "src/core/CCArray.mli", line 24, characters 0-65:
#          Expected declaration
# (cd _build/default && /home/opam/.opam/5.0/bin/ocamlc.opt -w -40 -warn-error -3 -w +a-4-42-44-48-50-58-32-60@8 -safe-string -nolabels -open CCMonomorphic -g -bin-annot -I src/core/.containers.objs/byte -I /home/opam/.opam/5.0/lib/seq -I src/monomorphic/.containers_monomorphic.objs/byte -no-alias-deps -o src/core/.containers.objs/byte/containers.cmo -c -impl src/core/containers.ml)
# File "src/core/containers.ml", line 1:
# Warning 70 [missing-mli]: Cannot find interface file.
# (cd _build/default && /home/opam/.opam/5.0/bin/ocamlc.opt -w -40 -warn-error -3 -w +a-4-42-44-48-50-58-32-60@8 -safe-string -nolabels -open CCMonomorphic -g -bin-annot -I src/core/.containers.objs/byte -I /home/opam/.opam/5.0/lib/seq -I src/monomorphic/.containers_monomorphic.objs/byte -no-alias-deps -o src/core/.containers.objs/byte/containersLabels.cmo -c -impl src/core/containersLabels.ml)
# File "src/core/containersLabels.ml", line 1:
# Warning 70 [missing-mli]: Cannot find interface file.
# (cd _build/default && /home/opam/.opam/5.0/bin/ocamlopt.opt -w -40 -warn-error -3 -w +a-4-42-44-48-50-58-32-60@8 -safe-string -nolabels -open CCMonomorphic -O3 -unbox-closures -unbox-closures-factor 20 -color always -I src/core/.containers.objs/byte -I src/core/.containers.objs/native -I /home/opam/.opam/5.0/lib/seq -I src/monomorphic/.containers_monomorphic.objs/byte -I src/monomorphic/.containers_monomorphic.objs/native -intf-suffix .ml -no-alias-deps -o src/core/.containers.objs/native/cCArray.cmx -c -impl src/core/CCArray.ml)
# File "src/core/CCArray.ml", line 1:
# Error: The implementation src/core/CCArray.ml
#        does not match the interface src/core/.containers.objs/byte/cCArray.cmi:
#         The value `make_float' is required but not provided
#        File "src/core/CCArray.mli", line 24, characters 0-65:
#          Expected declaration



<><> Error report <><><><><><><><><><><><><><><><><><><><><><><><><><><><><><><>
+- The following actions were aborted
| - install archsat 1.1
+- 
+- The following actions failed
| - build containers 2.8.1
| - build dolmen     0.4.1
| - build iter       1.4
| - build msat       0.7
+- 
+- The following changes have been performed (the rest was aborted)
| - install base-bytes        base
| - install cmdliner          1.1.1
| - install conf-gmp          4
| - install csexp             1.5.1
| - install dune              3.3.0
| - install dune-configurator 3.3.0
| - install gen               1.0
| - install menhir            20220210
| - install menhirLib         20220210
| - install menhirSdk         20220210
| - install mtime             1.3.0
| - install ocamlbuild        0.14.1
| - install ocamlfind         1.9.5
| - install ocamlgraph        2.0.0
| - install result            1.5
| - install seq               base
| - install spelll            0.4
| - install stdlib-shims      0.3.0
| - install topkg             1.0.5
| - install uucp              14.0.0
| - install uutf              1.0.3
| - install zarith            1.12
+- 
# Run eval $(opam env) to update the current shell environment

The former state can be restored with:
    /usr/bin/opam switch import "/home/opam/.opam/5.0/.opam-switch/backup/state-20220621012013.export"
'opam install -vy archsat.1.1' failed.
"/bin/bash" "-c"
"
opam remove -y "archsat.1.1"
opam install -vy "archsat.1.1"
res=$?
if [ $res = 31 ]; then
    if opam show -f x-ci-accept-failures: "archsat.1.1" | grep -q '"debian-unstable"'; then
        echo "This package failed and has been disabled for CI using the 'x-ci-accept-failures' field."
        exit 69
    fi
fi


exit $res
" failed with exit status 31
Failed: Build failed