OCamllabs icon Home|Differences with the last checks|Previous runs


Building on x86-bm-5.ocamllabs.io

(from ocaml/opam:debian-unstable@sha256:ab7f0b8ac566a6726439e621a0807bcd9fc12180ea873955fd963cfd263c279c)
Unable to find image 'ocaml/opam:debian-unstable@sha256:ab7f0b8ac566a6726439e621a0807bcd9fc12180ea873955fd963cfd263c279c' locally
docker.io/ocaml/opam@sha256:ab7f0b8ac566a6726439e621a0807bcd9fc12180ea873955fd963cfd263c279c: Pulling from ocaml/opam
7c26de214b34: Already exists
686e2e0ed2af: Pulling fs layer
6f56e1824cd6: Pulling fs layer
686e2e0ed2af: Verifying Checksum
686e2e0ed2af: Download complete
6f56e1824cd6: Verifying Checksum
6f56e1824cd6: Download complete
686e2e0ed2af: Pull complete
6f56e1824cd6: Pull complete
Digest: sha256:ab7f0b8ac566a6726439e621a0807bcd9fc12180ea873955fd963cfd263c279c
Status: Downloaded newer image for ocaml/opam@sha256:ab7f0b8ac566a6726439e621a0807bcd9fc12180ea873955fd963cfd263c279c
2022-05-12 00:02.04 ---> using "31be97220bde553e6e760a64d33a5a13bf22f7bc7b939c6db9f7e6618bb986a9" from cache

/: (user (uid 1000) (gid 1000))

/: (env OPAMPRECISETRACKING 1)

/: (env OPAMUTF8 never)

/: (env OPAMEXTERNALSOLVER builtin-0install)

/: (env OPAMCRITERIA +removed)

/: (run (shell "sudo ln -f /usr/bin/opam-dev /usr/bin/opam"))
2022-05-12 00:02.04 ---> using "179f53753baadbe2063c82b23383d48191f66b8e16101240f7dfbf1ced2cc270" from cache

/: (run (network host)
        (shell "rm -rf ~/opam-repository && git clone -q 'https://github.com/ocaml/opam-repository' ~/opam-repository && git -C ~/opam-repository checkout -q 7ebba7f05b4ae6507db523882e2a6df3fcb82fb3"))
2022-05-12 00:02.04 ---> using "e03d0e1409ca900b4238dc5a99fda90533ac437f633561f6a23a7ce554600652" from cache

/: (run (shell "rm -rf ~/.opam && opam init -ya --bare --config ~/.opamrc-sandbox ~/opam-repository"))
Configuring from /home/opam/.opamrc-sandbox, then /home/opam/.opamrc, and finally from built-in defaults.
Checking for available remotes: rsync and local, git.
  - you won't be able to use mercurial repositories unless you install the hg command on your system.
  - you won't be able to use darcs repositories unless you install the darcs command on your system.


<><> Fetching repository information ><><><><><><><><><><><><><><><><><><><><><>
[default] Initialised

User configuration:
  ~/.profile is already up-to-date.
[NOTE] Make sure that ~/.profile is well sourced in your ~/.bashrc.

2022-05-12 00:02.04 ---> using "f2b762bd14fc0fe661511410f052bca3d3a6d98c0572418fb3219e7975323dc4" from cache

/: (run (cache (opam-archives (target /home/opam/.opam/download-cache)))
        (network host)
        (shell "opam switch create --repositories=default '5.0' '5.0.0+trunk'"))

<><> Installing new switch packages <><><><><><><><><><><><><><><><><><><><><><>
Switch invariant: ["ocaml-variants" {= "5.0.0+trunk"}]

<><> Processing actions <><><><><><><><><><><><><><><><><><><><><><><><><><><><>
-> installed base-bigarray.base
-> installed base-threads.base
-> installed base-unix.base
-> retrieved ocaml-variants.5.0.0+trunk  (https://github.com/ocaml/ocaml/archive/trunk.tar.gz)
-> installed ocaml-variants.5.0.0+trunk
-> installed ocaml-config.3
-> installed ocaml.5.0.0
-> installed base-domains.base
-> installed base-nnp.base
Done.
# Run eval $(opam env --switch=5.0) to update the current shell environment
2022-05-12 00:02.04 ---> using "c9764e27e864e7eba8f1014e361a5d7af12ea512edc911d0112d8096e9653974" from cache

/: (run (network host)
        (shell "opam update --depexts"))
+ /usr/bin/sudo "apt-get" "update"
- Get:1 http://deb.debian.org/debian unstable InRelease [165 kB]
- Get:2 http://deb.debian.org/debian unstable/main amd64 Packages.diff/Index [63.6 kB]
- Ign:2 http://deb.debian.org/debian unstable/main amd64 Packages.diff/Index
- Get:3 http://deb.debian.org/debian unstable/main amd64 Packages [9165 kB]
- Fetched 9394 kB in 3s (3041 kB/s)
- Reading package lists...
- 
2022-05-12 00:02.04 ---> using "c6fb778ad179fe07c3df591e8980b4d64a3e3a6ca08ede5395a9d6665c5fcb40" from cache

/: (run (cache (opam-archives (target /home/opam/.opam/download-cache)))
        (network host)
        (shell  "\
               \nopam remove -y \"bap-callgraph-collator.2.4.0\"\
               \nopam install -vy \"bap-callgraph-collator.2.4.0\"\
               \nres=$?\
               \nif [ $res = 31 ]; then\
               \n    if opam show -f x-ci-accept-failures: \"bap-callgraph-collator.2.4.0\" | grep -q '\"debian-unstable\"'; then\
               \n        echo \"This package failed and has been disabled for CI using the 'x-ci-accept-failures' field.\"\
               \n        exit 69\
               \n    fi\
               \nfi\
               \n\
               \n\
               \nexit $res\
               \n"))
[NOTE] bap-callgraph-collator.2.4.0 is not installed.

Nothing to do.
The following actions will be performed:
=== install 117 packages
  - install angstrom               0.15.0             [required by uri]
  - install bap-build              2.4.0              [required by bap-main]
  - install bap-bundle             2.4.0              [required by bap-std]
  - install bap-callgraph-collator 2.4.0
  - install bap-core-theory        2.4.0              [required by bap-std]
  - install bap-future             2.4.0              [required by bap-main, bap-std]
  - install bap-knowledge          2.4.0              [required by bap-std]
  - install bap-main               2.4.0              [required by bap-callgraph-collator]
  - install bap-plugins            2.4.0              [required by bap-main, bap-std]
  - install bap-recipe             2.4.0              [required by bap-main]
  - install bap-relation           2.4.0              [required by bap-std]
  - install bap-std                2.4.0              [required by bap-callgraph-collator]
  - install base                   v0.14.3            [required by bap-main]
  - install base-bytes             base               [required by fileutils, zed]
  - install base_bigstring         v0.14.0            [required by core_kernel]
  - install base_quickcheck        v0.14.1            [required by core_kernel, ppx_bap]
  - install bigarray-compat        1.1.0              [required by mmap]
  - install bigstringaf            0.9.0              [required by angstrom]
  - install bin_prot               v0.14.0            [required by bap-std]
  - install bitvec                 2.4.0              [required by bap-std]
  - install bitvec-binprot         2.4.0              [required by bap-core-theory]
  - install bitvec-order           2.4.0              [required by bap-std]
  - install bitvec-sexp            2.4.0              [required by bap-core-theory]
  - install camlzip                1.11               [required by bap-std]
  - install camomile               1.0.2              [required by utop]
  - install charInfo_width         1.1.0              [required by zed]
  - install cmdliner               1.1.1              [required by bap-main, bap-std]
  - install conf-clang             1                  [required by bap-std]
  - install conf-gmp               4                  [required by bap-std]
  - install conf-m4                1                  [required by bap-std]
  - install conf-perl              2                  [required by bap-std]
  - install conf-pkg-config        2                  [required by conf-zlib]
  - install conf-which             1                  [required by bap-std]
  - install conf-zlib              1                  [required by camlzip]
  - install core_kernel            v0.14.2            [required by bap-callgraph-collator]
  - install cppo                   1.6.8              [required by utop]
  - install csexp                  1.5.1              [required by dune-configurator]
  - install dune                   3.1.1              [required by utop]
  - install dune-configurator      3.1.1              [required by base, lwt]
  - install fieldslib              v0.14.0            [required by core_kernel]
  - install fileutils              0.6.3              [required by bap-std]
  - install graphlib               2.4.0              [required by bap-callgraph-collator]
  - install jane-street-headers    v0.14.0            [required by core_kernel]
  - install jst-config             v0.14.1            [required by core_kernel]
  - install lambda-term            3.2.0              [required by utop]
  - install lwt                    5.5.0              [required by utop]
  - install lwt_log                1.1.1              [required by lambda-term]
  - install lwt_react              1.1.5              [required by utop]
  - install mew                    0.1.0              [required by mew_vi]
  - install mew_vi                 0.5.0              [required by lambda-term]
  - install mmap                   1.2.0              [required by lwt]
  - install monads                 2.4.0              [required by bap-std]
  - install num                    1.4                [required by sexplib]
  - install oasis                  0.4.11             [required by bap-std]
  - install ocaml-compiler-libs    v0.12.4            [required by ppxlib]
  - install ocaml-syntax-shims     1.0.0              [required by lwt]
  - install ocamlbuild             0.14.1             [required by bap-build]
  - install ocamlfind              1.9.3              [required by bap-std]
  - install ocamlgraph             2.0.0              [required by graphlib]
  - install ocamlify               0.0.1              [required by oasis]
  - install ocamlmod               0.0.9              [required by oasis]
  - install ocplib-endian          1.2                [required by lwt]
  - install octavius               1.2.2              [required by ppx_js_style]
  - install ogre                   2.4.0              [required by bap-std]
  - install parsexp                v0.14.2            [required by bap-recipe]
  - install ppx_assert             v0.14.0            [required by core_kernel, ppx_bap]
  - install ppx_bap                v0.14.0            [required by bap-callgraph-collator]
  - install ppx_base               v0.14.0            [required by core_kernel]
  - install ppx_bench              v0.14.1            [required by ppx_bap]
  - install ppx_bin_prot           v0.14.0            [required by ppx_bap]
  - install ppx_cold               v0.14.0            [required by ppx_bap]
  - install ppx_compare            v0.14.0            [required by ppx_bap]
  - install ppx_custom_printf      v0.14.1            [required by ppx_jane]
  - install ppx_derivers           1.2.1              [required by ppxlib]
  - install ppx_enumerate          v0.14.0            [required by ppx_bap]
  - install ppx_expect             v0.14.2            [required by ppx_jane]
  - install ppx_fields_conv        v0.14.2            [required by ppx_bap]
  - install ppx_fixed_literal      v0.14.0            [required by ppx_jane]
  - install ppx_hash               v0.14.0            [required by core_kernel, ppx_bap]
  - install ppx_here               v0.14.0            [required by ppx_bap]
  - install ppx_inline_test        v0.14.1            [required by core_kernel]
  - install ppx_jane               v0.14.0            [required by core_kernel]
  - install ppx_js_style           v0.14.1            [required by ppx_base]
  - install ppx_let                v0.14.0            [required by ppx_jane]
  - install ppx_module_timer       v0.14.0            [required by ppx_jane]
  - install ppx_optcomp            v0.14.3            [required by core_kernel, ppx_bap]
  - install ppx_optional           v0.14.0            [required by ppx_jane]
  - install ppx_pipebang           v0.14.0            [required by ppx_jane]
  - install ppx_sexp_conv          v0.14.3            [required by core_kernel, ppx_bap]
  - install ppx_sexp_message       v0.14.1            [required by core_kernel]
  - install ppx_sexp_value         v0.14.0            [required by ppx_bap]
  - install ppx_stable             v0.14.1            [required by ppx_jane]
  - install ppx_string             v0.14.1            [required by ppx_jane]
  - install ppx_typerep_conv       v0.14.2            [required by ppx_jane]
  - install ppx_variants_conv      v0.14.2            [required by ppx_bap]
  - install ppxlib                 0.25.0~5.00preview [required by ppx_bap]
  - install re                     1.10.4             [required by bap-callgraph-collator]
  - install react                  1.2.2              [required by utop]
  - install regular                2.4.0              [required by bap-std]
  - install result                 1.5                [required by bap-std]
  - install seq                    base               [required by lwt]
  - install sexplib                v0.14.0            [required by core_kernel]
  - install sexplib0               v0.14.0            [required by sexplib, base, bitvec-sexp]
  - install splittable_random      v0.14.0            [required by core_kernel]
  - install stdio                  v0.14.0            [required by bap-main]
  - install stdlib-shims           0.3.0              [required by bap-recipe]
  - install stringext              1.6.0              [required by uri]
  - install time_now               v0.14.0            [required by core_kernel]
  - install topkg                  1.0.5              [required by uuidm]
  - install trie                   1.0.0              [required by mew]
  - install typerep                v0.14.0            [required by core_kernel]
  - install uri                    4.2.0              [required by bap-std]
  - install utop                   2.9.1              [required by bap-std]
  - install uuidm                  0.9.8              [required by bap-std]
  - install variantslib            v0.14.0            [required by core_kernel]
  - install zarith                 1.12               [required by bap-std]
  - install zed                    3.1.0              [required by lambda-term]

The following system packages will first need to be installed:
    clang libgmp-dev m4 pkg-config zlib1g-dev

<><> Handling external dependencies <><><><><><><><><><><><><><><><><><><><><><>

opam believes some required external dependencies are missing. opam can:
> 1. Run apt-get to install them (may need root/sudo access)
  2. Display the recommended apt-get command and wait while you run it manually (e.g. in another terminal)
  3. Attempt installation anyway, and permanently register that this external dependency is present, but not detectable
  4. Abort the installation

[1/2/3/4] 1
+ /usr/bin/sudo "apt-get" "install" "-qq" "-yy" "clang" "libgmp-dev" "m4" "pkg-config" "zlib1g-dev"
- debconf: delaying package configuration, since apt-utils is not installed
- Selecting previously unselected package libpython3.10-minimal:amd64.
- (Reading database ... 
(Reading database ... 5%
(Reading database ... 10%
(Reading database ... 15%
(Reading database ... 20%
(Reading database ... 25%
(Reading database ... 30%
(Reading database ... 35%
(Reading database ... 40%
(Reading database ... 45%
(Reading database ... 50%
(Reading database ... 55%
(Reading database ... 60%
(Reading database ... 65%
(Reading database ... 70%
(Reading database ... 75%
(Reading database ... 80%
(Reading database ... 85%
(Reading database ... 90%
(Reading database ... 95%
(Reading database ... 100%
(Reading database ... 18478 files and directories currently installed.)
- Preparing to unpack .../libpython3.10-minimal_3.10.4-3_amd64.deb ...
- Unpacking libpython3.10-minimal:amd64 (3.10.4-3) ...
- Selecting previously unselected package python3.10-minimal.
- Preparing to unpack .../python3.10-minimal_3.10.4-3_amd64.deb ...
- Unpacking python3.10-minimal (3.10.4-3) ...
- Setting up libpython3.10-minimal:amd64 (3.10.4-3) ...
- Setting up python3.10-minimal (3.10.4-3) ...
- Selecting previously unselected package python3-minimal.
- (Reading database ... 
(Reading database ... 5%
(Reading database ... 10%
(Reading database ... 15%
(Reading database ... 20%
(Reading database ... 25%
(Reading database ... 30%
(Reading database ... 35%
(Reading database ... 40%
(Reading database ... 45%
(Reading database ... 50%
(Reading database ... 55%
(Reading database ... 60%
(Reading database ... 65%
(Reading database ... 70%
(Reading database ... 75%
(Reading database ... 80%
(Reading database ... 85%
(Reading database ... 90%
(Reading database ... 95%
(Reading database ... 100%
(Reading database ... 18772 files and directories currently installed.)
- Preparing to unpack .../0-python3-minimal_3.10.4-1+b1_amd64.deb ...
- Unpacking python3-minimal (3.10.4-1+b1) ...
- Selecting previously unselected package media-types.
- Preparing to unpack .../1-media-types_7.1.0_all.deb ...
- Unpacking media-types (7.1.0) ...
- Preparing to unpack .../2-libatomic1_12.1.0-1_amd64.deb ...
- Unpacking libatomic1:amd64 (12.1.0-1) over (12-20220319-1) ...
- Preparing to unpack .../3-libubsan1_12.1.0-1_amd64.deb ...
- Unpacking libubsan1:amd64 (12.1.0-1) over (12-20220319-1) ...
- Preparing to unpack .../4-libquadmath0_12.1.0-1_amd64.deb ...
- Unpacking libquadmath0:amd64 (12.1.0-1) over (12-20220319-1) ...
- Preparing to unpack .../5-liblsan0_12.1.0-1_amd64.deb ...
- Unpacking liblsan0:amd64 (12.1.0-1) over (12-20220319-1) ...
- Preparing to unpack .../6-libitm1_12.1.0-1_amd64.deb ...
- Unpacking libitm1:amd64 (12.1.0-1) over (12-20220319-1) ...
- Preparing to unpack .../7-libgomp1_12.1.0-1_amd64.deb ...
- Unpacking libgomp1:amd64 (12.1.0-1) over (12-20220319-1) ...
- Preparing to unpack .../8-gcc-12-base_12.1.0-1_amd64.deb ...
- Unpacking gcc-12-base:amd64 (12.1.0-1) over (12-20220319-1) ...
- Setting up gcc-12-base:amd64 (12.1.0-1) ...
- (Reading database ... 
(Reading database ... 5%
(Reading database ... 10%
(Reading database ... 15%
(Reading database ... 20%
(Reading database ... 25%
(Reading database ... 30%
(Reading database ... 35%
(Reading database ... 40%
(Reading database ... 45%
(Reading database ... 50%
(Reading database ... 55%
(Reading database ... 60%
(Reading database ... 65%
(Reading database ... 70%
(Reading database ... 75%
(Reading database ... 80%
(Reading database ... 85%
(Reading database ... 90%
(Reading database ... 95%
(Reading database ... 100%
(Reading database ... 18800 files and directories currently installed.)
- Preparing to unpack .../libgcc-s1_12.1.0-1_amd64.deb ...
- Unpacking libgcc-s1:amd64 (12.1.0-1) over (12-20220319-1) ...
- Setting up libgcc-s1:amd64 (12.1.0-1) ...
- (Reading database ... 
(Reading database ... 5%
(Reading database ... 10%
(Reading database ... 15%
(Reading database ... 20%
(Reading database ... 25%
(Reading database ... 30%
(Reading database ... 35%
(Reading database ... 40%
(Reading database ... 45%
(Reading database ... 50%
(Reading database ... 55%
(Reading database ... 60%
(Reading database ... 65%
(Reading database ... 70%
(Reading database ... 75%
(Reading database ... 80%
(Reading database ... 85%
(Reading database ... 90%
(Reading database ... 95%
(Reading database ... 100%
(Reading database ... 18800 files and directories currently installed.)
- Preparing to unpack .../libcc1-0_12.1.0-1_amd64.deb ...
- Unpacking libcc1-0:amd64 (12.1.0-1) over (12-20220319-1) ...
- Preparing to unpack .../libstdc++6_12.1.0-1_amd64.deb ...
- Unpacking libstdc++6:amd64 (12.1.0-1) over (12-20220319-1) ...
- Setting up libstdc++6:amd64 (12.1.0-1) ...
- Selecting previously unselected package libmpdec3:amd64.
- (Reading database ... 
(Reading database ... 5%
(Reading database ... 10%
(Reading database ... 15%
(Reading database ... 20%
(Reading database ... 25%
(Reading database ... 30%
(Reading database ... 35%
(Reading database ... 40%
(Reading database ... 45%
(Reading database ... 50%
(Reading database ... 55%
(Reading database ... 60%
(Reading database ... 65%
(Reading database ... 70%
(Reading database ... 75%
(Reading database ... 80%
(Reading database ... 85%
(Reading database ... 90%
(Reading database ... 95%
(Reading database ... 100%
(Reading database ... 18800 files and directories currently installed.)
- Preparing to unpack .../libmpdec3_2.5.1-2_amd64.deb ...
- Unpacking libmpdec3:amd64 (2.5.1-2) ...
- Preparing to unpack .../libncurses6_6.3+20220423-2_amd64.deb ...
- Unpacking libncurses6:amd64 (6.3+20220423-2) over (6.3-2) ...
- Preparing to unpack .../libncursesw6_6.3+20220423-2_amd64.deb ...
- Unpacking libncursesw6:amd64 (6.3+20220423-2) over (6.3-2) ...
- Preparing to unpack .../libtinfo6_6.3+20220423-2_amd64.deb ...
- Unpacking libtinfo6:amd64 (6.3+20220423-2) over (6.3-2) ...
- Setting up libtinfo6:amd64 (6.3+20220423-2) ...
- Selecting previously unselected package libpython3.10-stdlib:amd64.
- (Reading database ... 
(Reading database ... 5%
(Reading database ... 10%
(Reading database ... 15%
(Reading database ... 20%
(Reading database ... 25%
(Reading database ... 30%
(Reading database ... 35%
(Reading database ... 40%
(Reading database ... 45%
(Reading database ... 50%
(Reading database ... 55%
(Reading database ... 60%
(Reading database ... 65%
(Reading database ... 70%
(Reading database ... 75%
(Reading database ... 80%
(Reading database ... 85%
(Reading database ... 90%
(Reading database ... 95%
(Reading database ... 100%
(Reading database ... 18807 files and directories currently installed.)
- Preparing to unpack .../libpython3.10-stdlib_3.10.4-3_amd64.deb ...
- Unpacking libpython3.10-stdlib:amd64 (3.10.4-3) ...
- Selecting previously unselected package python3.10.
- Preparing to unpack .../python3.10_3.10.4-3_amd64.deb ...
- Unpacking python3.10 (3.10.4-3) ...
- Selecting previously unselected package libpython3-stdlib:amd64.
- Preparing to unpack .../libpython3-stdlib_3.10.4-1+b1_amd64.deb ...
- Unpacking libpython3-stdlib:amd64 (3.10.4-1+b1) ...
- Setting up python3-minimal (3.10.4-1+b1) ...
- Selecting previously unselected package python3.
- (Reading database ... 
(Reading database ... 5%
(Reading database ... 10%
(Reading database ... 15%
(Reading database ... 20%
(Reading database ... 25%
(Reading database ... 30%
(Reading database ... 35%
(Reading database ... 40%
(Reading database ... 45%
(Reading database ... 50%
(Reading database ... 55%
(Reading database ... 60%
(Reading database ... 65%
(Reading database ... 70%
(Reading database ... 75%
(Reading database ... 80%
(Reading database ... 85%
(Reading database ... 90%
(Reading database ... 95%
(Reading database ... 100%
(Reading database ... 19175 files and directories currently installed.)
- Preparing to unpack .../00-python3_3.10.4-1+b1_amd64.deb ...
- Unpacking python3 (3.10.4-1+b1) ...
- Selecting previously unselected package libpipeline1:amd64.
- Preparing to unpack .../01-libpipeline1_1.5.6-1_amd64.deb ...
- Unpacking libpipeline1:amd64 (1.5.6-1) ...
- Selecting previously unselected package binfmt-support.
- Preparing to unpack .../02-binfmt-support_2.2.1-2_amd64.deb ...
- Unpacking binfmt-support (2.2.1-2) ...
- Selecting previously unselected package libicu71:amd64.
- Preparing to unpack .../03-libicu71_71.1-3_amd64.deb ...
- Unpacking libicu71:amd64 (71.1-3) ...
- Selecting previously unselected package libxml2:amd64.
- Preparing to unpack .../04-libxml2_2.9.14+dfsg-1_amd64.deb ...
- Unpacking libxml2:amd64 (2.9.14+dfsg-1) ...
- Selecting previously unselected package libz3-4:amd64.
- Preparing to unpack .../05-libz3-4_4.8.12-1+b1_amd64.deb ...
- Unpacking libz3-4:amd64 (4.8.12-1+b1) ...
- Selecting previously unselected package libllvm13:amd64.
- Preparing to unpack .../06-libllvm13_1%3a13.0.1-4_amd64.deb ...
- Unpacking libllvm13:amd64 (1:13.0.1-4) ...
- Selecting previously unselected package libclang-cpp13.
- Preparing to unpack .../07-libclang-cpp13_1%3a13.0.1-4_amd64.deb ...
- Unpacking libclang-cpp13 (1:13.0.1-4) ...
- Selecting previously unselected package libgc1:amd64.
- Preparing to unpack .../08-libgc1_1%3a8.0.6-1.1_amd64.deb ...
- Unpacking libgc1:amd64 (1:8.0.6-1.1) ...
- Selecting previously unselected package libobjc4:amd64.
- Preparing to unpack .../09-libobjc4_12.1.0-1_amd64.deb ...
- Unpacking libobjc4:amd64 (12.1.0-1) ...
- Selecting previously unselected package libobjc-11-dev:amd64.
- Preparing to unpack .../10-libobjc-11-dev_11.3.0-1_amd64.deb ...
- Unpacking libobjc-11-dev:amd64 (11.3.0-1) ...
- Selecting previously unselected package libc6-i386.
- Preparing to unpack .../11-libc6-i386_2.33-7_amd64.deb ...
- Unpacking libc6-i386 (2.33-7) ...
- Selecting previously unselected package lib32gcc-s1.
- Preparing to unpack .../12-lib32gcc-s1_12.1.0-1_amd64.deb ...
- Unpacking lib32gcc-s1 (12.1.0-1) ...
- Selecting previously unselected package lib32stdc++6.
- Preparing to unpack .../13-lib32stdc++6_12.1.0-1_amd64.deb ...
- Unpacking lib32stdc++6 (12.1.0-1) ...
- Selecting previously unselected package libclang-common-13-dev.
- Preparing to unpack .../14-libclang-common-13-dev_1%3a13.0.1-4_amd64.deb ...
- Unpacking libclang-common-13-dev (1:13.0.1-4) ...
- Selecting previously unselected package llvm-13-linker-tools.
- Preparing to unpack .../15-llvm-13-linker-tools_1%3a13.0.1-4_amd64.deb ...
- Unpacking llvm-13-linker-tools (1:13.0.1-4) ...
- Selecting previously unselected package libclang1-13.
- Preparing to unpack .../16-libclang1-13_1%3a13.0.1-4_amd64.deb ...
- Unpacking libclang1-13 (1:13.0.1-4) ...
- Selecting previously unselected package clang-13.
- Preparing to unpack .../17-clang-13_1%3a13.0.1-4_amd64.deb ...
- Unpacking clang-13 (1:13.0.1-4) ...
- Selecting previously unselected package clang.
- Preparing to unpack .../18-clang_1%3a13.0-54_amd64.deb ...
- Unpacking clang (1:13.0-54) ...
- Selecting previously unselected package icu-devtools.
- Preparing to unpack .../19-icu-devtools_71.1-3_amd64.deb ...
- Unpacking icu-devtools (71.1-3) ...
- Selecting previously unselected package libffi-dev:amd64.
- Preparing to unpack .../20-libffi-dev_3.4.2-4_amd64.deb ...
- Unpacking libffi-dev:amd64 (3.4.2-4) ...
- Selecting previously unselected package libglib2.0-0:amd64.
- Preparing to unpack .../21-libglib2.0-0_2.72.1-1_amd64.deb ...
- Unpacking libglib2.0-0:amd64 (2.72.1-1) ...
- Selecting previously unselected package libglib2.0-data.
- Preparing to unpack .../22-libglib2.0-data_2.72.1-1_all.deb ...
- Unpacking libglib2.0-data (2.72.1-1) ...
- Selecting previously unselected package libgmpxx4ldbl:amd64.
- Preparing to unpack .../23-libgmpxx4ldbl_2%3a6.2.1+dfsg-3_amd64.deb ...
- Unpacking libgmpxx4ldbl:amd64 (2:6.2.1+dfsg-3) ...
- Selecting previously unselected package libgmp-dev:amd64.
- Preparing to unpack .../24-libgmp-dev_2%3a6.2.1+dfsg-3_amd64.deb ...
- Unpacking libgmp-dev:amd64 (2:6.2.1+dfsg-3) ...
- Selecting previously unselected package libicu-dev:amd64.
- Preparing to unpack .../25-libicu-dev_71.1-3_amd64.deb ...
- Unpacking libicu-dev:amd64 (71.1-3) ...
- Selecting previously unselected package libncurses-dev:amd64.
- Preparing to unpack .../26-libncurses-dev_6.3+20220423-2_amd64.deb ...
- Unpacking libncurses-dev:amd64 (6.3+20220423-2) ...
- Selecting previously unselected package libpfm4:amd64.
- Preparing to unpack .../27-libpfm4_4.11.1+git32-gd0b85fb-1_amd64.deb ...
- Unpacking libpfm4:amd64 (4.11.1+git32-gd0b85fb-1) ...
- Selecting previously unselected package libsigsegv2:amd64.
- Preparing to unpack .../28-libsigsegv2_2.14-1_amd64.deb ...
- Unpacking libsigsegv2:amd64 (2.14-1) ...
- Selecting previously unselected package libtinfo-dev:amd64.
- Preparing to unpack .../29-libtinfo-dev_6.3+20220423-2_amd64.deb ...
- Unpacking libtinfo-dev:amd64 (6.3+20220423-2) ...
- Selecting previously unselected package libxml2-dev:amd64.
- Preparing to unpack .../30-libxml2-dev_2.9.14+dfsg-1_amd64.deb ...
- Unpacking libxml2-dev:amd64 (2.9.14+dfsg-1) ...
- Selecting previously unselected package libyaml-0-2:amd64.
- Preparing to unpack .../31-libyaml-0-2_0.2.2-1_amd64.deb ...
- Unpacking libyaml-0-2:amd64 (0.2.2-1) ...
- Selecting previously unselected package libz3-dev:amd64.
- Preparing to unpack .../32-libz3-dev_4.8.12-1+b1_amd64.deb ...
- Unpacking libz3-dev:amd64 (4.8.12-1+b1) ...
- Selecting previously unselected package llvm-13-runtime.
- Preparing to unpack .../33-llvm-13-runtime_1%3a13.0.1-4_amd64.deb ...
- Unpacking llvm-13-runtime (1:13.0.1-4) ...
- Selecting previously unselected package llvm-13.
- Preparing to unpack .../34-llvm-13_1%3a13.0.1-4_amd64.deb ...
- Unpacking llvm-13 (1:13.0.1-4) ...
- Selecting previously unselected package python3-pkg-resources.
- Preparing to unpack .../35-python3-pkg-resources_59.6.0-1.2_all.deb ...
- Unpacking python3-pkg-resources (59.6.0-1.2) ...
- Selecting previously unselected package python3-pygments.
- Preparing to unpack .../36-python3-pygments_2.11.2+dfsg-2_all.deb ...
- Unpacking python3-pygments (2.11.2+dfsg-2) ...
- Selecting previously unselected package python3-yaml.
- Preparing to unpack .../37-python3-yaml_5.4.1-1+b1_amd64.deb ...
- Unpacking python3-yaml (5.4.1-1+b1) ...
- Selecting previously unselected package llvm-13-tools.
- Preparing to unpack .../38-llvm-13-tools_1%3a13.0.1-4_amd64.deb ...
- Unpacking llvm-13-tools (1:13.0.1-4) ...
- Selecting previously unselected package llvm-13-dev.
- Preparing to unpack .../39-llvm-13-dev_1%3a13.0.1-4_amd64.deb ...
- Unpacking llvm-13-dev (1:13.0.1-4) ...
- Selecting previously unselected package m4.
- Preparing to unpack .../40-m4_1.4.18-5_amd64.deb ...
- Unpacking m4 (1.4.18-5) ...
- Selecting previously unselected package pkg-config.
- Preparing to unpack .../41-pkg-config_0.29.2-1_amd64.deb ...
- Unpacking pkg-config (0.29.2-1) ...
- Selecting previously unselected package shared-mime-info.
- Preparing to unpack .../42-shared-mime-info_2.2-1_amd64.deb ...
- Unpacking shared-mime-info (2.2-1) ...
- Selecting previously unselected package xdg-user-dirs.
- Preparing to unpack .../43-xdg-user-dirs_0.17-2_amd64.deb ...
- Unpacking xdg-user-dirs (0.17-2) ...
- Selecting previously unselected package zlib1g-dev:amd64.
- Preparing to unpack .../44-zlib1g-dev_1%3a1.2.11.dfsg-4_amd64.deb ...
- Unpacking zlib1g-dev:amd64 (1:1.2.11.dfsg-4) ...
- Setting up media-types (7.1.0) ...
- Setting up libpipeline1:amd64 (1.5.6-1) ...
- Setting up libicu71:amd64 (71.1-3) ...
- Setting up xdg-user-dirs (0.17-2) ...
- Setting up libyaml-0-2:amd64 (0.2.2-1) ...
- Setting up libglib2.0-0:amd64 (2.72.1-1) ...
- No schema files found: doing nothing.
- Setting up libgomp1:amd64 (12.1.0-1) ...
- Setting up libffi-dev:amd64 (3.4.2-4) ...
- Setting up libz3-4:amd64 (4.8.12-1+b1) ...
- Setting up libglib2.0-data (2.72.1-1) ...
- Setting up libgmpxx4ldbl:amd64 (2:6.2.1+dfsg-3) ...
- Setting up libpfm4:amd64 (4.11.1+git32-gd0b85fb-1) ...
- Setting up libncurses6:amd64 (6.3+20220423-2) ...
- Setting up libsigsegv2:amd64 (2.14-1) ...
- Setting up libquadmath0:amd64 (12.1.0-1) ...
- Setting up libatomic1:amd64 (12.1.0-1) ...
- Setting up binfmt-support (2.2.1-2) ...
- invoke-rc.d: could not determine current runlevel
- invoke-rc.d: policy-rc.d denied execution of restart.
- Setting up icu-devtools (71.1-3) ...
- Setting up pkg-config (0.29.2-1) ...
- Setting up libncursesw6:amd64 (6.3+20220423-2) ...
- Setting up libgc1:amd64 (1:8.0.6-1.1) ...
- Setting up libubsan1:amd64 (12.1.0-1) ...
- Setting up zlib1g-dev:amd64 (1:1.2.11.dfsg-4) ...
- Setting up libmpdec3:amd64 (2.5.1-2) ...
- Setting up libc6-i386 (2.33-7) ...
- Setting up libicu-dev:amd64 (71.1-3) ...
- Setting up libxml2:amd64 (2.9.14+dfsg-1) ...
- Setting up libcc1-0:amd64 (12.1.0-1) ...
- Setting up liblsan0:amd64 (12.1.0-1) ...
- Setting up libitm1:amd64 (12.1.0-1) ...
- Setting up libz3-dev:amd64 (4.8.12-1+b1) ...
- Setting up libncurses-dev:amd64 (6.3+20220423-2) ...
- Setting up libgmp-dev:amd64 (2:6.2.1+dfsg-3) ...
- Setting up m4 (1.4.18-5) ...
- Setting up libobjc4:amd64 (12.1.0-1) ...
- Setting up libpython3.10-stdlib:amd64 (3.10.4-3) ...
- Setting up libxml2-dev:amd64 (2.9.14+dfsg-1) ...
- Setting up lib32gcc-s1 (12.1.0-1) ...
- Setting up lib32stdc++6 (12.1.0-1) ...
- Setting up shared-mime-info (2.2-1) ...
- Setting up libllvm13:amd64 (1:13.0.1-4) ...
- Setting up llvm-13-runtime (1:13.0.1-4) ...
- Setting up libclang-common-13-dev (1:13.0.1-4) ...
- Setting up libpython3-stdlib:amd64 (3.10.4-1+b1) ...
- Setting up libtinfo-dev:amd64 (6.3+20220423-2) ...
- Setting up python3.10 (3.10.4-3) ...
- Setting up libobjc-11-dev:amd64 (11.3.0-1) ...
- Setting up python3 (3.10.4-1+b1) ...
- running python rtupdate hooks for python3.10...
- running python post-rtupdate hooks for python3.10...
- Setting up llvm-13-linker-tools (1:13.0.1-4) ...
- Setting up libclang1-13 (1:13.0.1-4) ...
- Setting up libclang-cpp13 (1:13.0.1-4) ...
- Setting up python3-pkg-resources (59.6.0-1.2) ...
- Setting up clang-13 (1:13.0.1-4) ...
- Setting up llvm-13 (1:13.0.1-4) ...
- Setting up python3-yaml (5.4.1-1+b1) ...
- Setting up python3-pygments (2.11.2+dfsg-2) ...
- Setting up clang (1:13.0-54) ...
- Setting up llvm-13-tools (1:13.0.1-4) ...
- Setting up llvm-13-dev (1:13.0.1-4) ...
- Processing triggers for libc-bin (2.33-7) ...

<><> Processing actions <><><><><><><><><><><><><><><><><><><><><><><><><><><><>
Processing  1/331:
Processing  2/331:
Processing  3/331:
-> retrieved angstrom.0.15.0  (cached)
Processing  4/331:
Processing  5/331:
-> retrieved base.v0.14.3  (cached)
Processing  6/331:
-> retrieved bap-build.2.4.0, bap-bundle.2.4.0, bap-callgraph-collator.2.4.0, bap-core-theory.2.4.0, bap-future.2.4.0, bap-knowledge.2.4.0, bap-main.2.4.0, bap-plugins.2.4.0, bap-recipe.2.4.0, bap-relation.2.4.0, bap-std.2.4.0, bitvec.2.4.0, bitvec-binprot.2.4.0, bitvec-order.2.4.0, bitvec-sexp.2.4.0, graphlib.2.4.0, monads.2.4.0, ogre.2.4.0, regular.2.4.0  (cached)
Processing  7/331:
-> retrieved base_bigstring.v0.14.0  (cached)
Processing  8/331:
-> retrieved base_quickcheck.v0.14.1  (cached)
Processing  9/331:
-> retrieved bigarray-compat.1.1.0  (cached)
Processing 10/331:
-> retrieved bigstringaf.0.9.0  (cached)
Processing 11/331:
-> retrieved bin_prot.v0.14.0  (cached)
Processing 12/331:
-> retrieved camlzip.1.11  (cached)
Processing 13/331:
-> retrieved charInfo_width.1.1.0  (cached)
Processing 14/331:
Processing 15/331:
Processing 16/331:
Processing 17/331:
Processing 18/331:
Processing 19/331:
Processing 20/331:
Processing 21/331:
Processing 22/331: [conf-clang: clang]
Processing 23/331: [conf-clang: clang] [conf-gmp: sh]
Processing 24/331: [conf-clang: clang] [conf-gmp: sh] [conf-m4: sh echo | m4]
Processing 25/331: [conf-clang: clang] [conf-gmp: sh] [conf-m4: sh echo | m4] [conf-perl: perl]
Processing 26/331: [conf-clang: clang] [conf-gmp: sh] [conf-m4: sh echo | m4] [conf-perl: perl] [conf-pkg-config: pkg-config]
Processing 27/331: [conf-clang: clang] [conf-gmp: sh] [conf-m4: sh echo | m4] [conf-perl: perl] [conf-pkg-config: pkg-config] [conf-which: which which]
-> retrieved cmdliner.1.1.1  (cached)
Processing 28/331: [conf-clang: clang] [conf-gmp: sh] [conf-m4: sh echo | m4] [conf-perl: perl] [conf-pkg-config: pkg-config] [conf-which: which which]
Processing 29/331: [cmdliner: make all] [conf-clang: clang] [conf-gmp: sh] [conf-m4: sh echo | m4] [conf-perl: perl] [conf-pkg-config: pkg-config] [conf-which: which which]
+ /home/opam/.opam/opam-init/hooks/sandbox.sh "build" "clang" "--version" (CWD=/home/opam/.opam/5.0/.opam-switch/build/conf-clang.1)
- Debian clang version 13.0.1-4
- Target: x86_64-pc-linux-gnu
- Thread model: posix
- InstalledDir: /usr/bin
-> compiled  conf-clang.1
Processing 29/331: [cmdliner: make all] [conf-gmp: sh] [conf-m4: sh echo | m4] [conf-perl: perl] [conf-pkg-config: pkg-config] [conf-which: which which]
-> installed conf-clang.1
Processing 30/331: [cmdliner: make all] [conf-gmp: sh] [conf-m4: sh echo | m4] [conf-perl: perl] [conf-pkg-config: pkg-config] [conf-which: which which]
+ /home/opam/.opam/opam-init/hooks/sandbox.sh "build" "sh" "-exc" "cc -c $CFLAGS -I/usr/local/include test.c" (CWD=/home/opam/.opam/5.0/.opam-switch/build/conf-gmp.4)
- + cc -c -I/usr/local/include test.c
-> compiled  conf-gmp.4
Processing 30/331: [cmdliner: make all] [conf-m4: sh echo | m4] [conf-perl: perl] [conf-pkg-config: pkg-config] [conf-which: which which]
-> installed conf-gmp.4
Processing 31/331: [cmdliner: make all] [conf-m4: sh echo | m4] [conf-perl: perl] [conf-pkg-config: pkg-config] [conf-which: which which]
+ /home/opam/.opam/opam-init/hooks/sandbox.sh "build" "sh" "-exc" "echo | m4" (CWD=/home/opam/.opam/5.0/.opam-switch/build/conf-m4.1)
- + echo
- + m4
- 
-> compiled  conf-m4.1
Processing 31/331: [cmdliner: make all] [conf-perl: perl] [conf-pkg-config: pkg-config] [conf-which: which which]
-> installed conf-m4.1
Processing 32/331: [cmdliner: make all] [conf-perl: perl] [conf-pkg-config: pkg-config] [conf-which: which which]
+ /home/opam/.opam/opam-init/hooks/sandbox.sh "build" "perl" "--version" (CWD=/home/opam/.opam/5.0/.opam-switch/build/conf-perl.2)
- 
- This is perl 5, version 34, subversion 0 (v5.34.0) built for x86_64-linux-gnu-thread-multi
- (with 51 registered patches, see perl -V for more detail)
- 
- Copyright 1987-2021, Larry Wall
- 
- Perl may be copied only under the terms of either the Artistic License or the
- GNU General Public License, which may be found in the Perl 5 source kit.
- 
- Complete documentation for Perl, including FAQ lists, should be found on
- this system using "man perl" or "perldoc perl".  If you have access to the
- Internet, point your browser at http://www.perl.org/, the Perl Home Page.
- 
-> compiled  conf-perl.2
Processing 32/331: [cmdliner: make all] [conf-pkg-config: pkg-config] [conf-which: which which]
-> installed conf-perl.2
Processing 33/331: [cmdliner: make all] [conf-pkg-config: pkg-config] [conf-which: which which]
+ /home/opam/.opam/opam-init/hooks/sandbox.sh "build" "pkg-config" "--help" (CWD=/home/opam/.opam/5.0/.opam-switch/build/conf-pkg-config.2)
- Usage:
-   pkg-config [OPTION?]
- 
- Help Options:
-   -h, --help                              Show help options
- 
- Application Options:
-   --version                               output version of pkg-config
-   --modversion                            output version for package
-   --atleast-pkgconfig-version=VERSION     require given version of pkg-config
-   --libs                                  output all linker flags
-   --static                                output linker flags for static linking
-   --short-errors                          print short errors
-   --libs-only-l                           output -l flags
-   --libs-only-other                       output other libs (e.g. -pthread)
-   --libs-only-L                           output -L flags
-   --cflags                                output all pre-processor and compiler flags
-   --cflags-only-I                         output -I flags
-   --cflags-only-other                     output cflags not covered by the cflags-only-I option
-   --variable=NAME                         get the value of variable named NAME
-   --define-variable=NAME=VALUE            set variable NAME to VALUE
-   --exists                                return 0 if the module(s) exist
-   --print-variables                       output list of variables defined by the module
-   --uninstalled                           return 0 if the uninstalled version of one or more module(s) or their dependencies will be used
-   --atleast-version=VERSION               return 0 if the module is at least version VERSION
-   --exact-version=VERSION                 return 0 if the module is at exactly version VERSION
-   --max-version=VERSION                   return 0 if the module is at no newer than version VERSION
-   --list-all                              list all known packages
-   --debug                                 show verbose debug information
-   --print-errors                          show verbose information about missing or conflicting packages (default unless --exists or --atleast/exact/max-version given on the command line)
-   --silence-errors                        be silent about errors (default when --exists or --atleast/exact/max-version given on the command line)
-   --errors-to-stdout                      print errors from --print-errors to stdout not stderr
-   --print-provides                        print which packages the package provides
-   --print-requires                        print which packages the package requires
-   --print-requires-private                print which packages the package requires for static linking
-   --validate                              validate a package's .pc file
-   --define-prefix                         try to override the value of prefix for each .pc file found with a guesstimated value based on the location of the .pc file
-   --dont-define-prefix                    don't try to override the value of prefix for each .pc file found with a guesstimated value based on the location of the .pc file
-   --prefix-variable=PREFIX                set the name of the variable that pkg-config automatically sets
- 
-> compiled  conf-pkg-config.2
Processing 33/331: [cmdliner: make all] [conf-which: which which]
Processing 34/331: [cmdliner: make all] [conf-which: which which] [conf-pkg-config: mkdir]
-> retrieved camomile.1.0.2  (cached)
Processing 35/331: [cmdliner: make all] [conf-which: which which] [conf-pkg-config: mkdir]
-> retrieved core_kernel.v0.14.2  (cached)
Processing 36/331: [cmdliner: make all] [conf-which: which which] [conf-pkg-config: mkdir]
+ /home/opam/.opam/opam-init/hooks/sandbox.sh "build" "which" "which" (CWD=/home/opam/.opam/5.0/.opam-switch/build/conf-which.1)
- /usr/bin/which
-> compiled  conf-which.1
Processing 36/331: [cmdliner: make all] [conf-pkg-config: mkdir]
-> retrieved cppo.1.6.8  (cached)
Processing 37/331: [cmdliner: make all] [conf-pkg-config: mkdir]
+ /home/opam/.opam/opam-init/hooks/sandbox.sh "install" "mkdir" "-p" "/home/opam/.opam/5.0/lib/pkgconfig" (CWD=/home/opam/.opam/5.0/.opam-switch/build/conf-pkg-config.2)
-> installed conf-pkg-config.2
Processing 37/331: [cmdliner: make all]
Processing 38/331: [cmdliner: make all] [conf-zlib: pkg-config zlib]
-> installed conf-which.1
Processing 39/331: [cmdliner: make all] [conf-zlib: pkg-config zlib]
-> retrieved csexp.1.5.1  (cached)
Processing 40/331: [cmdliner: make all] [conf-zlib: pkg-config zlib]
-> retrieved fieldslib.v0.14.0  (cached)
Processing 41/331: [cmdliner: make all] [conf-zlib: pkg-config zlib]
+ /home/opam/.opam/opam-init/hooks/sandbox.sh "build" "pkg-config" "zlib" (CWD=/home/opam/.opam/5.0/.opam-switch/build/conf-zlib.1)
-> compiled  conf-zlib.1
Processing 41/331: [cmdliner: make all]
-> installed conf-zlib.1
Processing 42/331: [cmdliner: make all]
-> retrieved fileutils.0.6.3  (cached)
Processing 43/331: [cmdliner: make all]
-> retrieved jane-street-headers.v0.14.0  (cached)
Processing 44/331: [cmdliner: make all]
-> retrieved jst-config.v0.14.1  (cached)
Processing 45/331: [cmdliner: make all]
-> retrieved lambda-term.3.2.0  (cached)
Processing 46/331: [cmdliner: make all]
-> retrieved lwt_log.1.1.1  (cached)
Processing 47/331: [cmdliner: make all]
-> retrieved lwt.5.5.0, lwt_react.1.1.5  (cached)
Processing 48/331: [cmdliner: make all]
-> retrieved mew.0.1.0  (cached)
Processing 49/331: [cmdliner: make all]
-> retrieved dune.3.1.1, dune-configurator.3.1.1  (cached)
Processing 50/331: [cmdliner: make all]
Processing 51/331: [cmdliner: make all] [dune: ocaml bootstrap.ml]
+ /home/opam/.opam/opam-init/hooks/sandbox.sh "build" "make" "all" "PREFIX=/home/opam/.opam/5.0" (CWD=/home/opam/.opam/5.0/.opam-switch/build/cmdliner.1.1.1)
- ocaml build.ml cma
- ocaml build.ml cmxa
- ocaml build.ml cmxs
-> compiled  cmdliner.1.1.1
Processing 51/331: [dune: ocaml bootstrap.ml]
Processing 52/331: [dune: ocaml bootstrap.ml] [cmdliner: make install]
-> retrieved mew_vi.0.5.0  (cached)
Processing 53/331: [dune: ocaml bootstrap.ml] [cmdliner: make install]
-> retrieved mmap.1.2.0  (cached)
Processing 54/331: [dune: ocaml bootstrap.ml] [cmdliner: make install]
-> retrieved num.1.4  (cached)
Processing 55/331: [dune: ocaml bootstrap.ml] [cmdliner: make install]
+ /home/opam/.opam/opam-init/hooks/sandbox.sh "install" "make" "install" "LIBDIR=/home/opam/.opam/5.0/lib/cmdliner" "DOCDIR=/home/opam/.opam/5.0/doc/cmdliner" (CWD=/home/opam/.opam/5.0/.opam-switch/build/cmdliner.1.1.1)
- install -d /home/opam/.opam/5.0/lib/cmdliner
- install pkg/META _build/cmdliner.mli _build/cmdliner.cmi _build/cmdliner.cmti /home/opam/.opam/5.0/lib/cmdliner
- install cmdliner.opam /home/opam/.opam/5.0/lib/cmdliner/opam
- install _build/cmdliner.cma /home/opam/.opam/5.0/lib/cmdliner
- install _build/cmdliner.cmxa _build/cmdliner.a _build/cmdliner.cmx _build/cmdliner_arg.cmx _build/cmdliner_base.cmx _build/cmdliner_cline.cmx _build/cmdliner_cmd.cmx _build/cmdliner_docgen.cmx _build/cmdliner_eval.cmx _build/cmdliner_exit.cmx _build/cmdliner_info.cmx _build/cmdliner_manpage.cmx _build/cmdliner_msg.cmx _build/cmdliner_term.cmx _build/cmdliner_term_deprecated.cmx _build/cmdliner_trie.cmx \
-   /home/opam/.opam/5.0/lib/cmdliner
- install _build/cmdliner.cmxs /home/opam/.opam/5.0/lib/cmdliner
Processing 55/331: [dune: ocaml bootstrap.ml] [cmdliner: make install-doc]
-> retrieved ocaml-compiler-libs.v0.12.4  (cached)
Processing 56/331: [dune: ocaml bootstrap.ml] [cmdliner: make install-doc]
-> retrieved oasis.0.4.11  (cached)
Processing 57/331: [dune: ocaml bootstrap.ml] [cmdliner: make install-doc]
-> retrieved ocaml-syntax-shims.1.0.0  (cached)
Processing 58/331: [dune: ocaml bootstrap.ml] [cmdliner: make install-doc]
+ /home/opam/.opam/opam-init/hooks/sandbox.sh "install" "make" "install-doc" "LIBDIR=/home/opam/.opam/5.0/lib/cmdliner" "DOCDIR=/home/opam/.opam/5.0/doc/cmdliner" (CWD=/home/opam/.opam/5.0/.opam-switch/build/cmdliner.1.1.1)
- install -d /home/opam/.opam/5.0/doc/cmdliner/odoc-pages
- install CHANGES.md LICENSE.md README.md /home/opam/.opam/5.0/doc/cmdliner
- install doc/index.mld doc/cli.mld doc/examples.mld doc/tutorial.mld \
-            doc/tool_man.mld /home/opam/.opam/5.0/doc/cmdliner/odoc-pages
-> installed cmdliner.1.1.1
Processing 58/331: [dune: ocaml bootstrap.ml]
-> retrieved ocamlbuild.0.14.1  (cached)
Processing 59/331: [dune: ocaml bootstrap.ml]
Processing 60/331: [dune: ocaml bootstrap.ml] [ocamlbuild: make configure.make]
-> retrieved ocamlfind.1.9.3  (cached)
Processing 61/331: [dune: ocaml bootstrap.ml] [ocamlbuild: make configure.make]
Processing 62/331: [dune: ocaml bootstrap.ml] [ocamlbuild: make configure.make] [ocamlfind: ./configure]
-> retrieved ocamlgraph.2.0.0  (cached)
Processing 63/331: [dune: ocaml bootstrap.ml] [ocamlbuild: make configure.make] [ocamlfind: ./configure]
-> retrieved ocamlify.0.0.1  (cached)
Processing 64/331: [dune: ocaml bootstrap.ml] [ocamlbuild: make configure.make] [ocamlfind: ./configure]
+ /home/opam/.opam/opam-init/hooks/sandbox.sh "build" "make" "-f" "configure.make" "all" "OCAMLBUILD_PREFIX=/home/opam/.opam/5.0" "OCAMLBUILD_BINDIR=/home/opam/.opam/5.0/bin" "OCAMLBUILD_LIBDIR=/home/opam/.opam/5.0/lib" "OCAMLBUILD_MANDIR=/home/opam/.opam/5.0/man" "OCAML_NATIVE=true" "OCAML_NATIVE_TOOLS=true" (CWD=/home/opam/.opam/5.0/.opam-switch/build/ocamlbuild.0.14.1)
- (echo "# This file was generated from configure.make"; \
- echo ;\
- echo "OCAML_PREFIX="; \
- echo "OCAML_BINDIR=/home/opam/.opam/5.0/bin"; \
- echo "OCAML_LIBDIR=/home/opam/.opam/5.0/lib/ocaml"; \
- echo "OCAML_MANDIR=/home/opam/.opam/5.0/man"; \
- echo ;\
- echo "EXT_OBJ=.o"; \
- echo "EXT_ASM=.s"; \
- echo "EXT_LIB=.a"; \
- echo "EXT_DLL=.so"; \
- echo "EXE="; \
- echo ;\
- echo "OCAML_NATIVE=true"; \
- echo "OCAML_NATIVE_TOOLS=true"; \
- echo "NATDYNLINK=true"; \
- echo "SUPPORT_SHARED_LIBRARIES=true"; \
- echo ;\
- echo "PREFIX=/home/opam/.opam/5.0"; \
- echo "BINDIR=/home/opam/.opam/5.0/bin"; \
- echo "LIBDIR=/home/opam/.opam/5.0/lib"; \
- echo "MANDIR=/home/opam/.opam/5.0/man"; \
- ) > Makefile.config
- (echo "(* This file was generated from ../configure.make *)"; \
- echo ;\
- echo 'let bindir = "/home/opam/.opam/5.0/bin"'; \
- echo 'let libdir = "/home/opam/.opam/5.0/lib"'; \
- echo 'let ocaml_libdir = "/home/opam/.opam/5.0/lib/ocaml"'; \
- echo 'let libdir_abs = "/home/opam/.opam/5.0/lib"'; \
- echo 'let ocaml_native = true'; \
- echo 'let ocaml_native_tools = true'; \
- echo 'let supports_shared_libraries = true';\
- echo 'let a = "a"'; \
- echo 'let o = "o"'; \
- echo 'let so = "so"'; \
- echo 'let ext_dll = ".so"'; \
- echo 'let exe = ""'; \
- echo 'let version = "0.14.1"'; \
- ) > src/ocamlbuild_config.ml
Processing 64/331: [dune: ocaml bootstrap.ml] [ocamlbuild: make check-if-preinstalled] [ocamlfind: ./configure]
-> retrieved ocamlmod.0.0.9  (cached)
Processing 65/331: [dune: ocaml bootstrap.ml] [ocamlbuild: make check-if-preinstalled] [ocamlfind: ./configure]
-> retrieved ocplib-endian.1.2  (cached)
Processing 66/331: [dune: ocaml bootstrap.ml] [ocamlbuild: make check-if-preinstalled] [ocamlfind: ./configure]
-> retrieved octavius.1.2.2  (cached)
Processing 67/331: [dune: ocaml bootstrap.ml] [ocamlbuild: make check-if-preinstalled] [ocamlfind: ./configure]
-> retrieved parsexp.v0.14.2  (cached)
Processing 68/331: [dune: ocaml bootstrap.ml] [ocamlbuild: make check-if-preinstalled] [ocamlfind: ./configure]
+ /home/opam/.opam/opam-init/hooks/sandbox.sh "build" "./configure" "-bindir" "/home/opam/.opam/5.0/bin" "-sitelib" "/home/opam/.opam/5.0/lib" "-mandir" "/home/opam/.opam/5.0/man" "-config" "/home/opam/.opam/5.0/lib/findlib.conf" "-no-custom" "-no-camlp4" (CWD=/home/opam/.opam/5.0/.opam-switch/build/ocamlfind.1.9.3)
- Welcome to findlib version 1.9.3
- Configuring core...
- Checking for #remove_directory...
- Testing threading model...
- systhread_supported: true
- Testing DLLs...
- Testing whether ppxopt can be supported...
- Checking for ocamlc -opaque...
- Querying installation: META list not found
- make install will double-check installed META files
- Configuring libraries...
- unix: found
- bigarray: not present (possible since 4.08)
- compiler-libs: found
- dbm: not present (normal since 4.00)
- graphics: not present (normal since 4.09)
- num: not present (normal since 4.06)
- ocamlbuild: not present (normal since 4.03)
- ocamldoc: found
- raw_spacetime: not present (normal since 4.12)
- threads: found
- str: found
- labltk: not present (normal since 4.02)
- native dynlink: found
- camlp4: disabled
- bytes: found, installing fake library
- Configuration for dynlink written to site-lib-src/dynlink/META
- Configuration for stdlib written to site-lib-src/stdlib/META
- Configuration for unix written to site-lib-src/unix/META
- Configuration for compiler-libs written to site-lib-src/compiler-libs/META
- Configuration for ocamldoc written to site-lib-src/ocamldoc/META
- Configuration for threads written to site-lib-src/threads/META
- Configuration for str written to site-lib-src/str/META
- Configuration for bytes written to site-lib-src/bytes/META
- Detecting compiler arguments: (extractor built) ok
- 
- About the OCAML core installation:
-     Standard library:      /home/opam/.opam/5.0/lib/ocaml
-     Binaries:              /home/opam/.opam/5.0/bin
-     Manual pages:          /home/opam/.opam/5.0/man
-     Multi-threading type:  posix
- The directory of site-specific packages will be
-     site-lib:              /home/opam/.opam/5.0/lib
- The configuration file is written to:
-     findlib config file:   /home/opam/.opam/5.0/lib/findlib.conf
- Software will be installed:
-     Libraries:             in <site-lib>/findlib
-     Binaries:              /home/opam/.opam/5.0/bin
-     Manual pages:          /home/opam/.opam/5.0/man
-     topfind script:        /home/opam/.opam/5.0/lib/ocaml
- Topfind ppxopt support:    yes
- Toolbox:                   no
- Link custom runtime:       no
- Need bytes compatibility:  no
- 
- Configuration has been written to Makefile.config
- 
- You can now do 'make all', and optionally 'make opt', to build ocamlfind.
Processing 68/331: [dune: ocaml bootstrap.ml] [ocamlbuild: make check-if-preinstalled] [ocamlfind: make all]
-> retrieved ppx_assert.v0.14.0  (cached)
Processing 69/331: [dune: ocaml bootstrap.ml] [ocamlbuild: make check-if-preinstalled] [ocamlfind: make all]
-> retrieved ppx_bap.v0.14.0  (cached)
Processing 70/331: [dune: ocaml bootstrap.ml] [ocamlbuild: make check-if-preinstalled] [ocamlfind: make all]
-> retrieved ppx_base.v0.14.0  (cached)
Processing 71/331: [dune: ocaml bootstrap.ml] [ocamlbuild: make check-if-preinstalled] [ocamlfind: make all]
-> retrieved ppx_bench.v0.14.1  (cached)
Processing 72/331: [dune: ocaml bootstrap.ml] [ocamlbuild: make check-if-preinstalled] [ocamlfind: make all]
-> retrieved ppx_bin_prot.v0.14.0  (cached)
Processing 73/331: [dune: ocaml bootstrap.ml] [ocamlbuild: make check-if-preinstalled] [ocamlfind: make all]
-> retrieved ppx_cold.v0.14.0  (cached)
Processing 74/331: [dune: ocaml bootstrap.ml] [ocamlbuild: make check-if-preinstalled] [ocamlfind: make all]
-> retrieved ppx_compare.v0.14.0  (cached)
Processing 75/331: [dune: ocaml bootstrap.ml] [ocamlbuild: make check-if-preinstalled] [ocamlfind: make all]
-> retrieved ppx_custom_printf.v0.14.1  (cached)
Processing 76/331: [dune: ocaml bootstrap.ml] [ocamlbuild: make check-if-preinstalled] [ocamlfind: make all]
-> retrieved ppx_derivers.1.2.1  (cached)
Processing 77/331: [dune: ocaml bootstrap.ml] [ocamlbuild: make check-if-preinstalled] [ocamlfind: make all]
-> retrieved ppx_enumerate.v0.14.0  (cached)
Processing 78/331: [dune: ocaml bootstrap.ml] [ocamlbuild: make check-if-preinstalled] [ocamlfind: make all]
-> retrieved ppx_expect.v0.14.2  (cached)
Processing 79/331: [dune: ocaml bootstrap.ml] [ocamlbuild: make check-if-preinstalled] [ocamlfind: make all]
-> retrieved ppx_fields_conv.v0.14.2  (cached)
Processing 80/331: [dune: ocaml bootstrap.ml] [ocamlbuild: make check-if-preinstalled] [ocamlfind: make all]
-> retrieved ppx_fixed_literal.v0.14.0  (cached)
Processing 81/331: [dune: ocaml bootstrap.ml] [ocamlbuild: make check-if-preinstalled] [ocamlfind: make all]
-> retrieved ppx_hash.v0.14.0  (cached)
Processing 82/331: [dune: ocaml bootstrap.ml] [ocamlbuild: make check-if-preinstalled] [ocamlfind: make all]
-> retrieved ppx_here.v0.14.0  (cached)
Processing 83/331: [dune: ocaml bootstrap.ml] [ocamlbuild: make check-if-preinstalled] [ocamlfind: make all]
-> retrieved ppx_inline_test.v0.14.1  (cached)
Processing 84/331: [dune: ocaml bootstrap.ml] [ocamlbuild: make check-if-preinstalled] [ocamlfind: make all]
-> retrieved ppx_jane.v0.14.0  (cached)
Processing 85/331: [dune: ocaml bootstrap.ml] [ocamlbuild: make check-if-preinstalled] [ocamlfind: make all]
-> retrieved ppx_js_style.v0.14.1  (cached)
Processing 86/331: [dune: ocaml bootstrap.ml] [ocamlbuild: make check-if-preinstalled] [ocamlfind: make all]
-> retrieved ppx_let.v0.14.0  (cached)
Processing 87/331: [dune: ocaml bootstrap.ml] [ocamlbuild: make check-if-preinstalled] [ocamlfind: make all]
-> retrieved ppx_module_timer.v0.14.0  (cached)
Processing 88/331: [dune: ocaml bootstrap.ml] [ocamlbuild: make check-if-preinstalled] [ocamlfind: make all]
-> retrieved ppx_optcomp.v0.14.3  (cached)
Processing 89/331: [dune: ocaml bootstrap.ml] [ocamlbuild: make check-if-preinstalled] [ocamlfind: make all]
-> retrieved ppx_optional.v0.14.0  (cached)
Processing 90/331: [dune: ocaml bootstrap.ml] [ocamlbuild: make check-if-preinstalled] [ocamlfind: make all]
-> retrieved ppx_pipebang.v0.14.0  (cached)
Processing 91/331: [dune: ocaml bootstrap.ml] [ocamlbuild: make check-if-preinstalled] [ocamlfind: make all]
-> retrieved ppx_sexp_conv.v0.14.3  (cached)
Processing 92/331: [dune: ocaml bootstrap.ml] [ocamlbuild: make check-if-preinstalled] [ocamlfind: make all]
-> retrieved ppx_sexp_message.v0.14.1  (cached)
Processing 93/331: [dune: ocaml bootstrap.ml] [ocamlbuild: make check-if-preinstalled] [ocamlfind: make all]
-> retrieved ppx_sexp_value.v0.14.0  (cached)
Processing 94/331: [dune: ocaml bootstrap.ml] [ocamlbuild: make check-if-preinstalled] [ocamlfind: make all]
-> retrieved ppx_stable.v0.14.1  (cached)
Processing 95/331: [dune: ocaml bootstrap.ml] [ocamlbuild: make check-if-preinstalled] [ocamlfind: make all]
-> retrieved ppx_string.v0.14.1  (cached)
Processing 96/331: [ppxlib.0.25.0~5.00preview: git] [dune: ocaml bootstrap.ml] [ocamlbuild: make check-if-preinstalled] [ocamlfind: make all]
-> retrieved ppx_typerep_conv.v0.14.2  (cached)
Processing 97/331: [ppxlib.0.25.0~5.00preview: git] [dune: ocaml bootstrap.ml] [ocamlbuild: make check-if-preinstalled] [ocamlfind: make all]
-> retrieved ppx_variants_conv.v0.14.2  (cached)
Processing 98/331: [ppxlib.0.25.0~5.00preview: git] [dune: ocaml bootstrap.ml] [ocamlbuild: make check-if-preinstalled] [ocamlfind: make all]
-> retrieved re.1.10.4  (cached)
Processing 99/331: [ppxlib.0.25.0~5.00preview: git] [dune: ocaml bootstrap.ml] [ocamlbuild: make check-if-preinstalled] [ocamlfind: make all]
-> retrieved react.1.2.2  (cached)
Processing 100/331: [ppxlib.0.25.0~5.00preview: git] [dune: ocaml bootstrap.ml] [ocamlbuild: make check-if-preinstalled] [ocamlfind: make all]
Processing 101/331: [ppxlib.0.25.0~5.00preview: git] [dune: ocaml bootstrap.ml] [ocamlbuild: make check-if-preinstalled] [ocamlfind: make all]
Processing 102/331: [ppxlib.0.25.0~5.00preview: git] [dune: ocaml bootstrap.ml] [ocamlbuild: make check-if-preinstalled] [ocamlfind: make all]
-> installed seq.base
Processing 103/331: [ppxlib.0.25.0~5.00preview: git] [dune: ocaml bootstrap.ml] [ocamlbuild: make check-if-preinstalled] [ocamlfind: make all]
-> retrieved result.1.5  (cached)
Processing 104/331: [ppxlib.0.25.0~5.00preview: git] [dune: ocaml bootstrap.ml] [ocamlbuild: make check-if-preinstalled] [ocamlfind: make all]
-> retrieved sexplib.v0.14.0  (cached)
Processing 105/331: [ppxlib.0.25.0~5.00preview: git] [dune: ocaml bootstrap.ml] [ocamlbuild: make check-if-preinstalled] [ocamlfind: make all]
-> retrieved sexplib0.v0.14.0  (cached)
Processing 106/331: [ppxlib.0.25.0~5.00preview: git] [dune: ocaml bootstrap.ml] [ocamlbuild: make check-if-preinstalled] [ocamlfind: make all]
-> retrieved splittable_random.v0.14.0  (cached)
Processing 107/331: [ppxlib.0.25.0~5.00preview: git] [dune: ocaml bootstrap.ml] [ocamlbuild: make check-if-preinstalled] [ocamlfind: make all]
-> retrieved stdio.v0.14.0  (cached)
Processing 108/331: [ppxlib.0.25.0~5.00preview: git] [dune: ocaml bootstrap.ml] [ocamlbuild: make check-if-preinstalled] [ocamlfind: make all]
-> retrieved stdlib-shims.0.3.0  (cached)
Processing 109/331: [ppxlib.0.25.0~5.00preview: git] [dune: ocaml bootstrap.ml] [ocamlbuild: make check-if-preinstalled] [ocamlfind: make all]
+ /home/opam/.opam/opam-init/hooks/sandbox.sh "build" "make" "all" (CWD=/home/opam/.opam/5.0/.opam-switch/build/ocamlfind.1.9.3)
- for p in findlib; do ( cd src/$p; make all ) || exit; done
- make[1]: Entering directory '/home/opam/.opam/5.0/.opam-switch/build/ocamlfind.1.9.3/src/findlib'
- ocamllex fl_meta.mll
- 22 states, 392 transitions, table size 1700 bytes
- USE_CYGPATH="0"; \
- export USE_CYGPATH; \
- cat findlib_config.mlp | \
-          ../../tools/patch '@CONFIGFILE@' '/home/opam/.opam/5.0/lib/findlib.conf' | \
-          ../../tools/patch '@STDLIB@' '/home/opam/.opam/5.0/lib/ocaml' | \
- 	sed -e 's;@AUTOLINK@;true;g' \
- 	    -e 's;@SYSTEM@;linux;g' \
- 	     >findlib_config.ml
- if [ "true" = "true" ]; then                 \
- 	cp topfind.ml.in topfind.ml;                             \
- else                                                             \
- 	sed -e '/PPXOPT_BEGIN/,/PPXOPT_END/ d' topfind.ml.in     \
- 		> topfind.ml ;                                   \
- fi
- ocamldep *.ml *.mli >depend
- ocamlc -I +compiler-libs -opaque    -g -c findlib_config.ml
- ocamlc -I +compiler-libs -opaque    -g -c fl_split.ml
- ocamlc -I +compiler-libs -opaque    -g -c fl_metatoken.ml
- ocamlc -I +compiler-libs -opaque    -g -c fl_meta.ml
- ocamlc -I +compiler-libs -opaque    -c fl_metascanner.mli
- ocamlc -I +compiler-libs -opaque    -g -c fl_metascanner.ml
- ocamlc -I +compiler-libs -opaque    -c fl_topo.mli
- ocamlc -I +compiler-libs -opaque    -g -c fl_topo.ml
- ocamlc -I +compiler-libs -opaque    -c fl_package_base.mli
- ocamlc -I +compiler-libs -opaque    -g -c fl_package_base.ml
- File "fl_package_base.ml", line 304, characters 22-40:
- 304 | 	 let pkg_ancestors = query_requirements predlist pkg in
-       	                     ^^^^^^^^^^^^^^^^^^
- Warning 6 [labels-omitted]: label preds was omitted in the application of this function.
- File "fl_package_base.ml", line 350, characters 18-36:
- 350 |   let ancestors = query_requirements predlist package_name in
-                         ^^^^^^^^^^^^^^^^^^
- Warning 6 [labels-omitted]: label preds was omitted in the application of this function.
- File "fl_package_base.ml", line 375, characters 23-41:
- 375 | 	  let pkg_ancestors = query_requirements predlist pkg in
-       	                      ^^^^^^^^^^^^^^^^^^
- Warning 6 [labels-omitted]: label preds was omitted in the application of this function.
- File "fl_package_base.ml", line 510, characters 16-35:
- 510 | 	     ( let c = package_definitions search_path pkg.package_name in
-       	               ^^^^^^^^^^^^^^^^^^^
- Warning 6 [labels-omitted]: label search_path was omitted in the application of this function.
- ocamlc -I +compiler-libs -opaque    -c findlib.mli
- ocamlc -I +compiler-libs -opaque    -g -c findlib.ml
- File "findlib.ml", line 390, characters 2-26:
- 390 |   Fl_package_base.requires predlist pkg
-         ^^^^^^^^^^^^^^^^^^^^^^^^
- Warning 6 [labels-omitted]: label preds was omitted in the application of this function.
- File "findlib.ml", line 396, characters 2-33:
- 396 |   Fl_package_base.requires_deeply predlist pkglist
-         ^^^^^^^^^^^^^^^^^^^^^^^^^^^^^^^
- Warning 6 [labels-omitted]: label preds was omitted in the application of this function.
- ocamlc -I +compiler-libs -opaque    -g -c fl_args.ml
- ocamlc -I +compiler-libs -opaque    -g -c fl_lint.ml
- ocamlc -I +compiler-libs -a -o findlib.cma findlib_config.cmo fl_split.cmo fl_metatoken.cmo fl_meta.cmo fl_metascanner.cmo fl_topo.cmo fl_package_base.cmo findlib.cmo fl_args.cmo fl_lint.cmo
- ocamlc -I +compiler-libs -opaque    -g -c ocaml_args.ml
- ocamlc -I +compiler-libs -opaque    -g -c frontend.ml
- File "frontend.ml", line 859, characters 10-39:
- 859 |           Fl_package_base.package_users predicates1 packages1
-                 ^^^^^^^^^^^^^^^^^^^^^^^^^^^^^
- Warning 6 [labels-omitted]: label preds was omitted in the application of this function.
- ocamlc -I +compiler-libs  -o ocamlfind -g findlib.cma unix.cma \
-             ocaml_args.cmo frontend.cmo
- ocamlc -I +compiler-libs -opaque    -c topfind.mli
- ocamlc -I +compiler-libs -opaque    -g -c topfind.ml
- File "topfind.ml", line 126, characters 40-63:
- 126 |                      match Hashtbl.find Toploop.directive_table "ppx" with
-                                               ^^^^^^^^^^^^^^^^^^^^^^^
- Alert deprecated: Toploop.directive_table
- File "topfind.ml", line 256, characters 4-27:
- 256 |     Toploop.directive_table
-           ^^^^^^^^^^^^^^^^^^^^^^^
- Alert deprecated: Toploop.directive_table
- File "topfind.ml", line 266, characters 4-27:
- 266 |     Toploop.directive_table
-           ^^^^^^^^^^^^^^^^^^^^^^^
- Alert deprecated: Toploop.directive_table
- File "topfind.ml", line 278, characters 4-27:
- 278 |     Toploop.directive_table
-           ^^^^^^^^^^^^^^^^^^^^^^^
- Alert deprecated: Toploop.directive_table
- File "topfind.ml", line 291, characters 4-27:
- 291 |     Toploop.directive_table
-           ^^^^^^^^^^^^^^^^^^^^^^^
- Alert deprecated: Toploop.directive_table
- File "topfind.ml", line 305, characters 4-27:
- 305 |     Toploop.directive_table
-           ^^^^^^^^^^^^^^^^^^^^^^^
- Alert deprecated: Toploop.directive_table
- File "topfind.ml", line 317, characters 4-27:
- 317 |     Toploop.directive_table
-           ^^^^^^^^^^^^^^^^^^^^^^^
- Alert deprecated: Toploop.directive_table
- ocamlc -I +compiler-libs -a -o findlib_top.cma topfind.cmo
- USE_CYGPATH="0"; \
- export USE_CYGPATH; \
- cat topfind_rd1.p | \
-          ../../tools/patch '@SITELIB@' '/home/opam/.opam/5.0/lib' \
-     	    >topfind
- ocamlc -I +compiler-libs -opaque    -c fl_dynload.mli
- ocamlc -I +compiler-libs -opaque    -g -c fl_dynload.ml
- ocamlc -I +compiler-libs -a -o findlib_dynload.cma fl_dynload.cmo
- make[1]: Leaving directory '/home/opam/.opam/5.0/.opam-switch/build/ocamlfind.1.9.3/src/findlib'
- make all-config
- make[1]: Entering directory '/home/opam/.opam/5.0/.opam-switch/build/ocamlfind.1.9.3'
- USE_CYGPATH="0"; \
- export USE_CYGPATH; \
- cat findlib.conf.in | \
-      tools/patch '@SITELIB@' '/home/opam/.opam/5.0/lib' >findlib.conf
- if ./tools/cmd_from_same_dir ocamlc; then \
- 	echo 'ocamlc="ocamlc.opt"' >>findlib.conf; \
- fi
- if ./tools/cmd_from_same_dir ocamlopt; then \
- 	echo 'ocamlopt="ocamlopt.opt"' >>findlib.conf; \
- fi
- if ./tools/cmd_from_same_dir ocamldep; then \
- 	echo 'ocamldep="ocamldep.opt"' >>findlib.conf; \
- fi
- if ./tools/cmd_from_same_dir ocamldoc; then \
- 	echo 'ocamldoc="ocamldoc.opt"' >>findlib.conf; \
- fi
- make[1]: Leaving directory '/home/opam/.opam/5.0/.opam-switch/build/ocamlfind.1.9.3'
Processing 109/331: [ppxlib.0.25.0~5.00preview: git] [dune: ocaml bootstrap.ml] [ocamlbuild: make check-if-preinstalled] [ocamlfind: make opt]
-> retrieved stringext.1.6.0  (cached)
Processing 110/331: [ppxlib.0.25.0~5.00preview: git] [dune: ocaml bootstrap.ml] [ocamlbuild: make check-if-preinstalled] [ocamlfind: make opt]
-> retrieved time_now.v0.14.0  (cached)
Processing 111/331: [ppxlib.0.25.0~5.00preview: git] [dune: ocaml bootstrap.ml] [ocamlbuild: make check-if-preinstalled] [ocamlfind: make opt]
-> retrieved trie.1.0.0  (cached)
Processing 112/331: [ppxlib.0.25.0~5.00preview: git] [dune: ocaml bootstrap.ml] [ocamlbuild: make check-if-preinstalled] [ocamlfind: make opt]
-> retrieved topkg.1.0.5  (cached)
Processing 113/331: [ppxlib.0.25.0~5.00preview: git] [dune: ocaml bootstrap.ml] [ocamlbuild: make check-if-preinstalled] [ocamlfind: make opt]
-> retrieved typerep.v0.14.0  (cached)
Processing 114/331: [ppxlib.0.25.0~5.00preview: git] [dune: ocaml bootstrap.ml] [ocamlbuild: make check-if-preinstalled] [ocamlfind: make opt]
-> retrieved uri.4.2.0  (cached)
Processing 115/331: [ppxlib.0.25.0~5.00preview: git] [dune: ocaml bootstrap.ml] [ocamlbuild: make check-if-preinstalled] [ocamlfind: make opt]
-> retrieved uuidm.0.9.8  (cached)
Processing 116/331: [ppxlib.0.25.0~5.00preview: git] [dune: ocaml bootstrap.ml] [ocamlbuild: make check-if-preinstalled] [ocamlfind: make opt]
-> retrieved utop.2.9.1  (cached)
Processing 117/331: [ppxlib.0.25.0~5.00preview: git] [dune: ocaml bootstrap.ml] [ocamlbuild: make check-if-preinstalled] [ocamlfind: make opt]
-> retrieved variantslib.v0.14.0  (cached)
Processing 118/331: [ppxlib.0.25.0~5.00preview: git] [dune: ocaml bootstrap.ml] [ocamlbuild: make check-if-preinstalled] [ocamlfind: make opt]
-> retrieved zarith.1.12  (cached)
-> retrieved zed.3.1.0  (cached)
-> retrieved ppxlib.0.25.0~5.00preview  (git+https://github.com/kit-ty-kate/ppxlib.git#500)
Processing 118/331: [dune: ocaml bootstrap.ml] [ocamlbuild: make check-if-preinstalled] [ocamlfind: make opt]
+ /home/opam/.opam/opam-init/hooks/sandbox.sh "build" "make" "opt" (CWD=/home/opam/.opam/5.0/.opam-switch/build/ocamlfind.1.9.3)
- for p in findlib; do ( cd src/$p; make opt ) || exit; done
- make[1]: Entering directory '/home/opam/.opam/5.0/.opam-switch/build/ocamlfind.1.9.3/src/findlib'
- ocamlopt -I +compiler-libs -g -opaque   -c findlib_config.ml
- ocamlopt -I +compiler-libs -g -opaque   -c fl_split.ml
- ocamlopt -I +compiler-libs -g -opaque   -c fl_metatoken.ml
- ocamlopt -I +compiler-libs -g -opaque   -c fl_meta.ml
- ocamlopt -I +compiler-libs -g -opaque   -c fl_metascanner.ml
- ocamlopt -I +compiler-libs -g -opaque   -c fl_topo.ml
- ocamlopt -I +compiler-libs -g -opaque   -c fl_package_base.ml
- File "fl_package_base.ml", line 304, characters 22-40:
- 304 | 	 let pkg_ancestors = query_requirements predlist pkg in
-       	                     ^^^^^^^^^^^^^^^^^^
- Warning 6 [labels-omitted]: label preds was omitted in the application of this function.
- File "fl_package_base.ml", line 350, characters 18-36:
- 350 |   let ancestors = query_requirements predlist package_name in
-                         ^^^^^^^^^^^^^^^^^^
- Warning 6 [labels-omitted]: label preds was omitted in the application of this function.
- File "fl_package_base.ml", line 375, characters 23-41:
- 375 | 	  let pkg_ancestors = query_requirements predlist pkg in
-       	                      ^^^^^^^^^^^^^^^^^^
- Warning 6 [labels-omitted]: label preds was omitted in the application of this function.
- File "fl_package_base.ml", line 510, characters 16-35:
- 510 | 	     ( let c = package_definitions search_path pkg.package_name in
-       	               ^^^^^^^^^^^^^^^^^^^
- Warning 6 [labels-omitted]: label search_path was omitted in the application of this function.
- ocamlopt -I +compiler-libs -g -opaque   -c findlib.ml
- File "findlib.ml", line 390, characters 2-26:
- 390 |   Fl_package_base.requires predlist pkg
-         ^^^^^^^^^^^^^^^^^^^^^^^^
- Warning 6 [labels-omitted]: label preds was omitted in the application of this function.
- File "findlib.ml", line 396, characters 2-33:
- 396 |   Fl_package_base.requires_deeply predlist pkglist
-         ^^^^^^^^^^^^^^^^^^^^^^^^^^^^^^^
- Warning 6 [labels-omitted]: label preds was omitted in the application of this function.
- ocamlopt -I +compiler-libs -g -opaque   -c fl_args.ml
- ocamlopt -I +compiler-libs -g -opaque   -c fl_lint.ml
- ocamlopt -I +compiler-libs -g -a -o findlib.cmxa findlib_config.cmx fl_split.cmx fl_metatoken.cmx fl_meta.cmx fl_metascanner.cmx fl_topo.cmx fl_package_base.cmx findlib.cmx fl_args.cmx fl_lint.cmx
- if [ 1 -gt 0 ]; then \
-     ocamlopt -I +compiler-libs -g -shared -o findlib.cmxs findlib_config.cmx fl_split.cmx fl_metatoken.cmx fl_meta.cmx fl_metascanner.cmx fl_topo.cmx fl_package_base.cmx findlib.cmx fl_args.cmx fl_lint.cmx; \
- fi
- ocamlopt -I +compiler-libs -g -opaque   -c ocaml_args.ml
- ocamlopt -I +compiler-libs -g -opaque   -c frontend.ml
- File "frontend.ml", line 859, characters 10-39:
- 859 |           Fl_package_base.package_users predicates1 packages1
-                 ^^^^^^^^^^^^^^^^^^^^^^^^^^^^^
- Warning 6 [labels-omitted]: label preds was omitted in the application of this function.
- ocamlopt -I +compiler-libs -g -o ocamlfind_opt findlib.cmxa unix.cmxa \
- 	    ocaml_args.cmx frontend.cmx
- ocamlopt -I +compiler-libs -g -opaque   -c topfind.ml
- File "topfind.ml", line 126, characters 40-63:
- 126 |                      match Hashtbl.find Toploop.directive_table "ppx" with
-                                               ^^^^^^^^^^^^^^^^^^^^^^^
- Alert deprecated: Toploop.directive_table
- File "topfind.ml", line 256, characters 4-27:
- 256 |     Toploop.directive_table
-           ^^^^^^^^^^^^^^^^^^^^^^^
- Alert deprecated: Toploop.directive_table
- File "topfind.ml", line 266, characters 4-27:
- 266 |     Toploop.directive_table
-           ^^^^^^^^^^^^^^^^^^^^^^^
- Alert deprecated: Toploop.directive_table
- File "topfind.ml", line 278, characters 4-27:
- 278 |     Toploop.directive_table
-           ^^^^^^^^^^^^^^^^^^^^^^^
- Alert deprecated: Toploop.directive_table
- File "topfind.ml", line 291, characters 4-27:
- 291 |     Toploop.directive_table
-           ^^^^^^^^^^^^^^^^^^^^^^^
- Alert deprecated: Toploop.directive_table
- File "topfind.ml", line 305, characters 4-27:
- 305 |     Toploop.directive_table
-           ^^^^^^^^^^^^^^^^^^^^^^^
- Alert deprecated: Toploop.directive_table
- File "topfind.ml", line 317, characters 4-27:
- 317 |     Toploop.directive_table
-           ^^^^^^^^^^^^^^^^^^^^^^^
- Alert deprecated: Toploop.directive_table
- ocamlopt -I +compiler-libs -g -a -o findlib_top.cmxa topfind.cmx
- if [ 1 -gt 0 ]; then \
-     ocamlopt -I +compiler-libs -g -shared -o findlib_top.cmxs topfind.cmx; \
- fi
- ocamlopt -I +compiler-libs -g -opaque   -c fl_dynload.ml
- ocamlopt -I +compiler-libs -g -a -o findlib_dynload.cmxa fl_dynload.cmx
- if [ 1 -gt 0 ]; then \
-     ocamlopt -I +compiler-libs -g -shared -o findlib_dynload.cmxs fl_dynload.cmx; \
- fi
- make[1]: Leaving directory '/home/opam/.opam/5.0/.opam-switch/build/ocamlfind.1.9.3/src/findlib'
-> compiled  ocamlfind.1.9.3
Processing 118/331: [dune: ocaml bootstrap.ml] [ocamlbuild: make check-if-preinstalled]
Processing 119/331: [dune: ocaml bootstrap.ml] [ocamlbuild: make check-if-preinstalled] [ocamlfind: make install]
+ /home/opam/.opam/opam-init/hooks/sandbox.sh "install" "make" "install" (CWD=/home/opam/.opam/5.0/.opam-switch/build/ocamlfind.1.9.3)
- if [ "1" -eq 1 ]; then \
-     for x in camlp4 dbm graphics labltk num ocamlbuild; do \
-       if [ -f "/home/opam/.opam/5.0/lib/$x/META" ]; then \
-         if ! grep -Fq '[distributed with Ocaml]' "//home/opam/.opam/5.0/lib/$x/META"; then \
-           rm -f site-lib-src/$x/META; \
-         fi; \
-       fi; \
-     done; \
-     test -f "site-lib-src/num/META" || rm -f "site-lib-src/num-top/META"; \
-   fi
- echo 'SITELIB_META =' > Makefile.packages.in
- for x in `ls site-lib-src`; do test ! -f "site-lib-src/$x/META" || echo $x >> Makefile.packages.in; done
- tr '\n' ' ' < Makefile.packages.in > Makefile.packages
- rm Makefile.packages.in
- mkdir -p "/home/opam/.opam/5.0/bin"
- mkdir -p "/home/opam/.opam/5.0/man"
- make install-config
- make[1]: Entering directory '/home/opam/.opam/5.0/.opam-switch/build/ocamlfind.1.9.3'
- mkdir -p "`dirname \"/home/opam/.opam/5.0/lib/findlib.conf\"`"
- test -f "/home/opam/.opam/5.0/lib/findlib.conf" || cp findlib.conf "/home/opam/.opam/5.0/lib/findlib.conf"
- make[1]: Leaving directory '/home/opam/.opam/5.0/.opam-switch/build/ocamlfind.1.9.3'
- for p in findlib; do ( cd src/$p; make install ); done
- make[1]: Entering directory '/home/opam/.opam/5.0/.opam-switch/build/ocamlfind.1.9.3/src/findlib'
- mkdir -p "/home/opam/.opam/5.0/lib/findlib"
- mkdir -p "/home/opam/.opam/5.0/bin"
- test 1 -eq 0 || cp topfind "/home/opam/.opam/5.0/lib/ocaml"
- files=` ../../tools/collect_files ../../Makefile.config \
- findlib.cmi findlib.mli findlib.cma findlib.cmxa findlib.a findlib.cmxs \
- findlib_config.cmi findlib_config.ml topfind.cmi topfind.mli \
- fl_args.cmi fl_lint.cmi fl_meta.cmi fl_split.cmi fl_topo.cmi ocaml_args.cmi \
- fl_package_base.mli fl_package_base.cmi fl_metascanner.mli fl_metascanner.cmi \
- fl_metatoken.cmi findlib_top.cma findlib_top.cmxa findlib_top.a findlib_top.cmxs \
- findlib_dynload.cma findlib_dynload.cmxa findlib_dynload.a findlib_dynload.cmxs fl_dynload.mli fl_dynload.cmi \
- META` && \
- cp $files "/home/opam/.opam/5.0/lib/findlib"
- f="ocamlfind"; { test -f ocamlfind_opt && f="ocamlfind_opt"; }; \
- cp $f "/home/opam/.opam/5.0/bin/ocamlfind"
- # the following "if" block is only needed for 4.00beta2
- if [ 1 -eq 0 -a -f "/home/opam/.opam/5.0/lib/ocaml/compiler-libs/topdirs.cmi" ]; then \
-     cd "/home/opam/.opam/5.0/lib/ocaml/compiler-libs/"; \
-     cp topdirs.cmi toploop.cmi "/home/opam/.opam/5.0/lib/findlib/"; \
- fi
- make[1]: Leaving directory '/home/opam/.opam/5.0/.opam-switch/build/ocamlfind.1.9.3/src/findlib'
- make install-meta
- make[1]: Entering directory '/home/opam/.opam/5.0/.opam-switch/build/ocamlfind.1.9.3'
- for x in bytes compiler-libs dynlink ocamldoc stdlib str threads unix ; do mkdir -p "/home/opam/.opam/5.0/lib/$x"; cp site-lib-src/$x/META "/home/opam/.opam/5.0/lib/$x/META.tmp" && mv "/home/opam/.opam/5.0/lib/$x/META.tmp" "/home/opam/.opam/5.0/lib/$x/META"; done
- mkdir -p "/home/opam/.opam/5.0/lib/findlib"; cp Makefile.packages "/home/opam/.opam/5.0/lib/findlib/Makefile.packages"
- make[1]: Leaving directory '/home/opam/.opam/5.0/.opam-switch/build/ocamlfind.1.9.3'
- test ! -f 'site-lib-src/num-top/META' || { cd src/findlib; make install-num-top; }
- test ! -f 'site-lib-src/camlp4/META' ||	cp tools/safe_camlp4 "/home/opam/.opam/5.0/bin"
- make install-doc
- make[1]: Entering directory '/home/opam/.opam/5.0/.opam-switch/build/ocamlfind.1.9.3'
- mkdir -p "/home/opam/.opam/5.0/man/man1" "/home/opam/.opam/5.0/man/man3" "/home/opam/.opam/5.0/man/man5"
- cp doc/ref-man/ocamlfind.1 "/home/opam/.opam/5.0/man/man1"
- cp doc/ref-man/META.5 doc/ref-man/site-lib.5 doc/ref-man/findlib.conf.5 "/home/opam/.opam/5.0/man/man5"
- make[1]: Leaving directory '/home/opam/.opam/5.0/.opam-switch/build/ocamlfind.1.9.3'
-> installed ocamlfind.1.9.3
Processing 119/331: [dune: ocaml bootstrap.ml] [ocamlbuild: make check-if-preinstalled]
Processing 120/331: [dune: ocaml bootstrap.ml] [ocamlbuild: make check-if-preinstalled]
Processing 121/331: [camlzip: make all] [dune: ocaml bootstrap.ml] [ocamlbuild: make check-if-preinstalled]
Processing 122/331: [camlzip: make all] [dune: ocaml bootstrap.ml] [num: make] [ocamlbuild: make check-if-preinstalled]
Processing 123/331: [camlzip: make all] [dune: ocaml bootstrap.ml] [num: make] [ocamlbuild: make check-if-preinstalled] [zarith: ./configure]
-> installed base-bytes.base
Processing 124/331: [camlzip: make all] [dune: ocaml bootstrap.ml] [num: make] [ocamlbuild: make check-if-preinstalled] [zarith: ./configure]
+ /home/opam/.opam/opam-init/hooks/sandbox.sh "build" "./configure" (CWD=/home/opam/.opam/5.0/.opam-switch/build/zarith.1.12)
- binary ocaml: found in /home/opam/.opam/5.0/bin
- binary ocamlc: found in /home/opam/.opam/5.0/bin
- binary ocamldep: found in /home/opam/.opam/5.0/bin
- binary ocamlmklib: found in /home/opam/.opam/5.0/bin
- binary ocamldoc: found in /home/opam/.opam/5.0/bin
- binary gcc: found in /usr/bin
- binary ocamlopt: found in /home/opam/.opam/5.0/bin
- checking compilation with gcc -O3 -Wall -Wextra : working
- include caml/mlvalues.h: found
- library dynlink.cmxa: found
- binary ocamlfind: found in /home/opam/.opam/5.0/bin
- OCaml's word size is 64
- binary uname: found in /bin
- include gmp.h: found
- library gmp: found
- OCaml supports -bin-annot to produce documentation
- 
- detected configuration:
- 
-   native-code:          yes
-   dynamic linking:      yes
-   defines:              -DHAS_GMP 
-   libraries:             -lgmp
-   C options:            -O3 -Wall -Wextra 
-   installation path:    /home/opam/.opam/5.0/lib
-   installation method   findlib
- 
- configuration successful!
- now type "make" to build
- then type "make install" or "sudo make install" to install
Processing 124/331: [camlzip: make all] [dune: ocaml bootstrap.ml] [num: make] [ocamlbuild: make check-if-preinstalled] [zarith: make]
+ /home/opam/.opam/opam-init/hooks/sandbox.sh "build" "make" "all" (CWD=/home/opam/.opam/5.0/.opam-switch/build/camlzip.1.11)
- ocamlfind ocamlc -g -safe-string -bin-annot -c -ccopt -g  zlibstubs.c
- ocamlfind ocamlmklib -oc camlzip zlibstubs.o  -lz
- ocamlfind ocamlc -g -safe-string -bin-annot -c zlib.mli
- ocamlfind ocamlc -g -safe-string -bin-annot -c zlib.ml
- ocamlfind ocamlc -g -safe-string -bin-annot -c zip.mli
- ocamlfind ocamlc -g -safe-string -bin-annot -c zip.ml
- ocamlfind ocamlc -g -safe-string -bin-annot -c gzip.mli
- ocamlfind ocamlc -g -safe-string -bin-annot -c gzip.ml
- ocamlfind ocamlmklib -o zip -oc camlzip zlib.cmo zip.cmo gzip.cmo  -lz
- ocamlfind ocamlopt -safe-string -c zlib.ml
- ocamlfind ocamlopt -safe-string -c zip.ml
- ocamlfind ocamlopt -safe-string -c gzip.ml
- ocamlfind ocamlmklib -o zip -oc camlzip zlib.cmx zip.cmx gzip.cmx  -lz
- ocamlfind ocamlopt -safe-string -shared -linkall -I ./ -o zip.cmxs zip.cmxa libcamlzip.a
-> compiled  camlzip.1.11
Processing 124/331: [dune: ocaml bootstrap.ml] [num: make] [ocamlbuild: make check-if-preinstalled] [zarith: make]
Processing 125/331: [dune: ocaml bootstrap.ml] [num: make] [ocamlbuild: make check-if-preinstalled] [zarith: make] [camlzip: make install]
+ /home/opam/.opam/opam-init/hooks/sandbox.sh "install" "make" "install" (CWD=/home/opam/.opam/5.0/.opam-switch/build/camlzip.1.11)
- cp META-zip META && \
-         ocamlfind install zip META *.cma *.a *.mli *.cmi *.cmti *.cmt gzip.cmx zip.cmx zlib.cmx zip.cmxa zip.cmxs dllcamlzip.so && \
-         rm META
- Installed /home/opam/.opam/5.0/lib/zip/zip.cmxs
- Installed /home/opam/.opam/5.0/lib/zip/zip.cmxa
- Installed /home/opam/.opam/5.0/lib/zip/zlib.cmx
- Installed /home/opam/.opam/5.0/lib/zip/zip.cmx
- Installed /home/opam/.opam/5.0/lib/zip/gzip.cmx
- Installed /home/opam/.opam/5.0/lib/zip/zlib.cmt
- Installed /home/opam/.opam/5.0/lib/zip/zip.cmt
- Installed /home/opam/.opam/5.0/lib/zip/gzip.cmt
- Installed /home/opam/.opam/5.0/lib/zip/zlib.cmti
- Installed /home/opam/.opam/5.0/lib/zip/zip.cmti
- Installed /home/opam/.opam/5.0/lib/zip/gzip.cmti
- Installed /home/opam/.opam/5.0/lib/zip/zlib.cmi
- Installed /home/opam/.opam/5.0/lib/zip/zip.cmi
- Installed /home/opam/.opam/5.0/lib/zip/gzip.cmi
- Installed /home/opam/.opam/5.0/lib/zip/zlib.mli
- Installed /home/opam/.opam/5.0/lib/zip/zip.mli
- Installed /home/opam/.opam/5.0/lib/zip/gzip.mli
- Installed /home/opam/.opam/5.0/lib/zip/zip.a
- Installed /home/opam/.opam/5.0/lib/zip/libcamlzip.a
- Installed /home/opam/.opam/5.0/lib/zip/zip.cma
- Installed /home/opam/.opam/5.0/lib/stublibs/dllcamlzip.so
- Installed /home/opam/.opam/5.0/lib/stublibs/dllcamlzip.so.owner
- ocamlfind: [WARNING] You have installed DLLs but the directory /home/opam/.opam/5.0/lib/stublibs is not mentioned in ld.conf
- Installed /home/opam/.opam/5.0/lib/zip/META
- cp META-camlzip META && \
-         ocamlfind install camlzip META && \
-         rm META
- Installed /home/opam/.opam/5.0/lib/camlzip/META
-> installed camlzip.1.11
Processing 125/331: [dune: ocaml bootstrap.ml] [num: make] [ocamlbuild: make check-if-preinstalled] [zarith: make]
+ /home/opam/.opam/opam-init/hooks/sandbox.sh "build" "make" (CWD=/home/opam/.opam/5.0/.opam-switch/build/num.1.4)
- make -C src all
- make[1]: Entering directory '/home/opam/.opam/5.0/.opam-switch/build/num.1.4/src'
- ocamlc -ccopt -DBNG_ARCH_amd64 -c bng.c
- ocamlc -ccopt -DBNG_ARCH_amd64 -c nat_stubs.c
- ocamlmklib -oc nums bng.o nat_stubs.o
- ocamlc -w +a-4-9-41-42-44-45-48 -warn-error A -bin-annot -g -safe-string -strict-sequence -strict-formats -c int_misc.mli
- ocamlc -w +a-4-9-41-42-44-45-48 -warn-error A -bin-annot -g -safe-string -strict-sequence -strict-formats -c int_misc.ml
- ocamlc -w +a-4-9-41-42-44-45-48 -warn-error A -bin-annot -g -safe-string -strict-sequence -strict-formats -c nat.mli
- ocamlc -w +a-4-9-41-42-44-45-48 -warn-error A -bin-annot -g -safe-string -strict-sequence -strict-formats -c nat.ml
- ocamlc -w +a-4-9-41-42-44-45-48 -warn-error A -bin-annot -g -safe-string -strict-sequence -strict-formats -c big_int.mli
- ocamlc -w +a-4-9-41-42-44-45-48 -warn-error A -bin-annot -g -safe-string -strict-sequence -strict-formats -c big_int.ml
- ocamlc -w +a-4-9-41-42-44-45-48 -warn-error A -bin-annot -g -safe-string -strict-sequence -strict-formats -c arith_flags.mli
- ocamlc -w +a-4-9-41-42-44-45-48 -warn-error A -bin-annot -g -safe-string -strict-sequence -strict-formats -c arith_flags.ml
- ocamlc -w +a-4-9-41-42-44-45-48 -warn-error A -bin-annot -g -safe-string -strict-sequence -strict-formats -c ratio.mli
- ocamlc -w +a-4-9-41-42-44-45-48 -warn-error A -bin-annot -g -safe-string -strict-sequence -strict-formats -c ratio.ml
- ocamlc -w +a-4-9-41-42-44-45-48 -warn-error A -bin-annot -g -safe-string -strict-sequence -strict-formats -c num.mli
- ocamlc -w +a-4-9-41-42-44-45-48 -warn-error A -bin-annot -g -safe-string -strict-sequence -strict-formats -c num.ml
- ocamlc -w +a-4-9-41-42-44-45-48 -warn-error A -bin-annot -g -safe-string -strict-sequence -strict-formats -c arith_status.mli
- ocamlc -w +a-4-9-41-42-44-45-48 -warn-error A -bin-annot -g -safe-string -strict-sequence -strict-formats -c arith_status.ml
- ocamlmklib -o nums -oc nums -linkall int_misc.cmo nat.cmo big_int.cmo arith_flags.cmo ratio.cmo num.cmo arith_status.cmo
- ocamlopt -w +a-4-9-41-42-44-45-48 -warn-error A -bin-annot -g -safe-string -strict-sequence -strict-formats -c int_misc.ml
- ocamlopt -w +a-4-9-41-42-44-45-48 -warn-error A -bin-annot -g -safe-string -strict-sequence -strict-formats -c nat.ml
- ocamlopt -w +a-4-9-41-42-44-45-48 -warn-error A -bin-annot -g -safe-string -strict-sequence -strict-formats -c big_int.ml
- ocamlopt -w +a-4-9-41-42-44-45-48 -warn-error A -bin-annot -g -safe-string -strict-sequence -strict-formats -c arith_flags.ml
- ocamlopt -w +a-4-9-41-42-44-45-48 -warn-error A -bin-annot -g -safe-string -strict-sequence -strict-formats -c ratio.ml
- ocamlopt -w +a-4-9-41-42-44-45-48 -warn-error A -bin-annot -g -safe-string -strict-sequence -strict-formats -c num.ml
- ocamlopt -w +a-4-9-41-42-44-45-48 -warn-error A -bin-annot -g -safe-string -strict-sequence -strict-formats -c arith_status.ml
- ocamlmklib -o nums -oc nums -linkall int_misc.cmx nat.cmx big_int.cmx arith_flags.cmx ratio.cmx num.cmx arith_status.cmx
- ocamlopt -w +a-4-9-41-42-44-45-48 -warn-error A -bin-annot -g -safe-string -strict-sequence -strict-formats -I . -shared -o nums.cmxs nums.cmxa
- make[1]: Leaving directory '/home/opam/.opam/5.0/.opam-switch/build/num.1.4/src'
- make -C toplevel all
- make[1]: Entering directory '/home/opam/.opam/5.0/.opam-switch/build/num.1.4/toplevel'
- ocamlc -I ../src -I +compiler-libs -w +a-4-9-41-42-44-45-48 -warn-error A -safe-string -strict-sequence -strict-formats -c num_top_printers.mli
- ocamlc -I ../src -I +compiler-libs -w +a-4-9-41-42-44-45-48 -warn-error A -safe-string -strict-sequence -strict-formats -c num_top_printers.ml
- ocamlc -I ../src -I +compiler-libs -w +a-4-9-41-42-44-45-48 -warn-error A -safe-string -strict-sequence -strict-formats -c num_top.mli
- ocamlc -I ../src -I +compiler-libs -w +a-4-9-41-42-44-45-48 -warn-error A -safe-string -strict-sequence -strict-formats -c num_top.ml
- ocamlc -I ../src -I +compiler-libs -w +a-4-9-41-42-44-45-48 -warn-error A -safe-string -strict-sequence -strict-formats -a -o num_top.cma num_top_printers.cmo num_top.cmo
- make[1]: Leaving directory '/home/opam/.opam/5.0/.opam-switch/build/num.1.4/toplevel'
-> compiled  num.1.4
Processing 125/331: [dune: ocaml bootstrap.ml] [ocamlbuild: make check-if-preinstalled] [zarith: make]
Processing 126/331: [dune: ocaml bootstrap.ml] [ocamlbuild: make check-if-preinstalled] [zarith: make] [num: ocamlfind remove]
+ /home/opam/.opam/opam-init/hooks/sandbox.sh "install" "ocamlfind" "remove" "num" (CWD=/home/opam/.opam/5.0/.opam-switch/build/num.1.4)
- ocamlfind: [WARNING] No such file: /home/opam/.opam/5.0/lib/num/META
+ /home/opam/.opam/opam-init/hooks/sandbox.sh "install" "ocamlfind" "remove" "num-top" (CWD=/home/opam/.opam/5.0/.opam-switch/build/num.1.4)
- ocamlfind: [WARNING] No such file: /home/opam/.opam/5.0/lib/num-top/META
Processing 126/331: [dune: ocaml bootstrap.ml] [ocamlbuild: make check-if-preinstalled] [zarith: make] [num: make install]
+ /home/opam/.opam/opam-init/hooks/sandbox.sh "install" "make" "install" (CWD=/home/opam/.opam/5.0/.opam-switch/build/num.1.4)
- make -C src install
- make[1]: Entering directory '/home/opam/.opam/5.0/.opam-switch/build/num.1.4/src'
- install -d /home/opam/.opam/5.0/lib/ocaml
- sed -e 's/%%VERSION%%/1.4/g' META.in > META
- ocamlfind install num META
- Installed /home/opam/.opam/5.0/lib/num/META
- rm -f META
- install -m 644 nums.cma libnums.a big_int.cmi nat.cmi num.cmi ratio.cmi arith_status.cmi big_int.mli nat.mli num.mli ratio.mli arith_status.mli big_int.cmti nat.cmti num.cmti ratio.cmti arith_status.cmti nums.cmxa nums.a int_misc.cmx nat.cmx big_int.cmx arith_flags.cmx ratio.cmx num.cmx arith_status.cmx nums.cmxs /home/opam/.opam/5.0/lib/ocaml
- install -d /home/opam/.opam/5.0/lib/ocaml/stublibs
- install dllnums.so /home/opam/.opam/5.0/lib/ocaml/stublibs
- make[1]: Leaving directory '/home/opam/.opam/5.0/.opam-switch/build/num.1.4/src'
- make -C toplevel install
- make[1]: Entering directory '/home/opam/.opam/5.0/.opam-switch/build/num.1.4/toplevel'
- sed -e 's/%%VERSION%%/1.4/g' META.in > META
- ocamlfind install num-top META num_top.cma num_top.cmi num_top_printers.cmi
- Installed /home/opam/.opam/5.0/lib/num-top/num_top_printers.cmi
- Installed /home/opam/.opam/5.0/lib/num-top/num_top.cmi
- Installed /home/opam/.opam/5.0/lib/num-top/num_top.cma
- Installed /home/opam/.opam/5.0/lib/num-top/META
- rm -f META
- make[1]: Leaving directory '/home/opam/.opam/5.0/.opam-switch/build/num.1.4/toplevel'
-> installed num.1.4
Processing 126/331: [dune: ocaml bootstrap.ml] [ocamlbuild: make check-if-preinstalled] [zarith: make]
+ /home/opam/.opam/opam-init/hooks/sandbox.sh "build" "make" (CWD=/home/opam/.opam/5.0/.opam-switch/build/zarith.1.12)
- (echo "let"; grep "version" META | head -1) > zarith_version.ml
- ocamldep -native  zarith_version.ml z.ml q.ml big_int_Z.ml z.mli q.mli big_int_Z.mli > depend
- ocamlc -I +compiler-libs -bin-annot  -c zarith_version.ml
- ocamlc -I +compiler-libs -bin-annot  -c z.mli
- ocamlc -I +compiler-libs -bin-annot  -c z.ml
- ocamlc -I +compiler-libs -bin-annot  -c q.mli
- ocamlc -I +compiler-libs -bin-annot  -c q.ml
- File "q.ml", line 537, characters 9-23:
- 537 |         (Z.of_substring s 0 i)
-                ^^^^^^^^^^^^^^
- Warning 6 [labels-omitted]: labels pos, len were omitted in the application of this function.
- File "q.ml", line 538, characters 9-23:
- 538 |         (Z.of_substring s (i+1) (String.length s-i-1))
-                ^^^^^^^^^^^^^^
- Warning 6 [labels-omitted]: labels pos, len were omitted in the application of this function.
- ocamlc -I +compiler-libs -bin-annot  -c big_int_Z.mli
- ocamlc -I +compiler-libs -bin-annot  -c big_int_Z.ml
- ocamlmklib -failsafe -o zarith zarith_version.cmo z.cmo q.cmo big_int_Z.cmo -lgmp
- ocamlc -ccopt "-I/home/opam/.opam/5.0/lib/ocaml  -DHAS_GMP  -O3 -Wall -Wextra " -c caml_z.c
- ocamlmklib -failsafe -o zarith caml_z.o -lgmp
- ocamlc -I +compiler-libs -bin-annot  -c zarith_top.ml
- ocamlc -o zarith_top.cma -a zarith_top.cmo
- ocamlopt -I +compiler-libs  -c zarith_version.ml
- ocamlopt -I +compiler-libs  -c z.ml
- ocamlopt -I +compiler-libs  -c q.ml
- File "q.ml", line 537, characters 9-23:
- 537 |         (Z.of_substring s 0 i)
-                ^^^^^^^^^^^^^^
- Warning 6 [labels-omitted]: labels pos, len were omitted in the application of this function.
- File "q.ml", line 538, characters 9-23:
- 538 |         (Z.of_substring s (i+1) (String.length s-i-1))
-                ^^^^^^^^^^^^^^
- Warning 6 [labels-omitted]: labels pos, len were omitted in the application of this function.
- ocamlopt -I +compiler-libs  -c big_int_Z.ml
- ocamlmklib -failsafe -o zarith zarith_version.cmx z.cmx q.cmx big_int_Z.cmx -lgmp
- ocamlopt -shared -o zarith.cmxs -I . zarith.cmxa -linkall
-> compiled  zarith.1.12
Processing 126/331: [dune: ocaml bootstrap.ml] [ocamlbuild: make check-if-preinstalled]
Processing 127/331: [dune: ocaml bootstrap.ml] [ocamlbuild: make check-if-preinstalled] [zarith: make install]
+ /home/opam/.opam/opam-init/hooks/sandbox.sh "install" "make" "install" (CWD=/home/opam/.opam/5.0/.opam-switch/build/zarith.1.12)
- ocamlfind install -destdir "/home/opam/.opam/5.0/lib" zarith META zarith.cma libzarith.a z.cmi q.cmi big_int_Z.cmi zarith_top.cma z.mli zarith.cmxa z.cmx q.cmx big_int_Z.cmx zarith.cmxs zarith.h q.mli big_int_Z.mli zarith.a z.cmti q.cmti big_int_Z.cmti -optional dllzarith.so
- Installed /home/opam/.opam/5.0/lib/zarith/big_int_Z.cmti
- Installed /home/opam/.opam/5.0/lib/zarith/q.cmti
- Installed /home/opam/.opam/5.0/lib/zarith/z.cmti
- Installed /home/opam/.opam/5.0/lib/zarith/zarith.a
- Installed /home/opam/.opam/5.0/lib/zarith/big_int_Z.mli
- Installed /home/opam/.opam/5.0/lib/zarith/q.mli
- Installed /home/opam/.opam/5.0/lib/zarith/zarith.h
- Installed /home/opam/.opam/5.0/lib/zarith/zarith.cmxs
- Installed /home/opam/.opam/5.0/lib/zarith/big_int_Z.cmx
- Installed /home/opam/.opam/5.0/lib/zarith/q.cmx
- Installed /home/opam/.opam/5.0/lib/zarith/z.cmx
- Installed /home/opam/.opam/5.0/lib/zarith/zarith.cmxa
- Installed /home/opam/.opam/5.0/lib/zarith/z.mli
- Installed /home/opam/.opam/5.0/lib/zarith/zarith_top.cma
- Installed /home/opam/.opam/5.0/lib/zarith/big_int_Z.cmi
- Installed /home/opam/.opam/5.0/lib/zarith/q.cmi
- Installed /home/opam/.opam/5.0/lib/zarith/z.cmi
- Installed /home/opam/.opam/5.0/lib/zarith/libzarith.a
- Installed /home/opam/.opam/5.0/lib/zarith/zarith.cma
- Installed /home/opam/.opam/5.0/lib/stublibs/dllzarith.so
- Installed /home/opam/.opam/5.0/lib/stublibs/dllzarith.so.owner
- ocamlfind: [WARNING] You have installed DLLs but the directory /home/opam/.opam/5.0/lib/stublibs is not mentioned in ld.conf
- Installed /home/opam/.opam/5.0/lib/zarith/META
-> installed zarith.1.12
Processing 127/331: [dune: ocaml bootstrap.ml] [ocamlbuild: make check-if-preinstalled]
+ /home/opam/.opam/opam-init/hooks/sandbox.sh "build" "make" "check-if-preinstalled" "all" "opam-install" (CWD=/home/opam/.opam/5.0/.opam-switch/build/ocamlbuild.0.14.1)
- if test -d /home/opam/.opam/5.0/lib/ocaml/ocamlbuild; then\
-   >&2 echo "ERROR: Preinstalled ocamlbuild detected at"\
-        "/home/opam/.opam/5.0/lib/ocaml/ocamlbuild";\
-   >&2 echo "Installation aborted; if you want to bypass this"\
-         "safety check, pass CHECK_IF_PREINSTALLED=false to make";\
-   exit 2;\
- fi
- ocamlc.opt -w +L -w +R -w +Z -I src -I +unix -safe-string -bin-annot -strict-sequence -c src/const.ml
- ocamlc.opt -w +L -w +R -w +Z -I src -I +unix -safe-string -bin-annot -strict-sequence -c src/loc.mli
- ocamlc.opt -w +L -w +R -w +Z -I src -I +unix -safe-string -bin-annot -strict-sequence -c src/loc.ml
- ocamlc.opt -w +L -w +R -w +Z -I src -I +unix -safe-string -bin-annot -strict-sequence -c src/discard_printf.mli
- ocamlc.opt -w +L -w +R -w +Z -I src -I +unix -safe-string -bin-annot -strict-sequence -c src/discard_printf.ml
- ocamlc.opt -w +L -w +R -w +Z -I src -I +unix -safe-string -bin-annot -strict-sequence -c src/signatures.mli
- ocamlc.opt -w +L -w +R -w +Z -I src -I +unix -safe-string -bin-annot -strict-sequence -c src/my_std.mli
- ocamlc.opt -w +L -w +R -w +Z -I src -I +unix -safe-string -bin-annot -strict-sequence -c src/my_std.ml
- ocamlc.opt -w +L -w +R -w +Z -I src -I +unix -safe-string -bin-annot -strict-sequence -c src/my_unix.mli
- ocamlc.opt -w +L -w +R -w +Z -I src -I +unix -safe-string -bin-annot -strict-sequence -c src/my_unix.ml
- ocamlc.opt -w +L -w +R -w +Z -I src -I +unix -safe-string -bin-annot -strict-sequence -c src/tags.mli
- ocamlc.opt -w +L -w +R -w +Z -I src -I +unix -safe-string -bin-annot -strict-sequence -c src/tags.ml
- ocamlc.opt -w +L -w +R -w +Z -I src -I +unix -safe-string -bin-annot -strict-sequence -c src/display.mli
- ocamlc.opt -w +L -w +R -w +Z -I src -I +unix -safe-string -bin-annot -strict-sequence -c src/display.ml
- ocamlc.opt -w +L -w +R -w +Z -I src -I +unix -safe-string -bin-annot -strict-sequence -c src/log.mli
- ocamlc.opt -w +L -w +R -w +Z -I src -I +unix -safe-string -bin-annot -strict-sequence -c src/log.ml
- ocamlc.opt -w +L -w +R -w +Z -I src -I +unix -safe-string -bin-annot -strict-sequence -c src/shell.mli
- ocamlc.opt -w +L -w +R -w +Z -I src -I +unix -safe-string -bin-annot -strict-sequence -c src/shell.ml
- ocamlc.opt -w +L -w +R -w +Z -I src -I +unix -safe-string -bin-annot -strict-sequence -c src/bool.mli
- ocamlc.opt -w +L -w +R -w +Z -I src -I +unix -safe-string -bin-annot -strict-sequence -c src/bool.ml
- ocamlc.opt -w +L -w +R -w +Z -I src -I +unix -safe-string -bin-annot -strict-sequence -c src/glob_ast.mli
- ocamlc.opt -w +L -w +R -w +Z -I src -I +unix -safe-string -bin-annot -strict-sequence -c src/glob_ast.ml
- ocamllex.opt src/glob_lexer.mll
- 55 states, 419 transitions, table size 2006 bytes
- ocamlc.opt -w +L -w +R -w +Z -I src -I +unix -safe-string -bin-annot -strict-sequence -c src/glob_lexer.mli
- ocamlc.opt -w +L -w +R -w +Z -I src -I +unix -safe-string -bin-annot -strict-sequence -c src/glob_lexer.ml
- ocamlc.opt -w +L -w +R -w +Z -I src -I +unix -safe-string -bin-annot -strict-sequence -c src/glob.mli
- ocamlc.opt -w +L -w +R -w +Z -I src -I +unix -safe-string -bin-annot -strict-sequence -c src/glob.ml
- ocamllex.opt src/lexers.mll
- 251 states, 1051 transitions, table size 5710 bytes
- 4334 additional bytes used for bindings
- ocamlc.opt -w +L -w +R -w +Z -I src -I +unix -safe-string -bin-annot -strict-sequence -c src/lexers.mli
- ocamlc.opt -w +L -w +R -w +Z -I src -I +unix -safe-string -bin-annot -strict-sequence -c src/lexers.ml
- ocamlc.opt -w +L -w +R -w +Z -I src -I +unix -safe-string -bin-annot -strict-sequence -c src/param_tags.mli
- ocamlc.opt -w +L -w +R -w +Z -I src -I +unix -safe-string -bin-annot -strict-sequence -c src/param_tags.ml
- ocamlc.opt -w +L -w +R -w +Z -I src -I +unix -safe-string -bin-annot -strict-sequence -c src/command.mli
- ocamlc.opt -w +L -w +R -w +Z -I src -I +unix -safe-string -bin-annot -strict-sequence -c src/command.ml
- ocamlc.opt -w +L -w +R -w +Z -I src -I +unix -safe-string -bin-annot -strict-sequence -c src/ocamlbuild_config.ml
- ocamlc.opt -w +L -w +R -w +Z -I src -I +unix -safe-string -bin-annot -strict-sequence -c src/ocamlbuild_where.mli
- ocamlc.opt -w +L -w +R -w +Z -I src -I +unix -safe-string -bin-annot -strict-sequence -c src/ocamlbuild_where.ml
- ocamlc.opt -w +L -w +R -w +Z -I src -I +unix -safe-string -bin-annot -strict-sequence -c src/slurp.mli
- ocamlc.opt -w +L -w +R -w +Z -I src -I +unix -safe-string -bin-annot -strict-sequence -c src/slurp.ml
- ocamlc.opt -w +L -w +R -w +Z -I src -I +unix -safe-string -bin-annot -strict-sequence -c src/options.mli
- ocamlc.opt -w +L -w +R -w +Z -I src -I +unix -safe-string -bin-annot -strict-sequence -c src/options.ml
- ocamlc.opt -w +L -w +R -w +Z -I src -I +unix -safe-string -bin-annot -strict-sequence -c src/pathname.mli
- ocamlc.opt -w +L -w +R -w +Z -I src -I +unix -safe-string -bin-annot -strict-sequence -c src/pathname.ml
- ocamlc.opt -w +L -w +R -w +Z -I src -I +unix -safe-string -bin-annot -strict-sequence -c src/configuration.mli
- ocamlc.opt -w +L -w +R -w +Z -I src -I +unix -safe-string -bin-annot -strict-sequence -c src/configuration.ml
- ocamlc.opt -w +L -w +R -w +Z -I src -I +unix -safe-string -bin-annot -strict-sequence -c src/flags.mli
- ocamlc.opt -w +L -w +R -w +Z -I src -I +unix -safe-string -bin-annot -strict-sequence -c src/flags.ml
- ocamlc.opt -w +L -w +R -w +Z -I src -I +unix -safe-string -bin-annot -strict-sequence -c src/hygiene.mli
- ocamlc.opt -w +L -w +R -w +Z -I src -I +unix -safe-string -bin-annot -strict-sequence -c src/hygiene.ml
- ocamlc.opt -w +L -w +R -w +Z -I src -I +unix -safe-string -bin-annot -strict-sequence -c src/digest_cache.mli
- ocamlc.opt -w +L -w +R -w +Z -I src -I +unix -safe-string -bin-annot -strict-sequence -c src/digest_cache.ml
- ocamlc.opt -w +L -w +R -w +Z -I src -I +unix -safe-string -bin-annot -strict-sequence -c src/resource.mli
- ocamlc.opt -w +L -w +R -w +Z -I src -I +unix -safe-string -bin-annot -strict-sequence -c src/resource.ml
- ocamlc.opt -w +L -w +R -w +Z -I src -I +unix -safe-string -bin-annot -strict-sequence -c src/rule.mli
- ocamlc.opt -w +L -w +R -w +Z -I src -I +unix -safe-string -bin-annot -strict-sequence -c src/rule.ml
- ocamlc.opt -w +L -w +R -w +Z -I src -I +unix -safe-string -bin-annot -strict-sequence -c src/solver.mli
- ocamlc.opt -w +L -w +R -w +Z -I src -I +unix -safe-string -bin-annot -strict-sequence -c src/solver.ml
- ocamlc.opt -w +L -w +R -w +Z -I src -I +unix -safe-string -bin-annot -strict-sequence -c src/report.mli
- ocamlc.opt -w +L -w +R -w +Z -I src -I +unix -safe-string -bin-annot -strict-sequence -c src/report.ml
- ocamlc.opt -w +L -w +R -w +Z -I src -I +unix -safe-string -bin-annot -strict-sequence -c src/tools.mli
- ocamlc.opt -w +L -w +R -w +Z -I src -I +unix -safe-string -bin-annot -strict-sequence -c src/tools.ml
- ocamlc.opt -w +L -w +R -w +Z -I src -I +unix -safe-string -bin-annot -strict-sequence -c src/fda.mli
- ocamlc.opt -w +L -w +R -w +Z -I src -I +unix -safe-string -bin-annot -strict-sequence -c src/fda.ml
- ocamlc.opt -w +L -w +R -w +Z -I src -I +unix -safe-string -bin-annot -strict-sequence -c src/findlib.mli
- ocamlc.opt -w +L -w +R -w +Z -I src -I +unix -safe-string -bin-annot -strict-sequence -c src/findlib.ml
- ocamlc.opt -w +L -w +R -w +Z -I src -I +unix -safe-string -bin-annot -strict-sequence -c src/ocaml_arch.mli
- ocamlc.opt -w +L -w +R -w +Z -I src -I +unix -safe-string -bin-annot -strict-sequence -c src/ocaml_arch.ml
- ocamlc.opt -w +L -w +R -w +Z -I src -I +unix -safe-string -bin-annot -strict-sequence -c src/ocaml_utils.mli
- ocamlc.opt -w +L -w +R -w +Z -I src -I +unix -safe-string -bin-annot -strict-sequence -c src/ocaml_utils.ml
- ocamlc.opt -w +L -w +R -w +Z -I src -I +unix -safe-string -bin-annot -strict-sequence -c src/ocaml_dependencies.mli
- ocamlc.opt -w +L -w +R -w +Z -I src -I +unix -safe-string -bin-annot -strict-sequence -c src/ocaml_dependencies.ml
- ocamlc.opt -w +L -w +R -w +Z -I src -I +unix -safe-string -bin-annot -strict-sequence -c src/ocaml_compiler.mli
- ocamlc.opt -w +L -w +R -w +Z -I src -I +unix -safe-string -bin-annot -strict-sequence -c src/ocaml_compiler.ml
- ocamlc.opt -w +L -w +R -w +Z -I src -I +unix -safe-string -bin-annot -strict-sequence -c src/ocaml_tools.mli
- ocamlc.opt -w +L -w +R -w +Z -I src -I +unix -safe-string -bin-annot -strict-sequence -c src/ocaml_tools.ml
- ocamlc.opt -w +L -w +R -w +Z -I src -I +unix -safe-string -bin-annot -strict-sequence -c src/ocaml_specific.mli
- ocamlc.opt -w +L -w +R -w +Z -I src -I +unix -safe-string -bin-annot -strict-sequence -c src/ocaml_specific.ml
- ocamlc.opt -w +L -w +R -w +Z -I src -I +unix -safe-string -bin-annot -strict-sequence -c src/exit_codes.mli
- ocamlc.opt -w +L -w +R -w +Z -I src -I +unix -safe-string -bin-annot -strict-sequence -c src/exit_codes.ml
- ocamlc.opt -w +L -w +R -w +Z -I src -I +unix -safe-string -bin-annot -strict-sequence -c src/plugin.mli
- ocamlc.opt -w +L -w +R -w +Z -I src -I +unix -safe-string -bin-annot -strict-sequence -c src/plugin.ml
- ocamlc.opt -w +L -w +R -w +Z -I src -I +unix -safe-string -bin-annot -strict-sequence -c src/hooks.mli
- ocamlc.opt -w +L -w +R -w +Z -I src -I +unix -safe-string -bin-annot -strict-sequence -c src/hooks.ml
- ocamlc.opt -w +L -w +R -w +Z -I src -I +unix -safe-string -bin-annot -strict-sequence -c src/main.mli
- ocamlc.opt -w +L -w +R -w +Z -I src -I +unix -safe-string -bin-annot -strict-sequence -c src/main.ml
- mkdir -p tmp
- ocamlc.opt -pack src/const.cmo src/loc.cmo src/discard_printf.cmo src/signatures.cmi src/my_std.cmo src/my_unix.cmo src/tags.cmo src/display.cmo src/log.cmo src/shell.cmo src/bool.cmo src/glob_ast.cmo src/glob_lexer.cmo src/glob.cmo src/lexers.cmo src/param_tags.cmo src/command.cmo src/ocamlbuild_config.cmo src/ocamlbuild_where.cmo src/slurp.cmo src/options.cmo src/pathname.cmo src/configuration.cmo src/flags.cmo src/hygiene.cmo src/digest_cache.cmo src/resource.cmo src/rule.cmo src/solver.cmo src/report.cmo src/tools.cmo src/fda.cmo src/findlib.cmo src/ocaml_arch.cmo src/ocaml_utils.cmo src/ocaml_dependencies.cmo src/ocaml_compiler.cmo src/ocaml_tools.cmo src/ocaml_specific.cmo src/exit_codes.cmo src/plugin.cmo src/hooks.cmo src/main.cmo -o tmp/ocamlbuild_pack.cmo
- mv tmp/ocamlbuild_pack.cmi src/ocamlbuild_pack.cmi
- mv tmp/ocamlbuild_pack.cmo src/ocamlbuild_pack.cmo
- ocamlc.opt -w +L -w +R -w +Z -I src -I +unix -safe-string -bin-annot -strict-sequence -c src/ocamlbuild_plugin.mli
- ocamlc.opt -w +L -w +R -w +Z -I src -I +unix -safe-string -bin-annot -strict-sequence -c src/ocamlbuild_plugin.ml
- ocamlc.opt -w +L -w +R -w +Z -I src -I +unix -safe-string -bin-annot -strict-sequence -c src/ocamlbuild_executor.mli
- ocamlc.opt -w +L -w +R -w +Z -I src -I +unix -safe-string -bin-annot -strict-sequence -c src/ocamlbuild_executor.ml
- ocamlc.opt -w +L -w +R -w +Z -I src -I +unix -safe-string -bin-annot -strict-sequence -c src/ocamlbuild_unix_plugin.mli
- ocamlc.opt -w +L -w +R -w +Z -I src -I +unix -safe-string -bin-annot -strict-sequence -c src/ocamlbuild_unix_plugin.ml
- ocamlc.opt -w +L -w +R -w +Z -I src -I +unix -safe-string -bin-annot -strict-sequence -c src/ocamlbuild.mli
- ocamlc.opt -w +L -w +R -w +Z -I src -I +unix -safe-string -bin-annot -strict-sequence -c src/ocamlbuild.ml
- ocamlc.opt -I +unix -I src -o ocamlbuild.byte unix.cma src/ocamlbuild_pack.cmo src/ocamlbuild_plugin.cmo src/ocamlbuild_executor.cmo src/ocamlbuild_unix_plugin.cmo src/ocamlbuild.cmo
- ocamlc.opt -a -o src/ocamlbuildlib.cma src/ocamlbuild_pack.cmo src/ocamlbuild_plugin.cmo src/ocamlbuild_executor.cmo src/ocamlbuild_unix_plugin.cmo
- ocamlopt.opt -for-pack Ocamlbuild_pack -w +L -w +R -w +Z -I src -I +unix -safe-string -bin-annot -strict-sequence -c src/const.ml
- ocamlopt.opt -for-pack Ocamlbuild_pack -w +L -w +R -w +Z -I src -I +unix -safe-string -bin-annot -strict-sequence -c src/loc.ml
- ocamlopt.opt -for-pack Ocamlbuild_pack -w +L -w +R -w +Z -I src -I +unix -safe-string -bin-annot -strict-sequence -c src/discard_printf.ml
- ocamlopt.opt -for-pack Ocamlbuild_pack -w +L -w +R -w +Z -I src -I +unix -safe-string -bin-annot -strict-sequence -c src/my_std.ml
- ocamlopt.opt -for-pack Ocamlbuild_pack -w +L -w +R -w +Z -I src -I +unix -safe-string -bin-annot -strict-sequence -c src/my_unix.ml
- ocamlopt.opt -for-pack Ocamlbuild_pack -w +L -w +R -w +Z -I src -I +unix -safe-string -bin-annot -strict-sequence -c src/tags.ml
- ocamlopt.opt -for-pack Ocamlbuild_pack -w +L -w +R -w +Z -I src -I +unix -safe-string -bin-annot -strict-sequence -c src/display.ml
- ocamlopt.opt -for-pack Ocamlbuild_pack -w +L -w +R -w +Z -I src -I +unix -safe-string -bin-annot -strict-sequence -c src/log.ml
- ocamlopt.opt -for-pack Ocamlbuild_pack -w +L -w +R -w +Z -I src -I +unix -safe-string -bin-annot -strict-sequence -c src/shell.ml
- ocamlopt.opt -for-pack Ocamlbuild_pack -w +L -w +R -w +Z -I src -I +unix -safe-string -bin-annot -strict-sequence -c src/bool.ml
- ocamlopt.opt -for-pack Ocamlbuild_pack -w +L -w +R -w +Z -I src -I +unix -safe-string -bin-annot -strict-sequence -c src/glob_ast.ml
- ocamlopt.opt -for-pack Ocamlbuild_pack -w +L -w +R -w +Z -I src -I +unix -safe-string -bin-annot -strict-sequence -c src/glob_lexer.ml
- ocamlopt.opt -for-pack Ocamlbuild_pack -w +L -w +R -w +Z -I src -I +unix -safe-string -bin-annot -strict-sequence -c src/glob.ml
- ocamlopt.opt -for-pack Ocamlbuild_pack -w +L -w +R -w +Z -I src -I +unix -safe-string -bin-annot -strict-sequence -c src/lexers.ml
- ocamlopt.opt -for-pack Ocamlbuild_pack -w +L -w +R -w +Z -I src -I +unix -safe-string -bin-annot -strict-sequence -c src/param_tags.ml
- ocamlopt.opt -for-pack Ocamlbuild_pack -w +L -w +R -w +Z -I src -I +unix -safe-string -bin-annot -strict-sequence -c src/command.ml
- ocamlopt.opt -for-pack Ocamlbuild_pack -w +L -w +R -w +Z -I src -I +unix -safe-string -bin-annot -strict-sequence -c src/ocamlbuild_config.ml
- ocamlopt.opt -for-pack Ocamlbuild_pack -w +L -w +R -w +Z -I src -I +unix -safe-string -bin-annot -strict-sequence -c src/ocamlbuild_where.ml
- ocamlopt.opt -for-pack Ocamlbuild_pack -w +L -w +R -w +Z -I src -I +unix -safe-string -bin-annot -strict-sequence -c src/slurp.ml
- ocamlopt.opt -for-pack Ocamlbuild_pack -w +L -w +R -w +Z -I src -I +unix -safe-string -bin-annot -strict-sequence -c src/options.ml
- ocamlopt.opt -for-pack Ocamlbuild_pack -w +L -w +R -w +Z -I src -I +unix -safe-string -bin-annot -strict-sequence -c src/pathname.ml
- ocamlopt.opt -for-pack Ocamlbuild_pack -w +L -w +R -w +Z -I src -I +unix -safe-string -bin-annot -strict-sequence -c src/configuration.ml
- ocamlopt.opt -for-pack Ocamlbuild_pack -w +L -w +R -w +Z -I src -I +unix -safe-string -bin-annot -strict-sequence -c src/flags.ml
- ocamlopt.opt -for-pack Ocamlbuild_pack -w +L -w +R -w +Z -I src -I +unix -safe-string -bin-annot -strict-sequence -c src/hygiene.ml
- ocamlopt.opt -for-pack Ocamlbuild_pack -w +L -w +R -w +Z -I src -I +unix -safe-string -bin-annot -strict-sequence -c src/digest_cache.ml
- ocamlopt.opt -for-pack Ocamlbuild_pack -w +L -w +R -w +Z -I src -I +unix -safe-string -bin-annot -strict-sequence -c src/resource.ml
- ocamlopt.opt -for-pack Ocamlbuild_pack -w +L -w +R -w +Z -I src -I +unix -safe-string -bin-annot -strict-sequence -c src/rule.ml
- ocamlopt.opt -for-pack Ocamlbuild_pack -w +L -w +R -w +Z -I src -I +unix -safe-string -bin-annot -strict-sequence -c src/solver.ml
- ocamlopt.opt -for-pack Ocamlbuild_pack -w +L -w +R -w +Z -I src -I +unix -safe-string -bin-annot -strict-sequence -c src/report.ml
- ocamlopt.opt -for-pack Ocamlbuild_pack -w +L -w +R -w +Z -I src -I +unix -safe-string -bin-annot -strict-sequence -c src/tools.ml
- ocamlopt.opt -for-pack Ocamlbuild_pack -w +L -w +R -w +Z -I src -I +unix -safe-string -bin-annot -strict-sequence -c src/fda.ml
- ocamlopt.opt -for-pack Ocamlbuild_pack -w +L -w +R -w +Z -I src -I +unix -safe-string -bin-annot -strict-sequence -c src/findlib.ml
- ocamlopt.opt -for-pack Ocamlbuild_pack -w +L -w +R -w +Z -I src -I +unix -safe-string -bin-annot -strict-sequence -c src/ocaml_arch.ml
- ocamlopt.opt -for-pack Ocamlbuild_pack -w +L -w +R -w +Z -I src -I +unix -safe-string -bin-annot -strict-sequence -c src/ocaml_utils.ml
- ocamlopt.opt -for-pack Ocamlbuild_pack -w +L -w +R -w +Z -I src -I +unix -safe-string -bin-annot -strict-sequence -c src/ocaml_dependencies.ml
- ocamlopt.opt -for-pack Ocamlbuild_pack -w +L -w +R -w +Z -I src -I +unix -safe-string -bin-annot -strict-sequence -c src/ocaml_compiler.ml
- ocamlopt.opt -for-pack Ocamlbuild_pack -w +L -w +R -w +Z -I src -I +unix -safe-string -bin-annot -strict-sequence -c src/ocaml_tools.ml
- ocamlopt.opt -for-pack Ocamlbuild_pack -w +L -w +R -w +Z -I src -I +unix -safe-string -bin-annot -strict-sequence -c src/ocaml_specific.ml
- ocamlopt.opt -for-pack Ocamlbuild_pack -w +L -w +R -w +Z -I src -I +unix -safe-string -bin-annot -strict-sequence -c src/exit_codes.ml
- ocamlopt.opt -for-pack Ocamlbuild_pack -w +L -w +R -w +Z -I src -I +unix -safe-string -bin-annot -strict-sequence -c src/plugin.ml
- ocamlopt.opt -for-pack Ocamlbuild_pack -w +L -w +R -w +Z -I src -I +unix -safe-string -bin-annot -strict-sequence -c src/hooks.ml
- ocamlopt.opt -for-pack Ocamlbuild_pack -w +L -w +R -w +Z -I src -I +unix -safe-string -bin-annot -strict-sequence -c src/main.ml
- mkdir -p tmp
- ocamlopt.opt -pack src/const.cmx src/loc.cmx src/discard_printf.cmx src/signatures.cmi src/my_std.cmx src/my_unix.cmx src/tags.cmx src/display.cmx src/log.cmx src/shell.cmx src/bool.cmx src/glob_ast.cmx src/glob_lexer.cmx src/glob.cmx src/lexers.cmx src/param_tags.cmx src/command.cmx src/ocamlbuild_config.cmx src/ocamlbuild_where.cmx src/slurp.cmx src/options.cmx src/pathname.cmx src/configuration.cmx src/flags.cmx src/hygiene.cmx src/digest_cache.cmx src/resource.cmx src/rule.cmx src/solver.cmx src/report.cmx src/tools.cmx src/fda.cmx src/findlib.cmx src/ocaml_arch.cmx src/ocaml_utils.cmx src/ocaml_dependencies.cmx src/ocaml_compiler.cmx src/ocaml_tools.cmx src/ocaml_specific.cmx src/exit_codes.cmx src/plugin.cmx src/hooks.cmx src/main.cmx -o tmp/ocamlbuild_pack.cmx
- mv tmp/ocamlbuild_pack.cmx src/ocamlbuild_pack.cmx
- mv tmp/ocamlbuild_pack.o src/ocamlbuild_pack.o
- ocamlopt.opt -for-pack Ocamlbuild_pack -w +L -w +R -w +Z -I src -I +unix -safe-string -bin-annot -strict-sequence -c src/ocamlbuild_plugin.ml
- ocamlopt.opt -for-pack Ocamlbuild_pack -w +L -w +R -w +Z -I src -I +unix -safe-string -bin-annot -strict-sequence -c src/ocamlbuild_executor.ml
- ocamlopt.opt -for-pack Ocamlbuild_pack -w +L -w +R -w +Z -I src -I +unix -safe-string -bin-annot -strict-sequence -c src/ocamlbuild_unix_plugin.ml
- ocamlopt.opt -for-pack Ocamlbuild_pack -w +L -w +R -w +Z -I src -I +unix -safe-string -bin-annot -strict-sequence -c src/ocamlbuild.ml
- ocamlopt.opt -I +unix -I src -o ocamlbuild.native unix.cmxa src/ocamlbuild_pack.cmx src/ocamlbuild_plugin.cmx src/ocamlbuild_executor.cmx src/ocamlbuild_unix_plugin.cmx src/ocamlbuild.cmx
- ocamlopt.opt -a -o src/ocamlbuildlib.cmxa src/ocamlbuild_pack.cmx src/ocamlbuild_plugin.cmx src/ocamlbuild_executor.cmx src/ocamlbuild_unix_plugin.cmx
- ocamlc.opt src/ocamlbuild_pack.cmo -I src man/options_man.ml -o man/options_man.byte
- ./man/options_man.byte > man/ocamlbuild.options.1
- cat man/ocamlbuild.header.1 man/ocamlbuild.options.1 man/ocamlbuild.footer.1 > man/ocamlbuild.1
- make ocamlbuild.install
- make[1]: Entering directory '/home/opam/.opam/5.0/.opam-switch/build/ocamlbuild.0.14.1'
- rm -f ocamlbuild.install
- touch ocamlbuild.install
- make install-bin-opam
- make[2]: Entering directory '/home/opam/.opam/5.0/.opam-switch/build/ocamlbuild.0.14.1'
- echo 'bin: [' >> ocamlbuild.install
- echo '  "ocamlbuild.byte" {"ocamlbuild.byte"}' >> ocamlbuild.install
- echo '  "ocamlbuild.native" {"ocamlbuild.native"}' >> ocamlbuild.install
- echo '  "ocamlbuild.native" {"ocamlbuild"}' >> ocamlbuild.install
- echo ']' >> ocamlbuild.install
- echo >> ocamlbuild.install
- make[2]: Leaving directory '/home/opam/.opam/5.0/.opam-switch/build/ocamlbuild.0.14.1'
- make install-lib-opam
- make[2]: Entering directory '/home/opam/.opam/5.0/.opam-switch/build/ocamlbuild.0.14.1'
- echo 'lib: [' >> ocamlbuild.install
- make install-lib-basics-opam
- make[3]: Entering directory '/home/opam/.opam/5.0/.opam-switch/build/ocamlbuild.0.14.1'
- echo '  "ocamlbuild.opam" {"opam"}' >> ocamlbuild.install
- echo '  "META"' >> ocamlbuild.install
- for lib in src/signatures.mli src/signatures.cmi src/signatures.cmti; do \
-   echo "  \"$lib\" {\"$(basename $lib)\"}" >> ocamlbuild.install; \
- done
- make[3]: Leaving directory '/home/opam/.opam/5.0/.opam-switch/build/ocamlbuild.0.14.1'
- make install-lib-byte-opam
- make[3]: Entering directory '/home/opam/.opam/5.0/.opam-switch/build/ocamlbuild.0.14.1'
- for lib in src/ocamlbuildlib.cma src/ocamlbuild.cmo src/ocamlbuild_pack.cmi src/ocamlbuild_plugin.cmi src/ocamlbuild_executor.cmi src/ocamlbuild_unix_plugin.cmi; do \
-   echo "  \"$lib\" {\"$(basename $lib)\"}" >> ocamlbuild.install; \
- done
- make[3]: Leaving directory '/home/opam/.opam/5.0/.opam-switch/build/ocamlbuild.0.14.1'
- make install-lib-native-opam
- make[3]: Entering directory '/home/opam/.opam/5.0/.opam-switch/build/ocamlbuild.0.14.1'
- for lib in src/ocamlbuildlib.cmxa src/ocamlbuildlib.a src/ocamlbuild.cmx src/ocamlbuild.o src/ocamlbuild_pack.cmx src/ocamlbuild_plugin.cmx src/ocamlbuild_executor.cmx src/ocamlbuild_unix_plugin.cmx src/ocamlbuild_plugin.o src/ocamlbuild_executor.o src/ocamlbuild_unix_plugin.o; do \
-   echo "  \"$lib\" {\"$(basename $lib)\"}" >> ocamlbuild.install; \
- done
- make[3]: Leaving directory '/home/opam/.opam/5.0/.opam-switch/build/ocamlbuild.0.14.1'
- echo ']' >> ocamlbuild.install
- echo >> ocamlbuild.install
- make[2]: Leaving directory '/home/opam/.opam/5.0/.opam-switch/build/ocamlbuild.0.14.1'
- make install-man-opam
- make[2]: Entering directory '/home/opam/.opam/5.0/.opam-switch/build/ocamlbuild.0.14.1'
- echo 'man: [' >> ocamlbuild.install
- echo '  "man/ocamlbuild.1" {"man1/ocamlbuild.1"}' >> ocamlbuild.install
- echo ']' >> ocamlbuild.install
- echo >> ocamlbuild.install
- make[2]: Leaving directory '/home/opam/.opam/5.0/.opam-switch/build/ocamlbuild.0.14.1'
- make install-doc-opam
- make[2]: Entering directory '/home/opam/.opam/5.0/.opam-switch/build/ocamlbuild.0.14.1'
- echo 'doc: [' >> ocamlbuild.install
- echo '  "LICENSE"' >> ocamlbuild.install
- echo '  "Changes"' >> ocamlbuild.install
- echo '  "Readme.md"' >> ocamlbuild.install
- echo ']' >> ocamlbuild.install
- make[2]: Leaving directory '/home/opam/.opam/5.0/.opam-switch/build/ocamlbuild.0.14.1'
- make[1]: Leaving directory '/home/opam/.opam/5.0/.opam-switch/build/ocamlbuild.0.14.1'
-> compiled  ocamlbuild.0.14.1
Processing 127/331: [dune: ocaml bootstrap.ml]
-> installed ocamlbuild.0.14.1
Processing 128/331: [dune: ocaml bootstrap.ml]
Processing 129/331: [dune: ocaml bootstrap.ml] [ocamlify: ocaml setup.ml]
Processing 130/331: [dune: ocaml bootstrap.ml] [ocamlify: ocaml setup.ml] [ocamlmod: ocaml setup.ml]
Processing 131/331: [dune: ocaml bootstrap.ml] [ocamlify: ocaml setup.ml] [ocamlmod: ocaml setup.ml] [topkg: ocaml build]
+ /home/opam/.opam/opam-init/hooks/sandbox.sh "build" "ocaml" "setup.ml" "-configure" "--prefix" "/home/opam/.opam/5.0" (CWD=/home/opam/.opam/5.0/.opam-switch/build/ocamlify.0.0.1)
- File "/home/gildor/programmation/oasis/src/oasis/PropList.ml", line 93, characters 13-29:
- Error: Unbound value String.lowercase
[ERROR] The compilation of ocamlify.0.0.1 failed at "ocaml setup.ml -configure --prefix /home/opam/.opam/5.0".
Processing 131/331: [dune: ocaml bootstrap.ml] [ocamlmod: ocaml setup.ml] [topkg: ocaml build]
Processing 132/331: [dune: ocaml bootstrap.ml] [ocamlmod: ocaml setup.ml] [topkg: ocaml build]
+ /home/opam/.opam/opam-init/hooks/sandbox.sh "build" "ocaml" "setup.ml" "-configure" "--prefix" "/home/opam/.opam/5.0" (CWD=/home/opam/.opam/5.0/.opam-switch/build/ocamlmod.0.0.9)
- File "./setup.ml", line 596, characters 4-15:
- 596 |     Stream.from next
-           ^^^^^^^^^^^
- Error: Unbound module Stream
[ERROR] The compilation of ocamlmod.0.0.9 failed at "ocaml setup.ml -configure --prefix /home/opam/.opam/5.0".
Processing 132/331: [dune: ocaml bootstrap.ml] [topkg: ocaml build]
Processing 133/331: [dune: ocaml bootstrap.ml] [topkg: ocaml build]
Processing 134/331: [dune: ocaml bootstrap.ml] [topkg: ocaml build]
Processing 135/331: [dune: ocaml bootstrap.ml] [topkg: ocaml build]
Processing 136/331: [dune: ocaml bootstrap.ml] [topkg: ocaml build]
Processing 137/331: [dune: ocaml bootstrap.ml] [topkg: ocaml build]
+ /home/opam/.opam/opam-init/hooks/sandbox.sh "build" "ocaml" "pkg/pkg.ml" "build" "--pkg-name" "topkg" "--dev-pkg" "false" (CWD=/home/opam/.opam/5.0/.opam-switch/build/topkg.1.0.5)
- ocamlfind ocamldep -modules src/topkg.ml > src/topkg.ml.depends
- ocamlfind ocamldep -modules src/topkg.mli > src/topkg.mli.depends
- ocamlfind ocamlc -c -g -bin-annot -safe-string -I src -I test -I src-care -I src-bin -o src/topkg.cmi src/topkg.mli
- ocamlfind ocamldep -modules src/topkg_build.ml > src/topkg_build.ml.depends
- ocamlfind ocamldep -modules src/topkg_build.mli > src/topkg_build.mli.depends
- ocamlfind ocamldep -modules src/topkg_cmd.mli > src/topkg_cmd.mli.depends
- ocamlfind ocamldep -modules src/topkg_fpath.mli > src/topkg_fpath.mli.depends
- ocamlfind ocamlc -c -g -bin-annot -safe-string -I src -I test -I src-care -I src-bin -o src/topkg_fpath.cmi src/topkg_fpath.mli
- ocamlfind ocamldep -modules src/topkg_codec.mli > src/topkg_codec.mli.depends
- ocamlfind ocamlc -c -g -bin-annot -safe-string -I src -I test -I src-care -I src-bin -o src/topkg_cmd.cmi src/topkg_cmd.mli
- ocamlfind ocamldep -modules src/topkg_result.mli > src/topkg_result.mli.depends
- ocamlfind ocamlc -c -g -bin-annot -safe-string -I src -I test -I src-care -I src-bin -o src/topkg_result.cmi src/topkg_result.mli
- ocamlfind ocamldep -modules src/topkg_conf.mli > src/topkg_conf.mli.depends
- ocamlfind ocamlc -c -g -bin-annot -safe-string -I src -I test -I src-care -I src-bin -o src/topkg_codec.cmi src/topkg_codec.mli
- ocamlfind ocamlc -c -g -bin-annot -safe-string -I src -I test -I src-care -I src-bin -o src/topkg_conf.cmi src/topkg_conf.mli
- ocamlfind ocamlc -c -g -bin-annot -safe-string -I src -I test -I src-care -I src-bin -o src/topkg_build.cmi src/topkg_build.mli
- ocamlfind ocamldep -modules src/topkg_cmd.ml > src/topkg_cmd.ml.depends
- ocamlfind ocamldep -modules src/topkg_fpath.ml > src/topkg_fpath.ml.depends
- ocamlfind ocamldep -modules src/topkg_string.ml > src/topkg_string.ml.depends
- ocamlfind ocamldep -modules src/topkg_string.mli > src/topkg_string.mli.depends
- ocamlfind ocamlc -c -g -bin-annot -safe-string -I src -I test -I src-care -I src-bin -o src/topkg_string.cmi src/topkg_string.mli
- ocamlfind ocamlopt -c -g -bin-annot -safe-string -I src -I test -I src-care -I src-bin -o src/topkg_string.cmx src/topkg_string.ml
- ocamlfind ocamlopt -c -g -bin-annot -safe-string -I src -I test -I src-care -I src-bin -o src/topkg_fpath.cmx src/topkg_fpath.ml
- ocamlfind ocamldep -modules src/topkg_codec.ml > src/topkg_codec.ml.depends
- ocamlfind ocamlopt -c -g -bin-annot -safe-string -I src -I test -I src-care -I src-bin -o src/topkg_cmd.cmx src/topkg_cmd.ml
- ocamlfind ocamldep -modules src/topkg_os.ml > src/topkg_os.ml.depends
- ocamlfind ocamldep -modules src/topkg_os.mli > src/topkg_os.mli.depends
- ocamlfind ocamlc -c -g -bin-annot -safe-string -I src -I test -I src-care -I src-bin -o src/topkg_os.cmi src/topkg_os.mli
- ocamlfind ocamldep -modules src/topkg_log.ml > src/topkg_log.ml.depends
- ocamlfind ocamldep -modules src/topkg_log.mli > src/topkg_log.mli.depends
- ocamlfind ocamlc -c -g -bin-annot -safe-string -I src -I test -I src-care -I src-bin -o src/topkg_log.cmi src/topkg_log.mli
- ocamlfind ocamldep -modules src/topkg_result.ml > src/topkg_result.ml.depends
- ocamlfind ocamlopt -c -g -bin-annot -safe-string -I src -I test -I src-care -I src-bin -o src/topkg_result.cmx src/topkg_result.ml
- ocamlfind ocamlopt -c -g -bin-annot -safe-string -I src -I test -I src-care -I src-bin -o src/topkg_log.cmx src/topkg_log.ml
- ocamlfind ocamlopt -c -g -bin-annot -safe-string -I src -I test -I src-care -I src-bin -o src/topkg_os.cmx src/topkg_os.ml
- ocamlfind ocamldep -modules src/topkg_conf.ml > src/topkg_conf.ml.depends
- ocamlfind ocamlopt -c -g -bin-annot -safe-string -I src -I test -I src-care -I src-bin -o src/topkg_codec.cmx src/topkg_codec.ml
- ocamlfind ocamldep -modules src/topkg_vcs.ml > src/topkg_vcs.ml.depends
- ocamlfind ocamldep -modules src/topkg_vcs.mli > src/topkg_vcs.mli.depends
- ocamlfind ocamlc -c -g -bin-annot -safe-string -I src -I test -I src-care -I src-bin -o src/topkg_vcs.cmi src/topkg_vcs.mli
- ocamlfind ocamlopt -c -g -bin-annot -safe-string -I src -I test -I src-care -I src-bin -o src/topkg_vcs.cmx src/topkg_vcs.ml
- ocamlfind ocamlopt -c -g -bin-annot -safe-string -I src -I test -I src-care -I src-bin -o src/topkg_conf.cmx src/topkg_conf.ml
- ocamlfind ocamldep -modules src/topkg_distrib.ml > src/topkg_distrib.ml.depends
- ocamlfind ocamldep -modules src/topkg_distrib.mli > src/topkg_distrib.mli.depends
- ocamlfind ocamlc -c -g -bin-annot -safe-string -I src -I test -I src-care -I src-bin -o src/topkg_distrib.cmi src/topkg_distrib.mli
- ocamlfind ocamldep -modules src/topkg_opam.ml > src/topkg_opam.ml.depends
- ocamlfind ocamldep -modules src/topkg_opam.mli > src/topkg_opam.mli.depends
- ocamlfind ocamlc -c -g -bin-annot -safe-string -I src -I test -I src-care -I src-bin -o src/topkg_opam.cmi src/topkg_opam.mli
- ocamlfind ocamlopt -c -g -bin-annot -safe-string -I src -I test -I src-care -I src-bin -o src/topkg_opam.cmx src/topkg_opam.ml
- ocamlfind ocamldep -modules src/topkg_fexts.ml > src/topkg_fexts.ml.depends
- ocamlfind ocamldep -modules src/topkg_fexts.mli > src/topkg_fexts.mli.depends
- ocamlfind ocamlc -c -g -bin-annot -safe-string -I src -I test -I src-care -I src-bin -o src/topkg_fexts.cmi src/topkg_fexts.mli
- ocamlfind ocamldep -modules src/topkg_install.ml > src/topkg_install.ml.depends
- ocamlfind ocamldep -modules src/topkg_install.mli > src/topkg_install.mli.depends
- ocamlfind ocamldep -modules src/topkg_test.mli > src/topkg_test.mli.depends
- ocamlfind ocamlc -c -g -bin-annot -safe-string -I src -I test -I src-care -I src-bin -o src/topkg_test.cmi src/topkg_test.mli
- ocamlfind ocamlc -c -g -bin-annot -safe-string -I src -I test -I src-care -I src-bin -o src/topkg_install.cmi src/topkg_install.mli
- ocamlfind ocamlopt -c -g -bin-annot -safe-string -I src -I test -I src-care -I src-bin -o src/topkg_fexts.cmx src/topkg_fexts.ml
- ocamlfind ocamldep -modules src/topkg_test.ml > src/topkg_test.ml.depends
- ocamlfind ocamlopt -c -g -bin-annot -safe-string -I src -I test -I src-care -I src-bin -o src/topkg_test.cmx src/topkg_test.ml
- ocamlfind ocamldep -modules src/topkg_ipc.ml > src/topkg_ipc.ml.depends
- ocamlfind ocamldep -modules src/topkg_ipc.mli > src/topkg_ipc.mli.depends
- ocamlfind ocamldep -modules src/topkg_pkg.mli > src/topkg_pkg.mli.depends
- ocamlfind ocamldep -modules src/topkg_publish.mli > src/topkg_publish.mli.depends
- ocamlfind ocamlc -c -g -bin-annot -safe-string -I src -I test -I src-care -I src-bin -o src/topkg_publish.cmi src/topkg_publish.mli
- ocamlfind ocamlc -c -g -bin-annot -safe-string -I src -I test -I src-care -I src-bin -o src/topkg_pkg.cmi src/topkg_pkg.mli
- ocamlfind ocamlc -c -g -bin-annot -safe-string -I src -I test -I src-care -I src-bin -o src/topkg_ipc.cmi src/topkg_ipc.mli
- ocamlfind ocamldep -modules src/topkg_pkg.ml > src/topkg_pkg.ml.depends
- ocamlfind ocamlopt -c -g -bin-annot -safe-string -I src -I test -I src-care -I src-bin -o src/topkg_build.cmx src/topkg_build.ml
- ocamlfind ocamlopt -c -g -bin-annot -safe-string -I src -I test -I src-care -I src-bin -o src/topkg_distrib.cmx src/topkg_distrib.ml
- ocamlfind ocamlopt -c -g -bin-annot -safe-string -I src -I test -I src-care -I src-bin -o src/topkg_install.cmx src/topkg_install.ml
- ocamlfind ocamldep -modules src/topkg_publish.ml > src/topkg_publish.ml.depends
- ocamlfind ocamlopt -c -g -bin-annot -safe-string -I src -I test -I src-care -I src-bin -o src/topkg_publish.cmx src/topkg_publish.ml
- ocamlfind ocamlopt -c -g -bin-annot -safe-string -I src -I test -I src-care -I src-bin -o src/topkg_pkg.cmx src/topkg_pkg.ml
- ocamlfind ocamldep -modules src/topkg_main.ml > src/topkg_main.ml.depends
- ocamlfind ocamldep -modules src/topkg_main.mli > src/topkg_main.mli.depends
- ocamlfind ocamlc -c -g -bin-annot -safe-string -I src -I test -I src-care -I src-bin -o src/topkg_main.cmi src/topkg_main.mli
- ocamlfind ocamlopt -c -g -bin-annot -safe-string -I src -I test -I src-care -I src-bin -o src/topkg_ipc.cmx src/topkg_ipc.ml
- ocamlfind ocamlopt -c -g -bin-annot -safe-string -I src -I test -I src-care -I src-bin -o src/topkg_main.cmx src/topkg_main.ml
- ocamlfind ocamlopt -c -g -bin-annot -safe-string -I src -I test -I src-care -I src-bin -o src/topkg.cmx src/topkg.ml
- ocamlfind ocamlopt -a -I src src/topkg_string.cmx src/topkg_fpath.cmx src/topkg_cmd.cmx src/topkg_result.cmx src/topkg_log.cmx src/topkg_os.cmx src/topkg_codec.cmx src/topkg_vcs.cmx src/topkg_conf.cmx src/topkg_build.cmx src/topkg_opam.cmx src/topkg_distrib.cmx src/topkg_fexts.cmx src/topkg_test.cmx src/topkg_install.cmx src/topkg_publish.cmx src/topkg_pkg.cmx src/topkg_ipc.cmx src/topkg_main.cmx src/topkg.cmx -o src/topkg.cmxa
- ocamlfind ocamlopt -shared -linkall -I src src/topkg.cmxa -o src/topkg.cmxs
- ocamlfind ocamlc -c -g -bin-annot -safe-string -I src -I test -I src-care -I src-bin -o src/topkg.cmo src/topkg.ml
- ocamlfind ocamlc -c -g -bin-annot -safe-string -I src -I test -I src-care -I src-bin -o src/topkg_build.cmo src/topkg_build.ml
- ocamlfind ocamlc -c -g -bin-annot -safe-string -I src -I test -I src-care -I src-bin -o src/topkg_cmd.cmo src/topkg_cmd.ml
- ocamlfind ocamlc -c -g -bin-annot -safe-string -I src -I test -I src-care -I src-bin -o src/topkg_codec.cmo src/topkg_codec.ml
- ocamlfind ocamlc -c -g -bin-annot -safe-string -I src -I test -I src-care -I src-bin -o src/topkg_conf.cmo src/topkg_conf.ml
- ocamlfind ocamlc -c -g -bin-annot -safe-string -I src -I test -I src-care -I src-bin -o src/topkg_distrib.cmo src/topkg_distrib.ml
- ocamlfind ocamlc -c -g -bin-annot -safe-string -I src -I test -I src-care -I src-bin -o src/topkg_fexts.cmo src/topkg_fexts.ml
- ocamlfind ocamlc -c -g -bin-annot -safe-string -I src -I test -I src-care -I src-bin -o src/topkg_fpath.cmo src/topkg_fpath.ml
- ocamlfind ocamlc -c -g -bin-annot -safe-string -I src -I test -I src-care -I src-bin -o src/topkg_install.cmo src/topkg_install.ml
- ocamlfind ocamlc -c -g -bin-annot -safe-string -I src -I test -I src-care -I src-bin -o src/topkg_ipc.cmo src/topkg_ipc.ml
- ocamlfind ocamlc -c -g -bin-annot -safe-string -I src -I test -I src-care -I src-bin -o src/topkg_log.cmo src/topkg_log.ml
- ocamlfind ocamlc -c -g -bin-annot -safe-string -I src -I test -I src-care -I src-bin -o src/topkg_main.cmo src/topkg_main.ml
- ocamlfind ocamlc -c -g -bin-annot -safe-string -I src -I test -I src-care -I src-bin -o src/topkg_opam.cmo src/topkg_opam.ml
- ocamlfind ocamlc -c -g -bin-annot -safe-string -I src -I test -I src-care -I src-bin -o src/topkg_os.cmo src/topkg_os.ml
- ocamlfind ocamlc -c -g -bin-annot -safe-string -I src -I test -I src-care -I src-bin -o src/topkg_pkg.cmo src/topkg_pkg.ml
- ocamlfind ocamlc -c -g -bin-annot -safe-string -I src -I test -I src-care -I src-bin -o src/topkg_publish.cmo src/topkg_publish.ml
- ocamlfind ocamlc -c -g -bin-annot -safe-string -I src -I test -I src-care -I src-bin -o src/topkg_result.cmo src/topkg_result.ml
- ocamlfind ocamlc -c -g -bin-annot -safe-string -I src -I test -I src-care -I src-bin -o src/topkg_string.cmo src/topkg_string.ml
- ocamlfind ocamlc -c -g -bin-annot -safe-string -I src -I test -I src-care -I src-bin -o src/topkg_test.cmo src/topkg_test.ml
- ocamlfind ocamlc -c -g -bin-annot -safe-string -I src -I test -I src-care -I src-bin -o src/topkg_vcs.cmo src/topkg_vcs.ml
- ocamlfind ocamlc -a -I src src/topkg_string.cmo src/topkg_fpath.cmo src/topkg_cmd.cmo src/topkg_result.cmo src/topkg_log.cmo src/topkg_os.cmo src/topkg_codec.cmo src/topkg_vcs.cmo src/topkg_conf.cmo src/topkg_build.cmo src/topkg_opam.cmo src/topkg_distrib.cmo src/topkg_fexts.cmo src/topkg_test.cmo src/topkg_install.cmo src/topkg_publish.cmo src/topkg_pkg.cmo src/topkg_ipc.cmo src/topkg_main.cmo src/topkg.cmo -o src/topkg.cma
- # Parallel statistics: { count(total): 2(84), max: 20, min: 2, average(total): 11.000(1.238) }
-> compiled  topkg.1.0.5
Processing 137/331: [dune: ocaml bootstrap.ml]
-> installed topkg.1.0.5
Processing 138/331: [dune: ocaml bootstrap.ml]
Processing 139/331: [dune: ocaml bootstrap.ml] [react: ocaml build]
Processing 140/331: [dune: ocaml bootstrap.ml] [react: ocaml build] [uuidm: ocaml build]
+ /home/opam/.opam/opam-init/hooks/sandbox.sh "build" "ocaml" "pkg/pkg.ml" "build" "--dev-pkg" "false" "--with-cmdliner" "true" (CWD=/home/opam/.opam/5.0/.opam-switch/build/uuidm.0.9.8)
- ocamlfind ocamldep -modules src/uuidm.ml > src/uuidm.ml.depends
- ocamlfind ocamldep -modules src/uuidm.mli > src/uuidm.mli.depends
- ocamlfind ocamlc -c -g -bin-annot -safe-string -I src -I test -o src/uuidm.cmi src/uuidm.mli
- ocamlfind ocamlopt -c -g -bin-annot -safe-string -I src -I test -o src/uuidm.cmx src/uuidm.ml
- ocamlfind ocamlopt -a -I src src/uuidm.cmx -o src/uuidm.cmxa
- ocamlfind ocamlopt -shared -linkall -I src src/uuidm.cmxa -o src/uuidm.cmxs
- ocamlfind ocamlc -c -g -bin-annot -safe-string -I src -I test -o src/uuidm.cmo src/uuidm.ml
- ocamlfind ocamlc -a -I src src/uuidm.cmo -o src/uuidm.cma
- ocamlfind ocamldep -package cmdliner -modules test/uuidtrip.ml > test/uuidtrip.ml.depends
- ocamlfind ocamlc -c -g -bin-annot -safe-string -package cmdliner -I test -I src -o test/uuidtrip.cmo test/uuidtrip.ml
- ocamlfind ocamlopt -c -g -bin-annot -safe-string -package cmdliner -I test -I src -o test/uuidtrip.cmx test/uuidtrip.ml
- ocamlfind ocamlopt -linkpkg -g -package cmdliner -I src -I test src/uuidm.cmx test/uuidtrip.cmx -o test/uuidtrip.native
- # No parallelism done
-> compiled  uuidm.0.9.8
Processing 140/331: [dune: ocaml bootstrap.ml] [react: ocaml build]
-> installed uuidm.0.9.8
Processing 141/331: [dune: ocaml bootstrap.ml] [react: ocaml build]
+ /home/opam/.opam/opam-init/hooks/sandbox.sh "build" "ocaml" "pkg/pkg.ml" "build" "--dev-pkg" "false" (CWD=/home/opam/.opam/5.0/.opam-switch/build/react.1.2.2)
- ocamlfind ocamldep -modules src/react.ml > src/react.ml.depends
- ocamlfind ocamldep -modules src/react.mli > src/react.mli.depends
- ocamlfind ocamlc -c -g -bin-annot -safe-string -I src -I test -o src/react.cmi src/react.mli
- ocamlfind ocamlopt -c -g -bin-annot -safe-string -I src -I test -o src/react.cmx src/react.ml
- ocamlfind ocamlopt -a -I src src/react.cmx -o src/react.cmxa
- ocamlfind ocamlopt -shared -linkall -I src src/react.cmxa -o src/react.cmxs
- ocamlfind ocamlc -c -g -bin-annot -safe-string -I src -I test -o src/react.cmo src/react.ml
- ocamlfind ocamlc -a -I src src/react.cmo -o src/react.cma
- ocamlfind ocamldep -package compiler-libs.toplevel -modules src/react_top.ml > src/react_top.ml.depends
- ocamlfind ocamlc -c -g -bin-annot -safe-string -package compiler-libs.toplevel -I src -I test -o src/react_top.cmo src/react_top.ml
- ocamlfind ocamlopt -c -g -bin-annot -safe-string -package compiler-libs.toplevel -I src -I test -o src/react_top.cmx src/react_top.ml
- ocamlfind ocamlopt -a -package compiler-libs.toplevel -I src src/react_top.cmx -o src/react_top.cmxa
- ocamlfind ocamlopt -shared -linkall -package compiler-libs.toplevel -I src src/react_top.cmxa -o src/react_top.cmxs
- ocamlfind ocamlc -a -package compiler-libs.toplevel -I src src/react_top.cmo -o src/react_top.cma
- # No parallelism done
-> compiled  react.1.2.2
Processing 141/331: [dune: ocaml bootstrap.ml]
-> installed react.1.2.2
Processing 142/331: [dune: ocaml bootstrap.ml]
+ /home/opam/.opam/opam-init/hooks/sandbox.sh "build" "ocaml" "bootstrap.ml" "-j" "31" (CWD=/home/opam/.opam/5.0/.opam-switch/build/dune.3.1.1)
- ocamlc -output-complete-exe -w -24 -g -o .duneboot.exe -I boot unix.cma boot/libs.ml boot/duneboot.ml
- ./.duneboot.exe -j 31
- cd _boot && /home/opam/.opam/5.0/bin/ocamlopt.opt -c -g -no-alias-deps -w -49-6 -alert -unstable -I +threads build_path_prefix_map.ml
- File "vendor/build_path_prefix_map/src/build_path_prefix_map.ml", line 5, characters 17-31:
- Alert deprecated: Stdlib.Printf.kprintf
- Use Printf.ksprintf instead.
- cd _boot && /home/opam/.opam/5.0/bin/ocamlopt.opt -c -g -no-alias-deps -w -49-6 -alert -unstable -I +threads opamLexer.ml
- File "vendor/opam-file-format/src/opamLexer.mll", line 21, characters 2-16:
- Alert deprecated: Stdlib.Printf.kprintf
- Use Printf.ksprintf instead.
- 

Processing 142/331: [dune: ./dune.exe build]
+ /home/opam/.opam/opam-init/hooks/sandbox.sh "build" "./dune.exe" "build" "dune.install" "--release" "--profile" "dune-bootstrap" "-j" "31" (CWD=/home/opam/.opam/5.0/.opam-switch/build/dune.3.1.1)
-> compiled  dune.3.1.1
-> installed dune.3.1.1
Processing 144/331: [bigarray-compat: dune build]
Processing 145/331: [bigarray-compat: dune build] [bigstringaf: dune build]
Processing 146/331: [bigarray-compat: dune build] [bigstringaf: dune build] [camomile: ocaml configure.ml]
Processing 147/331: [bigarray-compat: dune build] [bigstringaf: dune build] [camomile: ocaml configure.ml] [cppo: dune build]
Processing 148/331: [bigarray-compat: dune build] [bigstringaf: dune build] [camomile: ocaml configure.ml] [cppo: dune build] [csexp: dune build]
Processing 149/331: [bigarray-compat: dune build] [bigstringaf: dune build] [camomile: ocaml configure.ml] [cppo: dune build] [csexp: dune build] [jane-street-headers: dune build]
Processing 150/331: [bigarray-compat: dune build] [bigstringaf: dune build] [camomile: ocaml configure.ml] [cppo: dune build] [csexp: dune build] [jane-street-headers: dune build] [ocaml-compiler-libs: dune build]
Processing 151/331: [bigarray-compat: dune build] [bigstringaf: dune build] [camomile: ocaml configure.ml] [cppo: dune build] [csexp: dune build] [jane-street-headers: dune build] [ocaml-compiler-libs: dune build] [ocaml-syntax-shims: dune build]
Processing 152/331: [bigarray-compat: dune build] [bigstringaf: dune build] [camomile: ocaml configure.ml] [cppo: dune build] [csexp: dune build] [jane-street-headers: dune build] [ocaml-compiler-libs: dune build] [ocaml-syntax-shims: dune build] [octavius: dune build]
Processing 153/331: [bigarray-compat: dune build] [bigstringaf: dune build] [camomile: ocaml configure.ml] [cppo: dune build] [csexp: dune build] [jane-street-headers: dune build] [ocaml-compiler-libs: dune build] [ocaml-syntax-shims: dune build] [octavius: dune build] [ppx_derivers: dune build]
Processing 154/331: [bigarray-compat: dune build] [bigstringaf: dune build] [camomile: ocaml configure.ml] [cppo: dune build] [csexp: dune build] [jane-street-headers: dune build] [ocaml-compiler-libs: dune build] [ocaml-syntax-shims: dune build] [octavius: dune build] [ppx_derivers: dune build] [re: dune build]
Processing 155/331: [bigarray-compat: dune build] [bigstringaf: dune build] [camomile: ocaml configure.ml] [cppo: dune build] [csexp: dune build] [jane-street-headers: dune build] [ocaml-compiler-libs: dune build] [ocaml-syntax-shims: dune build] [octavius: dune build] [ppx_derivers: dune build] [re: dune build] [result: dune build]
Processing 156/331: [bigarray-compat: dune build] [bigstringaf: dune build] [camomile: ocaml configure.ml] [cppo: dune build] [csexp: dune build] [jane-street-headers: dune build] [ocaml-compiler-libs: dune build] [ocaml-syntax-shims: dune build] [octavius: dune build] [ppx_derivers: dune build] [re: dune build] [result: dune build] [sexplib0: dune build]
Processing 157/331: [bigarray-compat: dune build] [bigstringaf: dune build] [camomile: ocaml configure.ml] [cppo: dune build] [csexp: dune build] [jane-street-headers: dune build] [ocaml-compiler-libs: dune build] [ocaml-syntax-shims: dune build] [octavius: dune build] [ppx_derivers: dune build] [re: dune build] [result: dune build] [sexplib0: dune build] [stdlib-shims: dune build]
Processing 158/331: [bigarray-compat: dune build] [bigstringaf: dune build] [camomile: ocaml configure.ml] [cppo: dune build] [csexp: dune build] [jane-street-headers: dune build] [ocaml-compiler-libs: dune build] [ocaml-syntax-shims: dune build] [octavius: dune build] [ppx_derivers: dune build] [re: dune build] [result: dune build] [sexplib0: dune build] [stdlib-shims: dune build] [stringext: dune build]
Processing 159/331: [bigarray-compat: dune build] [bigstringaf: dune build] [camomile: ocaml configure.ml] [cppo: dune build] [csexp: dune build] [jane-street-headers: dune build] [ocaml-compiler-libs: dune build] [ocaml-syntax-shims: dune build] [octavius: dune build] [ppx_derivers: dune build] [re: dune build] [result: dune build] [sexplib0: dune build] [stdlib-shims: dune build] [stringext: dune build] [trie: dune build]
+ /home/opam/.opam/opam-init/hooks/sandbox.sh "build" "dune" "build" "-p" "bigstringaf" "-j" "31" (CWD=/home/opam/.opam/5.0/.opam-switch/build/bigstringaf.0.9.0)
- (cd _build/default/lib/freestanding && /usr/bin/gmake)
- touch libbigstringaf_freestanding_stubs.a
-> compiled  bigstringaf.0.9.0
Processing 159/331: [bigarray-compat: dune build] [camomile: ocaml configure.ml] [cppo: dune build] [csexp: dune build] [jane-street-headers: dune build] [ocaml-compiler-libs: dune build] [ocaml-syntax-shims: dune build] [octavius: dune build] [ppx_derivers: dune build] [re: dune build] [result: dune build] [sexplib0: dune build] [stdlib-shims: dune build] [stringext: dune build] [trie: dune build]
-> installed bigstringaf.0.9.0
Processing 160/331: [bigarray-compat: dune build] [camomile: ocaml configure.ml] [cppo: dune build] [csexp: dune build] [jane-street-headers: dune build] [ocaml-compiler-libs: dune build] [ocaml-syntax-shims: dune build] [octavius: dune build] [ppx_derivers: dune build] [re: dune build] [result: dune build] [sexplib0: dune build] [stdlib-shims: dune build] [stringext: dune build] [trie: dune build]
+ /home/opam/.opam/opam-init/hooks/sandbox.sh "build" "ocaml" "configure.ml" "--share" "/home/opam/.opam/5.0/share/camomile" (CWD=/home/opam/.opam/5.0/.opam-switch/build/camomile.1.0.2)
Processing 160/331: [bigarray-compat: dune build] [camomile: dune build] [cppo: dune build] [csexp: dune build] [jane-street-headers: dune build] [ocaml-compiler-libs: dune build] [ocaml-syntax-shims: dune build] [octavius: dune build] [ppx_derivers: dune build] [re: dune build] [result: dune build] [sexplib0: dune build] [stdlib-shims: dune build] [stringext: dune build] [trie: dune build]
+ /home/opam/.opam/opam-init/hooks/sandbox.sh "build" "dune" "build" "-p" "ppx_derivers" "-j" "31" (CWD=/home/opam/.opam/5.0/.opam-switch/build/ppx_derivers.1.2.1)
-> compiled  ppx_derivers.1.2.1
Processing 160/331: [bigarray-compat: dune build] [camomile: dune build] [cppo: dune build] [csexp: dune build] [jane-street-headers: dune build] [ocaml-compiler-libs: dune build] [ocaml-syntax-shims: dune build] [octavius: dune build] [re: dune build] [result: dune build] [sexplib0: dune build] [stdlib-shims: dune build] [stringext: dune build] [trie: dune build]
-> installed ppx_derivers.1.2.1
Processing 161/331: [bigarray-compat: dune build] [camomile: dune build] [cppo: dune build] [csexp: dune build] [jane-street-headers: dune build] [ocaml-compiler-libs: dune build] [ocaml-syntax-shims: dune build] [octavius: dune build] [re: dune build] [result: dune build] [sexplib0: dune build] [stdlib-shims: dune build] [stringext: dune build] [trie: dune build]
+ /home/opam/.opam/opam-init/hooks/sandbox.sh "build" "dune" "build" "-p" "result" "-j" "31" (CWD=/home/opam/.opam/5.0/.opam-switch/build/result.1.5)
-> compiled  result.1.5
Processing 161/331: [bigarray-compat: dune build] [camomile: dune build] [cppo: dune build] [csexp: dune build] [jane-street-headers: dune build] [ocaml-compiler-libs: dune build] [ocaml-syntax-shims: dune build] [octavius: dune build] [re: dune build] [sexplib0: dune build] [stdlib-shims: dune build] [stringext: dune build] [trie: dune build]
-> installed result.1.5
Processing 162/331: [bigarray-compat: dune build] [camomile: dune build] [cppo: dune build] [csexp: dune build] [jane-street-headers: dune build] [ocaml-compiler-libs: dune build] [ocaml-syntax-shims: dune build] [octavius: dune build] [re: dune build] [sexplib0: dune build] [stdlib-shims: dune build] [stringext: dune build] [trie: dune build]
+ /home/opam/.opam/opam-init/hooks/sandbox.sh "build" "dune" "build" "-p" "stdlib-shims" "-j" "31" (CWD=/home/opam/.opam/5.0/.opam-switch/build/stdlib-shims.0.3.0)
-> compiled  stdlib-shims.0.3.0
Processing 162/331: [bigarray-compat: dune build] [camomile: dune build] [cppo: dune build] [csexp: dune build] [jane-street-headers: dune build] [ocaml-compiler-libs: dune build] [ocaml-syntax-shims: dune build] [octavius: dune build] [re: dune build] [sexplib0: dune build] [stringext: dune build] [trie: dune build]
-> installed stdlib-shims.0.3.0
Processing 163/331: [bigarray-compat: dune build] [camomile: dune build] [cppo: dune build] [csexp: dune build] [jane-street-headers: dune build] [ocaml-compiler-libs: dune build] [ocaml-syntax-shims: dune build] [octavius: dune build] [re: dune build] [sexplib0: dune build] [stringext: dune build] [trie: dune build]
Processing 164/331: [bigarray-compat: dune build] [camomile: dune build] [cppo: dune build] [csexp: dune build] [fileutils: dune build] [jane-street-headers: dune build] [ocaml-compiler-libs: dune build] [ocaml-syntax-shims: dune build] [octavius: dune build] [re: dune build] [sexplib0: dune build] [stringext: dune build] [trie: dune build]
Processing 165/331: [bigarray-compat: dune build] [camomile: dune build] [cppo: dune build] [csexp: dune build] [fileutils: dune build] [jane-street-headers: dune build] [ocaml-compiler-libs: dune build] [ocaml-syntax-shims: dune build] [ocamlgraph: dune build] [octavius: dune build] [re: dune build] [sexplib0: dune build] [stringext: dune build] [trie: dune build]
+ /home/opam/.opam/opam-init/hooks/sandbox.sh "build" "dune" "build" "-p" "csexp" "-j" "31" "@install" (CWD=/home/opam/.opam/5.0/.opam-switch/build/csexp.1.5.1)
-> compiled  csexp.1.5.1
Processing 165/331: [bigarray-compat: dune build] [camomile: dune build] [cppo: dune build] [fileutils: dune build] [jane-street-headers: dune build] [ocaml-compiler-libs: dune build] [ocaml-syntax-shims: dune build] [ocamlgraph: dune build] [octavius: dune build] [re: dune build] [sexplib0: dune build] [stringext: dune build] [trie: dune build]
-> installed csexp.1.5.1
Processing 166/331: [bigarray-compat: dune build] [camomile: dune build] [cppo: dune build] [fileutils: dune build] [jane-street-headers: dune build] [ocaml-compiler-libs: dune build] [ocaml-syntax-shims: dune build] [ocamlgraph: dune build] [octavius: dune build] [re: dune build] [sexplib0: dune build] [stringext: dune build] [trie: dune build]
Processing 167/331: [bigarray-compat: dune build] [camomile: dune build] [cppo: dune build] [dune-configurator: rm] [fileutils: dune build] [jane-street-headers: dune build] [ocaml-compiler-libs: dune build] [ocaml-syntax-shims: dune build] [ocamlgraph: dune build] [octavius: dune build] [re: dune build] [sexplib0: dune build] [stringext: dune build] [trie: dune build]
+ /home/opam/.opam/opam-init/hooks/sandbox.sh "build" "dune" "build" "-p" "bigarray-compat" "-j" "31" (CWD=/home/opam/.opam/5.0/.opam-switch/build/bigarray-compat.1.1.0)
-> compiled  bigarray-compat.1.1.0
Processing 167/331: [camomile: dune build] [cppo: dune build] [dune-configurator: rm] [fileutils: dune build] [jane-street-headers: dune build] [ocaml-compiler-libs: dune build] [ocaml-syntax-shims: dune build] [ocamlgraph: dune build] [octavius: dune build] [re: dune build] [sexplib0: dune build] [stringext: dune build] [trie: dune build]
-> installed bigarray-compat.1.1.0
Processing 168/331: [camomile: dune build] [cppo: dune build] [dune-configurator: rm] [fileutils: dune build] [jane-street-headers: dune build] [ocaml-compiler-libs: dune build] [ocaml-syntax-shims: dune build] [ocamlgraph: dune build] [octavius: dune build] [re: dune build] [sexplib0: dune build] [stringext: dune build] [trie: dune build]
Processing 169/331: [camomile: dune build] [cppo: dune build] [dune-configurator: rm] [fileutils: dune build] [jane-street-headers: dune build] [mmap: dune build] [ocaml-compiler-libs: dune build] [ocaml-syntax-shims: dune build] [ocamlgraph: dune build] [octavius: dune build] [re: dune build] [sexplib0: dune build] [stringext: dune build] [trie: dune build]
+ /home/opam/.opam/opam-init/hooks/sandbox.sh "build" "dune" "build" "-p" "cppo" "-j" "31" (CWD=/home/opam/.opam/5.0/.opam-switch/build/cppo.1.6.8)
-> compiled  cppo.1.6.8
Processing 169/331: [camomile: dune build] [dune-configurator: rm] [fileutils: dune build] [jane-street-headers: dune build] [mmap: dune build] [ocaml-compiler-libs: dune build] [ocaml-syntax-shims: dune build] [ocamlgraph: dune build] [octavius: dune build] [re: dune build] [sexplib0: dune build] [stringext: dune build] [trie: dune build]
-> installed cppo.1.6.8
Processing 170/331: [camomile: dune build] [dune-configurator: rm] [fileutils: dune build] [jane-street-headers: dune build] [mmap: dune build] [ocaml-compiler-libs: dune build] [ocaml-syntax-shims: dune build] [ocamlgraph: dune build] [octavius: dune build] [re: dune build] [sexplib0: dune build] [stringext: dune build] [trie: dune build]
Processing 171/331: [camomile: dune build] [dune-configurator: rm] [fileutils: dune build] [jane-street-headers: dune build] [mmap: dune build] [ocaml-compiler-libs: dune build] [ocaml-syntax-shims: dune build] [ocamlgraph: dune build] [ocplib-endian: dune build] [octavius: dune build] [re: dune build] [sexplib0: dune build] [stringext: dune build] [trie: dune build]
+ /home/opam/.opam/opam-init/hooks/sandbox.sh "build" "dune" "build" "-p" "jane-street-headers" "-j" "31" (CWD=/home/opam/.opam/5.0/.opam-switch/build/jane-street-headers.v0.14.0)
-> compiled  jane-street-headers.v0.14.0
Processing 171/331: [camomile: dune build] [dune-configurator: rm] [fileutils: dune build] [mmap: dune build] [ocaml-compiler-libs: dune build] [ocaml-syntax-shims: dune build] [ocamlgraph: dune build] [ocplib-endian: dune build] [octavius: dune build] [re: dune build] [sexplib0: dune build] [stringext: dune build] [trie: dune build]
-> installed jane-street-headers.v0.14.0
Processing 172/331: [camomile: dune build] [dune-configurator: rm] [fileutils: dune build] [mmap: dune build] [ocaml-compiler-libs: dune build] [ocaml-syntax-shims: dune build] [ocamlgraph: dune build] [ocplib-endian: dune build] [octavius: dune build] [re: dune build] [sexplib0: dune build] [stringext: dune build] [trie: dune build]
+ /home/opam/.opam/opam-init/hooks/sandbox.sh "build" "dune" "build" "-p" "ocaml-compiler-libs" "-j" "31" "@install" (CWD=/home/opam/.opam/5.0/.opam-switch/build/ocaml-compiler-libs.v0.12.4)
-> compiled  ocaml-compiler-libs.v0.12.4
Processing 172/331: [camomile: dune build] [dune-configurator: rm] [fileutils: dune build] [mmap: dune build] [ocaml-syntax-shims: dune build] [ocamlgraph: dune build] [ocplib-endian: dune build] [octavius: dune build] [re: dune build] [sexplib0: dune build] [stringext: dune build] [trie: dune build]
-> installed ocaml-compiler-libs.v0.12.4
Processing 173/331: [camomile: dune build] [dune-configurator: rm] [fileutils: dune build] [mmap: dune build] [ocaml-syntax-shims: dune build] [ocamlgraph: dune build] [ocplib-endian: dune build] [octavius: dune build] [re: dune build] [sexplib0: dune build] [stringext: dune build] [trie: dune build]
Processing 174/331: [camomile: dune build] [dune-configurator: rm] [fileutils: dune build] [mmap: dune build] [ocaml-syntax-shims: dune build] [ocamlgraph: dune build] [ocplib-endian: dune build] [octavius: dune build] [ppxlib: dune subst] [re: dune build] [sexplib0: dune build] [stringext: dune build] [trie: dune build]
+ /home/opam/.opam/opam-init/hooks/sandbox.sh "build" "dune" "build" "-p" "ocaml-syntax-shims" "-j" "31" "@install" (CWD=/home/opam/.opam/5.0/.opam-switch/build/ocaml-syntax-shims.1.0.0)
-> compiled  ocaml-syntax-shims.1.0.0
Processing 174/331: [camomile: dune build] [dune-configurator: rm] [fileutils: dune build] [mmap: dune build] [ocamlgraph: dune build] [ocplib-endian: dune build] [octavius: dune build] [ppxlib: dune subst] [re: dune build] [sexplib0: dune build] [stringext: dune build] [trie: dune build]
-> installed ocaml-syntax-shims.1.0.0
Processing 175/331: [camomile: dune build] [dune-configurator: rm] [fileutils: dune build] [mmap: dune build] [ocamlgraph: dune build] [ocplib-endian: dune build] [octavius: dune build] [ppxlib: dune subst] [re: dune build] [sexplib0: dune build] [stringext: dune build] [trie: dune build]
Processing 176/331: [angstrom: dune build] [camomile: dune build] [dune-configurator: rm] [fileutils: dune build] [mmap: dune build] [ocamlgraph: dune build] [ocplib-endian: dune build] [octavius: dune build] [ppxlib: dune subst] [re: dune build] [sexplib0: dune build] [stringext: dune build] [trie: dune build]
+ /home/opam/.opam/opam-init/hooks/sandbox.sh "build" "dune" "build" "-p" "octavius" "-j" "31" "@install" (CWD=/home/opam/.opam/5.0/.opam-switch/build/octavius.1.2.2)
-> compiled  octavius.1.2.2
Processing 176/331: [angstrom: dune build] [camomile: dune build] [dune-configurator: rm] [fileutils: dune build] [mmap: dune build] [ocamlgraph: dune build] [ocplib-endian: dune build] [ppxlib: dune subst] [re: dune build] [sexplib0: dune build] [stringext: dune build] [trie: dune build]
-> installed octavius.1.2.2
Processing 177/331: [angstrom: dune build] [camomile: dune build] [dune-configurator: rm] [fileutils: dune build] [mmap: dune build] [ocamlgraph: dune build] [ocplib-endian: dune build] [ppxlib: dune subst] [re: dune build] [sexplib0: dune build] [stringext: dune build] [trie: dune build]
+ /home/opam/.opam/opam-init/hooks/sandbox.sh "build" "dune" "build" "-p" "re" "-j" "31" (CWD=/home/opam/.opam/5.0/.opam-switch/build/re.1.10.4)
-> compiled  re.1.10.4
Processing 177/331: [angstrom: dune build] [camomile: dune build] [dune-configurator: rm] [fileutils: dune build] [mmap: dune build] [ocamlgraph: dune build] [ocplib-endian: dune build] [ppxlib: dune subst] [sexplib0: dune build] [stringext: dune build] [trie: dune build]
-> installed re.1.10.4
Processing 178/331: [angstrom: dune build] [camomile: dune build] [dune-configurator: rm] [fileutils: dune build] [mmap: dune build] [ocamlgraph: dune build] [ocplib-endian: dune build] [ppxlib: dune subst] [sexplib0: dune build] [stringext: dune build] [trie: dune build]
+ /home/opam/.opam/opam-init/hooks/sandbox.sh "build" "dune" "build" "-p" "sexplib0" "-j" "31" (CWD=/home/opam/.opam/5.0/.opam-switch/build/sexplib0.v0.14.0)
- (cd _build/default && /home/opam/.opam/5.0/bin/ocamlc.opt -w -40 -g -bin-annot -I src/.sexplib0.objs/byte -intf-suffix .ml -no-alias-deps -open Sexplib0__ -o src/.sexplib0.objs/byte/sexplib0__Sexp_conv.cmo -c -impl src/sexp_conv.ml)
- File "src/sexp_conv.ml", line 105, characters 15-31:
- 105 |       let id = Obj.extension_id
-                      ^^^^^^^^^^^^^^^^
- Error: Unbound value Obj.extension_id
- (cd _build/default && /home/opam/.opam/5.0/bin/ocamlopt.opt -w -40 -g -I src/.sexplib0.objs/byte -I src/.sexplib0.objs/native -intf-suffix .ml -no-alias-deps -open Sexplib0__ -o src/.sexplib0.objs/native/sexplib0__Sexp_conv.cmx -c -impl src/sexp_conv.ml)
- File "src/sexp_conv.ml", line 105, characters 15-31:
- 105 |       let id = Obj.extension_id
-                      ^^^^^^^^^^^^^^^^
- Error: Unbound value Obj.extension_id
[ERROR] The compilation of sexplib0.v0.14.0 failed at "dune build -p sexplib0 -j 31".
Processing 178/331: [angstrom: dune build] [camomile: dune build] [dune-configurator: rm] [fileutils: dune build] [mmap: dune build] [ocamlgraph: dune build] [ocplib-endian: dune build] [ppxlib: dune subst] [stringext: dune build] [trie: dune build]
Processing 179/331: [angstrom: dune build] [camomile: dune build] [dune-configurator: rm] [fileutils: dune build] [mmap: dune build] [ocamlgraph: dune build] [ocplib-endian: dune build] [ppxlib: dune subst] [stringext: dune build] [trie: dune build]
Processing 180/331: [angstrom: dune build] [camomile: dune build] [dune-configurator: rm] [fileutils: dune build] [mmap: dune build] [ocamlgraph: dune build] [ocplib-endian: dune build] [ppxlib: dune subst] [stringext: dune build] [trie: dune build]
Processing 181/331: [angstrom: dune build] [camomile: dune build] [dune-configurator: rm] [fileutils: dune build] [mmap: dune build] [ocamlgraph: dune build] [ocplib-endian: dune build] [ppxlib: dune subst] [stringext: dune build] [trie: dune build]
+ /home/opam/.opam/opam-init/hooks/sandbox.sh "build" "dune" "build" "-p" "stringext" "-j" "31" (CWD=/home/opam/.opam/5.0/.opam-switch/build/stringext.1.6.0)
-> compiled  stringext.1.6.0
Processing 181/331: [angstrom: dune build] [camomile: dune build] [dune-configurator: rm] [fileutils: dune build] [mmap: dune build] [ocamlgraph: dune build] [ocplib-endian: dune build] [ppxlib: dune subst] [trie: dune build]
-> installed stringext.1.6.0
Processing 182/331: [angstrom: dune build] [camomile: dune build] [dune-configurator: rm] [fileutils: dune build] [mmap: dune build] [ocamlgraph: dune build] [ocplib-endian: dune build] [ppxlib: dune subst] [trie: dune build]
+ /home/opam/.opam/opam-init/hooks/sandbox.sh "build" "dune" "build" "-p" "trie" "-j" "31" (CWD=/home/opam/.opam/5.0/.opam-switch/build/trie.1.0.0)
-> compiled  trie.1.0.0
Processing 182/331: [angstrom: dune build] [camomile: dune build] [dune-configurator: rm] [fileutils: dune build] [mmap: dune build] [ocamlgraph: dune build] [ocplib-endian: dune build] [ppxlib: dune subst]
-> installed trie.1.0.0
Processing 183/331: [angstrom: dune build] [camomile: dune build] [dune-configurator: rm] [fileutils: dune build] [mmap: dune build] [ocamlgraph: dune build] [ocplib-endian: dune build] [ppxlib: dune subst]
Processing 184/331: [angstrom: dune build] [camomile: dune build] [dune-configurator: rm] [fileutils: dune build] [mew: dune build] [mmap: dune build] [ocamlgraph: dune build] [ocplib-endian: dune build] [ppxlib: dune subst]
+ /home/opam/.opam/opam-init/hooks/sandbox.sh "build" "dune" "build" "-p" "fileutils" "-j" "31" (CWD=/home/opam/.opam/5.0/.opam-switch/build/fileutils.0.6.3)
- (cd _build/default && /home/opam/.opam/5.0/bin/ocamlc.opt -w -40 -g -bin-annot -I src/lib/fileutils/.fileutils.objs/byte -I src/lib/fileutils/.fileutils.objs/public_cmi -I /home/opam/.opam/5.0/lib/stdlib-shims -no-alias-deps -o src/lib/fileutils/.fileutils.objs/byte/fileUtilCMP.cmo -c -impl src/lib/fileutils/FileUtilCMP.ml)
- File "src/lib/fileutils/FileUtilCMP.ml", line 42, characters 8-20:
- 42 |         Stream.empty st;
-              ^^^^^^^^^^^^
- Error: Unbound module Stream
[ERROR] The compilation of fileutils.0.6.3 failed at "dune build -p fileutils -j 31".
Processing 184/331: [angstrom: dune build] [camomile: dune build] [dune-configurator: rm] [mew: dune build] [mmap: dune build] [ocamlgraph: dune build] [ocplib-endian: dune build] [ppxlib: dune subst]
Processing 185/331: [angstrom: dune build] [camomile: dune build] [dune-configurator: rm] [mew: dune build] [mmap: dune build] [ocamlgraph: dune build] [ocplib-endian: dune build] [ppxlib: dune subst]
+ /home/opam/.opam/opam-init/hooks/sandbox.sh "build" "rm" "-rf" "vendor/csexp" (CWD=/home/opam/.opam/5.0/.opam-switch/build/dune-configurator.3.1.1)
+ /home/opam/.opam/opam-init/hooks/sandbox.sh "build" "dune" "build" "-p" "mmap" "-j" "31" (CWD=/home/opam/.opam/5.0/.opam-switch/build/mmap.1.2.0)
-> compiled  mmap.1.2.0
Processing 185/331: [angstrom: dune build] [camomile: dune build] [dune-configurator: rm] [mew: dune build] [ocamlgraph: dune build] [ocplib-endian: dune build] [ppxlib: dune subst]
-> installed mmap.1.2.0
Processing 186/331: [angstrom: dune build] [camomile: dune build] [dune-configurator: rm] [mew: dune build] [ocamlgraph: dune build] [ocplib-endian: dune build] [ppxlib: dune subst]
+ /home/opam/.opam/opam-init/hooks/sandbox.sh "build" "dune" "subst" (CWD=/home/opam/.opam/5.0/.opam-switch/build/ppxlib.0.25.0~5.00preview)
Processing 186/331: [angstrom: dune build] [camomile: dune build] [dune-configurator: rm] [mew: dune build] [ocamlgraph: dune build] [ocplib-endian: dune build] [ppxlib: dune build]
+ /home/opam/.opam/opam-init/hooks/sandbox.sh "build" "rm" "-rf" "vendor/pp" (CWD=/home/opam/.opam/5.0/.opam-switch/build/dune-configurator.3.1.1)
Processing 186/331: [angstrom: dune build] [camomile: dune build] [dune-configurator: dune build] [mew: dune build] [ocamlgraph: dune build] [ocplib-endian: dune build] [ppxlib: dune build]
+ /home/opam/.opam/opam-init/hooks/sandbox.sh "build" "dune" "build" "-p" "ocplib-endian" "-j" "31" "@install" (CWD=/home/opam/.opam/5.0/.opam-switch/build/ocplib-endian.1.2)
- File "src/dune", line 75, characters 26-34:
- 75 |  (libraries ocplib_endian bigarray bytes))
-                                ^^^^^^^^
- Error: Library "bigarray" not found.
- -> required by library "ocplib-endian.bigstring" in _build/default/src
- -> required by _build/default/META.ocplib-endian
- -> required by _build/install/default/lib/ocplib-endian/META
- -> required by _build/default/ocplib-endian.install
- -> required by alias install
[ERROR] The compilation of ocplib-endian.1.2 failed at "dune build -p ocplib-endian -j 31 @install".
Processing 186/331: [angstrom: dune build] [camomile: dune build] [dune-configurator: dune build] [mew: dune build] [ocamlgraph: dune build] [ppxlib: dune build]
Processing 187/331: [angstrom: dune build] [camomile: dune build] [dune-configurator: dune build] [mew: dune build] [ocamlgraph: dune build] [ppxlib: dune build]
+ /home/opam/.opam/opam-init/hooks/sandbox.sh "build" "dune" "build" "-p" "angstrom" "-j" "31" (CWD=/home/opam/.opam/5.0/.opam-switch/build/angstrom.0.15.0)
-> compiled  angstrom.0.15.0
Processing 187/331: [camomile: dune build] [dune-configurator: dune build] [mew: dune build] [ocamlgraph: dune build] [ppxlib: dune build]
-> installed angstrom.0.15.0
Processing 188/331: [camomile: dune build] [dune-configurator: dune build] [mew: dune build] [ocamlgraph: dune build] [ppxlib: dune build]
Processing 189/331: [camomile: dune build] [dune-configurator: dune build] [mew: dune build] [ocamlgraph: dune build] [ppxlib: dune build] [uri: dune build]
+ /home/opam/.opam/opam-init/hooks/sandbox.sh "build" "dune" "build" "-p" "camomile" "-j" "31" "@install" (CWD=/home/opam/.opam/5.0/.opam-switch/build/camomile.1.0.2)
- File "Camomile/dune", line 12, characters 12-20:
- 12 |  (libraries bigarray camomileDefaultConfig)
-                  ^^^^^^^^
- Error: Library "bigarray" not found.
- -> required by library "camomile.library" in _build/default/Camomile
- -> required by _build/default/META.camomile
- -> required by _build/install/default/lib/camomile/META
- -> required by _build/default/camomile.install
- -> required by alias install
- (cd _build/default && /home/opam/.opam/5.0/bin/ocamlyacc Camomile/internal/uReStrParser.mly)
- 4 shift/reduce conflicts.
- File "Camomile/toolslib/dune", line 7, characters 38-46:
- 7 |  (libraries camomile camomile.library bigarray str))
-                                           ^^^^^^^^
- Error: Library "bigarray" not found.
- -> required by library "toolslib" in _build/default/Camomile/toolslib
- -> required by executable gen_mappings in Camomile/mappings/dune:4
- -> required by _build/default/Camomile/mappings/gen_mappings.exe
- -> required by _build/default/Camomile/mappings/cns11643.mar
- -> required by _build/install/default/share/camomile/mappings/cns11643.mar
- -> required by _build/default/camomile.install
- -> required by alias install
Processing 189/331: [dune-configurator: dune build] [mew: dune build] [ocamlgraph: dune build] [ppxlib: dune build] [uri: dune build]
Processing 190/331: [dune-configurator: dune build] [mew: dune build] [ocamlgraph: dune build] [ppxlib: dune build] [uri: dune build]
Processing 191/331: [dune-configurator: dune build] [mew: dune build] [ocamlgraph: dune build] [ppxlib: dune build] [uri: dune build]
Processing 192/331: [dune-configurator: dune build] [mew: dune build] [ocamlgraph: dune build] [ppxlib: dune build] [uri: dune build]
Processing 193/331: [dune-configurator: dune build] [mew: dune build] [ocamlgraph: dune build] [ppxlib: dune build] [uri: dune build]
Processing 194/331: [dune-configurator: dune build] [mew: dune build] [ocamlgraph: dune build] [ppxlib: dune build] [uri: dune build]
[ERROR] The compilation of camomile.1.0.2 failed at "dune build -p camomile -j 31 @install".
+ /home/opam/.opam/opam-init/hooks/sandbox.sh "build" "dune" "build" "-p" "mew" "-j" "31" (CWD=/home/opam/.opam/5.0/.opam-switch/build/mew.0.1.0)
-> compiled  mew.0.1.0
Processing 194/331: [dune-configurator: dune build] [ocamlgraph: dune build] [ppxlib: dune build] [uri: dune build]
-> installed mew.0.1.0
Processing 195/331: [dune-configurator: dune build] [ocamlgraph: dune build] [ppxlib: dune build] [uri: dune build]
Processing 196/331: [dune-configurator: dune build] [mew_vi: dune build] [ocamlgraph: dune build] [ppxlib: dune build] [uri: dune build]
+ /home/opam/.opam/opam-init/hooks/sandbox.sh "build" "dune" "build" "-p" "dune-configurator" "-j" "31" "@install" (CWD=/home/opam/.opam/5.0/.opam-switch/build/dune-configurator.3.1.1)
-> compiled  dune-configurator.3.1.1
Processing 196/331: [mew_vi: dune build] [ocamlgraph: dune build] [ppxlib: dune build] [uri: dune build]
-> installed dune-configurator.3.1.1
Processing 197/331: [mew_vi: dune build] [ocamlgraph: dune build] [ppxlib: dune build] [uri: dune build]
Processing 198/331: [mew_vi: dune build] [ocamlgraph: dune build] [ppxlib: dune build] [uri: dune build]
Processing 199/331: [mew_vi: dune build] [ocamlgraph: dune build] [ppxlib: dune build] [uri: dune build]
Processing 200/331: [mew_vi: dune build] [ocamlgraph: dune build] [ppxlib: dune build] [uri: dune build]
Processing 201/331: [mew_vi: dune build] [ocamlgraph: dune build] [ppxlib: dune build] [uri: dune build]
Processing 202/331: [mew_vi: dune build] [ocamlgraph: dune build] [ppxlib: dune build] [uri: dune build]
Processing 203/331: [mew_vi: dune build] [ocamlgraph: dune build] [ppxlib: dune build] [uri: dune build]
Processing 204/331: [mew_vi: dune build] [ocamlgraph: dune build] [ppxlib: dune build] [uri: dune build]
Processing 205/331: [mew_vi: dune build] [ocamlgraph: dune build] [ppxlib: dune build] [uri: dune build]
Processing 206/331: [mew_vi: dune build] [ocamlgraph: dune build] [ppxlib: dune build] [uri: dune build]
Processing 207/331: [mew_vi: dune build] [ocamlgraph: dune build] [ppxlib: dune build] [uri: dune build]
Processing 208/331: [mew_vi: dune build] [ocamlgraph: dune build] [ppxlib: dune build] [uri: dune build]
Processing 209/331: [mew_vi: dune build] [ocamlgraph: dune build] [ppxlib: dune build] [uri: dune build]
Processing 210/331: [mew_vi: dune build] [ocamlgraph: dune build] [ppxlib: dune build] [uri: dune build]
Processing 211/331: [mew_vi: dune build] [ocamlgraph: dune build] [ppxlib: dune build] [uri: dune build]
Processing 212/331: [mew_vi: dune build] [ocamlgraph: dune build] [ppxlib: dune build] [uri: dune build]
Processing 213/331: [mew_vi: dune build] [ocamlgraph: dune build] [ppxlib: dune build] [uri: dune build]
Processing 214/331: [mew_vi: dune build] [ocamlgraph: dune build] [ppxlib: dune build] [uri: dune build]
Processing 215/331: [mew_vi: dune build] [ocamlgraph: dune build] [ppxlib: dune build] [uri: dune build]
Processing 216/331: [mew_vi: dune build] [ocamlgraph: dune build] [ppxlib: dune build] [uri: dune build]
Processing 217/331: [mew_vi: dune build] [ocamlgraph: dune build] [ppxlib: dune build] [uri: dune build]
Processing 218/331: [mew_vi: dune build] [ocamlgraph: dune build] [ppxlib: dune build] [uri: dune build]
Processing 219/331: [mew_vi: dune build] [ocamlgraph: dune build] [ppxlib: dune build] [uri: dune build]
Processing 220/331: [mew_vi: dune build] [ocamlgraph: dune build] [ppxlib: dune build] [uri: dune build]
Processing 221/331: [mew_vi: dune build] [ocamlgraph: dune build] [ppxlib: dune build] [uri: dune build]
Processing 222/331: [mew_vi: dune build] [ocamlgraph: dune build] [ppxlib: dune build] [uri: dune build]
Processing 223/331: [mew_vi: dune build] [ocamlgraph: dune build] [ppxlib: dune build] [uri: dune build]
+ /home/opam/.opam/opam-init/hooks/sandbox.sh "build" "dune" "build" "-p" "mew_vi" "-j" "31" (CWD=/home/opam/.opam/5.0/.opam-switch/build/mew_vi.0.5.0)
-> compiled  mew_vi.0.5.0
Processing 223/331: [ocamlgraph: dune build] [ppxlib: dune build] [uri: dune build]
-> installed mew_vi.0.5.0
Processing 224/331: [ocamlgraph: dune build] [ppxlib: dune build] [uri: dune build]
Processing 225/331: [ocamlgraph: dune build] [ppxlib: dune build] [uri: dune build]
Processing 226/331: [ocamlgraph: dune build] [ppxlib: dune build] [uri: dune build]
Processing 227/331: [ocamlgraph: dune build] [ppxlib: dune build] [uri: dune build]
Processing 228/331: [ocamlgraph: dune build] [ppxlib: dune build] [uri: dune build]
+ /home/opam/.opam/opam-init/hooks/sandbox.sh "build" "dune" "build" "-p" "uri" "-j" "31" (CWD=/home/opam/.opam/5.0/.opam-switch/build/uri.4.2.0)
-> compiled  uri.4.2.0
Processing 228/331: [ocamlgraph: dune build] [ppxlib: dune build]
-> installed uri.4.2.0
Processing 229/331: [ocamlgraph: dune build] [ppxlib: dune build]
+ /home/opam/.opam/opam-init/hooks/sandbox.sh "build" "dune" "build" "-p" "ocamlgraph" "-j" "31" "@install" (CWD=/home/opam/.opam/5.0/.opam-switch/build/ocamlgraph.2.0.0)
-> compiled  ocamlgraph.2.0.0
Processing 229/331: [ppxlib: dune build]
-> installed ocamlgraph.2.0.0
Processing 230/331: [ppxlib: dune build]
+ /home/opam/.opam/opam-init/hooks/sandbox.sh "build" "dune" "build" "-p" "ppxlib" "-j" "31" "@install" (CWD=/home/opam/.opam/5.0/.opam-switch/build/ppxlib.0.25.0~5.00preview)
-> compiled  ppxlib.0.25.0~5.00preview
-> installed ppxlib.0.25.0~5.00preview
Processing 242/331: [ppx_pipebang: dune build]
Processing 243/331: [ppx_pipebang: dune build]
Processing 244/331: [ppx_pipebang: dune build]
Processing 245/331: [ppx_pipebang: dune build]
Processing 246/331: [ppx_pipebang: dune build]
Processing 247/331: [ppx_pipebang: dune build]
Processing 248/331: [ppx_pipebang: dune build]
Processing 249/331: [ppx_pipebang: dune build]
Processing 250/331: [ppx_pipebang: dune build]
Processing 251/331: [ppx_pipebang: dune build]
Processing 252/331: [ppx_pipebang: dune build]
Processing 253/331: [ppx_pipebang: dune build]
Processing 254/331: [ppx_pipebang: dune build]
Processing 255/331: [ppx_pipebang: dune build]
Processing 256/331: [ppx_pipebang: dune build]
Processing 257/331: [ppx_pipebang: dune build]
Processing 258/331: [ppx_pipebang: dune build]
Processing 259/331: [ppx_pipebang: dune build]
Processing 260/331: [ppx_pipebang: dune build]
Processing 261/331: [ppx_pipebang: dune build]
Processing 262/331: [ppx_pipebang: dune build]
Processing 263/331: [ppx_pipebang: dune build]
Processing 264/331: [ppx_pipebang: dune build]
Processing 265/331: [ppx_pipebang: dune build]
Processing 266/331: [ppx_pipebang: dune build]
Processing 267/331: [ppx_pipebang: dune build]
Processing 268/331: [ppx_pipebang: dune build]
Processing 269/331: [ppx_pipebang: dune build]
Processing 270/331: [ppx_pipebang: dune build]
Processing 271/331: [ppx_pipebang: dune build]
Processing 272/331: [ppx_pipebang: dune build]
Processing 273/331: [ppx_pipebang: dune build]
Processing 274/331: [ppx_pipebang: dune build]
Processing 275/331: [ppx_pipebang: dune build]
Processing 276/331: [ppx_pipebang: dune build]
Processing 277/331: [ppx_pipebang: dune build]
Processing 278/331: [ppx_pipebang: dune build]
Processing 279/331: [ppx_pipebang: dune build]
Processing 280/331: [ppx_pipebang: dune build]
Processing 281/331: [ppx_pipebang: dune build]
Processing 282/331: [ppx_pipebang: dune build]
Processing 283/331: [ppx_pipebang: dune build]
Processing 284/331: [ppx_pipebang: dune build]
Processing 285/331: [ppx_pipebang: dune build]
Processing 286/331: [ppx_pipebang: dune build]
Processing 287/331: [ppx_pipebang: dune build]
Processing 288/331: [ppx_pipebang: dune build]
Processing 289/331: [ppx_pipebang: dune build]
Processing 290/331: [ppx_pipebang: dune build]
Processing 291/331: [ppx_pipebang: dune build]
Processing 292/331: [ppx_pipebang: dune build]
Processing 293/331: [ppx_pipebang: dune build]
Processing 294/331: [ppx_pipebang: dune build]
Processing 295/331: [ppx_pipebang: dune build]
Processing 296/331: [ppx_pipebang: dune build]
Processing 297/331: [ppx_pipebang: dune build]
Processing 298/331: [ppx_pipebang: dune build]
+ /home/opam/.opam/opam-init/hooks/sandbox.sh "build" "dune" "build" "-p" "ppx_pipebang" "-j" "31" (CWD=/home/opam/.opam/5.0/.opam-switch/build/ppx_pipebang.v0.14.0)
-> compiled  ppx_pipebang.v0.14.0
-> installed ppx_pipebang.v0.14.0

#=== ERROR while compiling sexplib0.v0.14.0 ===================================#
# context              2.2.0~alpha~dev | linux/x86_64 | ocaml-variants.5.0.0+trunk | file:///home/opam/opam-repository
# path                 ~/.opam/5.0/.opam-switch/build/sexplib0.v0.14.0
# command              ~/.opam/opam-init/hooks/sandbox.sh build dune build -p sexplib0 -j 31
# exit-code            1
# env-file             ~/.opam/log/sexplib0-10-39ecac.env
# output-file          ~/.opam/log/sexplib0-10-39ecac.out
### output ###
# (cd _build/default && /home/opam/.opam/5.0/bin/ocamlc.opt -w -40 -g -bin-annot -I src/.sexplib0.objs/byte -intf-suffix .ml -no-alias-deps -open Sexplib0__ -o src/.sexplib0.objs/byte/sexplib0__Sexp_conv.cmo -c -impl src/sexp_conv.ml)
# File "src/sexp_conv.ml", line 105, characters 15-31:
# 105 |       let id = Obj.extension_id
#                      ^^^^^^^^^^^^^^^^
# Error: Unbound value Obj.extension_id
# (cd _build/default && /home/opam/.opam/5.0/bin/ocamlopt.opt -w -40 -g -I src/.sexplib0.objs/byte -I src/.sexplib0.objs/native -intf-suffix .ml -no-alias-deps -open Sexplib0__ -o src/.sexplib0.objs/native/sexplib0__Sexp_conv.cmx -c -impl src/sexp_conv.ml)
# File "src/sexp_conv.ml", line 105, characters 15-31:
# 105 |       let id = Obj.extension_id
#                      ^^^^^^^^^^^^^^^^
# Error: Unbound value Obj.extension_id


#=== ERROR while compiling ocplib-endian.1.2 ==================================#
# context              2.2.0~alpha~dev | linux/x86_64 | ocaml-variants.5.0.0+trunk | file:///home/opam/opam-repository
# path                 ~/.opam/5.0/.opam-switch/build/ocplib-endian.1.2
# command              ~/.opam/opam-init/hooks/sandbox.sh build dune build -p ocplib-endian -j 31 @install
# exit-code            1
# env-file             ~/.opam/log/ocplib-endian-10-290f06.env
# output-file          ~/.opam/log/ocplib-endian-10-290f06.out
### output ###
# File "src/dune", line 75, characters 26-34:
# 75 |  (libraries ocplib_endian bigarray bytes))
#                                ^^^^^^^^
# Error: Library "bigarray" not found.
# -> required by library "ocplib-endian.bigstring" in _build/default/src
# -> required by _build/default/META.ocplib-endian
# -> required by _build/install/default/lib/ocplib-endian/META
# -> required by _build/default/ocplib-endian.install
# -> required by alias install


#=== ERROR while compiling ocamlmod.0.0.9 =====================================#
# context              2.2.0~alpha~dev | linux/x86_64 | ocaml-variants.5.0.0+trunk | file:///home/opam/opam-repository
# path                 ~/.opam/5.0/.opam-switch/build/ocamlmod.0.0.9
# command              ~/.opam/opam-init/hooks/sandbox.sh build ocaml setup.ml -configure --prefix /home/opam/.opam/5.0
# exit-code            2
# env-file             ~/.opam/log/ocamlmod-10-d5f994.env
# output-file          ~/.opam/log/ocamlmod-10-d5f994.out
### output ###
# File "./setup.ml", line 596, characters 4-15:
# 596 |     Stream.from next
#           ^^^^^^^^^^^
# Error: Unbound module Stream


#=== ERROR while compiling ocamlify.0.0.1 =====================================#
# context              2.2.0~alpha~dev | linux/x86_64 | ocaml-variants.5.0.0+trunk | file:///home/opam/opam-repository
# path                 ~/.opam/5.0/.opam-switch/build/ocamlify.0.0.1
# command              ~/.opam/opam-init/hooks/sandbox.sh build ocaml setup.ml -configure --prefix /home/opam/.opam/5.0
# exit-code            2
# env-file             ~/.opam/log/ocamlify-10-5858d0.env
# output-file          ~/.opam/log/ocamlify-10-5858d0.out
### output ###
# File "/home/gildor/programmation/oasis/src/oasis/PropList.ml", line 93, characters 13-29:
# Error: Unbound value String.lowercase


#=== ERROR while compiling fileutils.0.6.3 ====================================#
# context              2.2.0~alpha~dev | linux/x86_64 | ocaml-variants.5.0.0+trunk | file:///home/opam/opam-repository
# path                 ~/.opam/5.0/.opam-switch/build/fileutils.0.6.3
# command              ~/.opam/opam-init/hooks/sandbox.sh build dune build -p fileutils -j 31
# exit-code            1
# env-file             ~/.opam/log/fileutils-10-e5e9e0.env
# output-file          ~/.opam/log/fileutils-10-e5e9e0.out
### output ###
# (cd _build/default && /home/opam/.opam/5.0/bin/ocamlc.opt -w -40 -g -bin-annot -I src/lib/fileutils/.fileutils.objs/byte -I src/lib/fileutils/.fileutils.objs/public_cmi -I /home/opam/.opam/5.0/lib/stdlib-shims -no-alias-deps -o src/lib/fileutils/.fileutils.objs/byte/fileUtilCMP.cmo -c -impl src/lib/fileutils/FileUtilCMP.ml)
# File "src/lib/fileutils/FileUtilCMP.ml", line 42, characters 8-20:
# 42 |         Stream.empty st;
#              ^^^^^^^^^^^^
# Error: Unbound module Stream


#=== ERROR while compiling camomile.1.0.2 =====================================#
# context              2.2.0~alpha~dev | linux/x86_64 | ocaml-variants.5.0.0+trunk | file:///home/opam/opam-repository
# path                 ~/.opam/5.0/.opam-switch/build/camomile.1.0.2
# command              ~/.opam/opam-init/hooks/sandbox.sh build dune build -p camomile -j 31 @install
# exit-code            1
# env-file             ~/.opam/log/camomile-10-3ad815.env
# output-file          ~/.opam/log/camomile-10-3ad815.out
### output ###
# File "Camomile/dune", line 12, characters 12-20:
# 12 |  (libraries bigarray camomileDefaultConfig)
#                  ^^^^^^^^
# Error: Library "bigarray" not found.
# -> required by library "camomile.library" in _build/default/Camomile
# -> required by _build/default/META.camomile
# -> required by _build/install/default/lib/camomile/META
# -> required by _build/default/camomile.install
# -> required by alias install
# (cd _build/default && /home/opam/.opam/5.0/bin/ocamlyacc Camomile/internal/uReStrParser.mly)
# 4 shift/reduce conflicts.
# File "Camomile/toolslib/dune", line 7, characters 38-46:
# 7 |  (libraries camomile camomile.library bigarray str))
#                                           ^^^^^^^^
# Error: Library "bigarray" not found.
# -> required by library "toolslib" in _build/default/Camomile/toolslib
# -> required by executable gen_mappings in Camomile/mappings/dune:4
# -> required by _build/default/Camomile/mappings/gen_mappings.exe
# -> required by _build/default/Camomile/mappings/cns11643.mar
# -> required by _build/install/default/share/camomile/mappings/cns11643.mar
# -> required by _build/default/camomile.install
# -> required by alias install



<><> Error report <><><><><><><><><><><><><><><><><><><><><><><><><><><><><><><>
+- The following actions were aborted
| - install bap-build              2.4.0
| - install bap-bundle             2.4.0
| - install bap-callgraph-collator 2.4.0
| - install bap-core-theory        2.4.0
| - install bap-future             2.4.0
| - install bap-knowledge          2.4.0
| - install bap-main               2.4.0
| - install bap-plugins            2.4.0
| - install bap-recipe             2.4.0
| - install bap-relation           2.4.0
| - install bap-std                2.4.0
| - install base                   v0.14.3
| - install base_bigstring         v0.14.0
| - install base_quickcheck        v0.14.1
| - install bin_prot               v0.14.0
| - install bitvec                 2.4.0
| - install bitvec-binprot         2.4.0
| - install bitvec-order           2.4.0
| - install bitvec-sexp            2.4.0
| - install charInfo_width         1.1.0
| - install core_kernel            v0.14.2
| - install fieldslib              v0.14.0
| - install graphlib               2.4.0
| - install jst-config             v0.14.1
| - install lambda-term            3.2.0
| - install lwt                    5.5.0
| - install lwt_log                1.1.1
| - install lwt_react              1.1.5
| - install monads                 2.4.0
| - install oasis                  0.4.11
| - install ogre                   2.4.0
| - install parsexp                v0.14.2
| - install ppx_assert             v0.14.0
| - install ppx_bap                v0.14.0
| - install ppx_base               v0.14.0
| - install ppx_bench              v0.14.1
| - install ppx_bin_prot           v0.14.0
| - install ppx_cold               v0.14.0
| - install ppx_compare            v0.14.0
| - install ppx_custom_printf      v0.14.1
| - install ppx_enumerate          v0.14.0
| - install ppx_expect             v0.14.2
| - install ppx_fields_conv        v0.14.2
| - install ppx_fixed_literal      v0.14.0
| - install ppx_hash               v0.14.0
| - install ppx_here               v0.14.0
| - install ppx_inline_test        v0.14.1
| - install ppx_jane               v0.14.0
| - install ppx_js_style           v0.14.1
| - install ppx_let                v0.14.0
| - install ppx_module_timer       v0.14.0
| - install ppx_optcomp            v0.14.3
| - install ppx_optional           v0.14.0
| - install ppx_sexp_conv          v0.14.3
| - install ppx_sexp_message       v0.14.1
| - install ppx_sexp_value         v0.14.0
| - install ppx_stable             v0.14.1
| - install ppx_string             v0.14.1
| - install ppx_typerep_conv       v0.14.2
| - install ppx_variants_conv      v0.14.2
| - install regular                2.4.0
| - install sexplib                v0.14.0
| - install splittable_random      v0.14.0
| - install stdio                  v0.14.0
| - install time_now               v0.14.0
| - install typerep                v0.14.0
| - install utop                   2.9.1
| - install variantslib            v0.14.0
| - install zed                    3.1.0
+- 
+- The following actions failed
| - build camomile      1.0.2
| - build fileutils     0.6.3
| - build ocamlify      0.0.1
| - build ocamlmod      0.0.9
| - build ocplib-endian 1.2
| - build sexplib0      v0.14.0
+- 
+- The following changes have been performed (the rest was aborted)
| - install angstrom            0.15.0
| - install base-bytes          base
| - install bigarray-compat     1.1.0
| - install bigstringaf         0.9.0
| - install camlzip             1.11
| - install cmdliner            1.1.1
| - install conf-clang          1
| - install conf-gmp            4
| - install conf-m4             1
| - install conf-perl           2
| - install conf-pkg-config     2
| - install conf-which          1
| - install conf-zlib           1
| - install cppo                1.6.8
| - install csexp               1.5.1
| - install dune                3.1.1
| - install dune-configurator   3.1.1
| - install jane-street-headers v0.14.0
| - install mew                 0.1.0
| - install mew_vi              0.5.0
| - install mmap                1.2.0
| - install num                 1.4
| - install ocaml-compiler-libs v0.12.4
| - install ocaml-syntax-shims  1.0.0
| - install ocamlbuild          0.14.1
| - install ocamlfind           1.9.3
| - install ocamlgraph          2.0.0
| - install octavius            1.2.2
| - install ppx_derivers        1.2.1
| - install ppx_pipebang        v0.14.0
| - install ppxlib              0.25.0~5.00preview
| - install re                  1.10.4
| - install react               1.2.2
| - install result              1.5
| - install seq                 base
| - install stdlib-shims        0.3.0
| - install stringext           1.6.0
| - install topkg               1.0.5
| - install trie                1.0.0
| - install uri                 4.2.0
| - install uuidm               0.9.8
| - install zarith              1.12
+- 
# Run eval $(opam env) to update the current shell environment

The former state can be restored with:
    /usr/bin/opam switch import "/home/opam/.opam/5.0/.opam-switch/backup/state-20220512000225.export"
'opam install -vy bap-callgraph-collator.2.4.0' failed.
"/bin/bash" "-c"
"
opam remove -y "bap-callgraph-collator.2.4.0"
opam install -vy "bap-callgraph-collator.2.4.0"
res=$?
if [ $res = 31 ]; then
    if opam show -f x-ci-accept-failures: "bap-callgraph-collator.2.4.0" | grep -q '"debian-unstable"'; then
        echo "This package failed and has been disabled for CI using the 'x-ci-accept-failures' field."
        exit 69
    fi
fi


exit $res
" failed with exit status 31
Failed: Build failed