OCamllabs icon Home|Differences with the last checks|Previous runs


Building on x86-bm-14.ocamllabs.io

(from ocaml/opam:debian-unstable@sha256:ab7f0b8ac566a6726439e621a0807bcd9fc12180ea873955fd963cfd263c279c)
Unable to find image 'ocaml/opam:debian-unstable@sha256:ab7f0b8ac566a6726439e621a0807bcd9fc12180ea873955fd963cfd263c279c' locally
docker.io/ocaml/opam@sha256:ab7f0b8ac566a6726439e621a0807bcd9fc12180ea873955fd963cfd263c279c: Pulling from ocaml/opam
7c26de214b34: Already exists
686e2e0ed2af: Pulling fs layer
6f56e1824cd6: Pulling fs layer
6f56e1824cd6: Verifying Checksum
6f56e1824cd6: Download complete
686e2e0ed2af: Verifying Checksum
686e2e0ed2af: Download complete
686e2e0ed2af: Pull complete
6f56e1824cd6: Pull complete
Digest: sha256:ab7f0b8ac566a6726439e621a0807bcd9fc12180ea873955fd963cfd263c279c
Status: Downloaded newer image for ocaml/opam@sha256:ab7f0b8ac566a6726439e621a0807bcd9fc12180ea873955fd963cfd263c279c
2022-05-11 23:45.34 ---> using "31be97220bde553e6e760a64d33a5a13bf22f7bc7b939c6db9f7e6618bb986a9" from cache

/: (user (uid 1000) (gid 1000))

/: (env OPAMPRECISETRACKING 1)

/: (env OPAMUTF8 never)

/: (env OPAMEXTERNALSOLVER builtin-0install)

/: (env OPAMCRITERIA +removed)

/: (run (shell "sudo ln -f /usr/bin/opam-dev /usr/bin/opam"))
2022-05-11 23:45.34 ---> using "179f53753baadbe2063c82b23383d48191f66b8e16101240f7dfbf1ced2cc270" from cache

/: (run (network host)
        (shell "rm -rf ~/opam-repository && git clone -q 'https://github.com/ocaml/opam-repository' ~/opam-repository && git -C ~/opam-repository checkout -q 7ebba7f05b4ae6507db523882e2a6df3fcb82fb3"))
2022-05-11 23:45.34 ---> using "e03d0e1409ca900b4238dc5a99fda90533ac437f633561f6a23a7ce554600652" from cache

/: (run (shell "rm -rf ~/.opam && opam init -ya --bare --config ~/.opamrc-sandbox ~/opam-repository"))
Configuring from /home/opam/.opamrc-sandbox, then /home/opam/.opamrc, and finally from built-in defaults.
Checking for available remotes: rsync and local, git.
  - you won't be able to use mercurial repositories unless you install the hg command on your system.
  - you won't be able to use darcs repositories unless you install the darcs command on your system.


<><> Fetching repository information ><><><><><><><><><><><><><><><><><><><><><>
[default] Initialised

User configuration:
  ~/.profile is already up-to-date.
[NOTE] Make sure that ~/.profile is well sourced in your ~/.bashrc.

2022-05-11 23:45.34 ---> using "f2b762bd14fc0fe661511410f052bca3d3a6d98c0572418fb3219e7975323dc4" from cache

/: (run (cache (opam-archives (target /home/opam/.opam/download-cache)))
        (network host)
        (shell "opam switch create --repositories=default '5.0' '5.0.0+trunk'"))

<><> Installing new switch packages <><><><><><><><><><><><><><><><><><><><><><>
Switch invariant: ["ocaml-variants" {= "5.0.0+trunk"}]

<><> Processing actions <><><><><><><><><><><><><><><><><><><><><><><><><><><><>
-> installed base-bigarray.base
-> installed base-threads.base
-> installed base-unix.base
-> retrieved ocaml-variants.5.0.0+trunk  (https://github.com/ocaml/ocaml/archive/trunk.tar.gz)
-> installed ocaml-variants.5.0.0+trunk
-> installed ocaml-config.3
-> installed ocaml.5.0.0
-> installed base-domains.base
-> installed base-nnp.base
Done.
# Run eval $(opam env --switch=5.0) to update the current shell environment
2022-05-11 23:45.34 ---> using "c9764e27e864e7eba8f1014e361a5d7af12ea512edc911d0112d8096e9653974" from cache

/: (run (network host)
        (shell "opam update --depexts"))
+ /usr/bin/sudo "apt-get" "update"
- Get:1 http://deb.debian.org/debian unstable InRelease [165 kB]
- Get:2 http://deb.debian.org/debian unstable/main amd64 Packages.diff/Index [63.6 kB]
- Ign:2 http://deb.debian.org/debian unstable/main amd64 Packages.diff/Index
- Get:3 http://deb.debian.org/debian unstable/main amd64 Packages [9165 kB]
- Fetched 9394 kB in 3s (3057 kB/s)
- Reading package lists...
- 
2022-05-11 23:45.34 ---> using "c6fb778ad179fe07c3df591e8980b4d64a3e3a6ca08ede5395a9d6665c5fcb40" from cache

/: (run (cache (opam-archives (target /home/opam/.opam/download-cache)))
        (network host)
        (shell  "\
               \nopam remove -y \"bap-bundle.2.4.0\"\
               \nopam install -vy \"bap-bundle.2.4.0\"\
               \nres=$?\
               \nif [ $res = 31 ]; then\
               \n    if opam show -f x-ci-accept-failures: \"bap-bundle.2.4.0\" | grep -q '\"debian-unstable\"'; then\
               \n        echo \"This package failed and has been disabled for CI using the 'x-ci-accept-failures' field.\"\
               \n        exit 69\
               \n    fi\
               \nfi\
               \n\
               \n\
               \nexit $res\
               \n"))
[NOTE] bap-bundle.2.4.0 is not installed.

Nothing to do.
The following actions will be performed:
=== install 73 packages
  - install angstrom            0.15.0             [required by uri]
  - install bap-bundle          2.4.0
  - install base                v0.14.3            [required by core_kernel]
  - install base-bytes          base               [required by fileutils]
  - install base_bigstring      v0.14.0            [required by core_kernel]
  - install base_quickcheck     v0.14.1            [required by core_kernel, ppx_bap]
  - install bigstringaf         0.9.0              [required by angstrom]
  - install bin_prot            v0.14.0            [required by core_kernel]
  - install camlzip             1.11               [required by bap-bundle]
  - install conf-pkg-config     2                  [required by conf-zlib]
  - install conf-zlib           1                  [required by camlzip]
  - install core_kernel         v0.14.2            [required by bap-bundle]
  - install csexp               1.5.1              [required by dune-configurator]
  - install dune                3.1.1              [required by ppx_bap, core_kernel, fileutils, uri]
  - install dune-configurator   3.1.1              [required by base]
  - install fieldslib           v0.14.0            [required by core_kernel]
  - install fileutils           0.6.3              [required by bap-bundle]
  - install jane-street-headers v0.14.0            [required by core_kernel]
  - install jst-config          v0.14.1            [required by core_kernel]
  - install num                 1.4                [required by sexplib]
  - install oasis               0.4.11             [required by bap-bundle]
  - install ocaml-compiler-libs v0.12.4            [required by ppxlib]
  - install ocaml-syntax-shims  1.0.0              [required by angstrom]
  - install ocamlbuild          0.14.1             [required by oasis]
  - install ocamlfind           1.9.3              [required by camlzip, oasis]
  - install ocamlify            0.0.1              [required by oasis]
  - install ocamlmod            0.0.9              [required by oasis]
  - install octavius            1.2.2              [required by ppx_js_style]
  - install parsexp             v0.14.2            [required by sexplib]
  - install ppx_assert          v0.14.0            [required by core_kernel, ppx_bap]
  - install ppx_bap             v0.14.0            [required by bap-bundle]
  - install ppx_base            v0.14.0            [required by core_kernel]
  - install ppx_bench           v0.14.1            [required by ppx_bap]
  - install ppx_bin_prot        v0.14.0            [required by ppx_bap]
  - install ppx_cold            v0.14.0            [required by ppx_bap]
  - install ppx_compare         v0.14.0            [required by ppx_bap]
  - install ppx_custom_printf   v0.14.1            [required by ppx_jane]
  - install ppx_derivers        1.2.1              [required by ppxlib]
  - install ppx_enumerate       v0.14.0            [required by ppx_bap]
  - install ppx_expect          v0.14.2            [required by ppx_jane]
  - install ppx_fields_conv     v0.14.2            [required by ppx_bap]
  - install ppx_fixed_literal   v0.14.0            [required by ppx_jane]
  - install ppx_hash            v0.14.0            [required by core_kernel, ppx_bap]
  - install ppx_here            v0.14.0            [required by ppx_bap]
  - install ppx_inline_test     v0.14.1            [required by core_kernel]
  - install ppx_jane            v0.14.0            [required by core_kernel]
  - install ppx_js_style        v0.14.1            [required by ppx_base]
  - install ppx_let             v0.14.0            [required by ppx_jane]
  - install ppx_module_timer    v0.14.0            [required by ppx_jane]
  - install ppx_optcomp         v0.14.3            [required by core_kernel, ppx_bap]
  - install ppx_optional        v0.14.0            [required by ppx_jane]
  - install ppx_pipebang        v0.14.0            [required by ppx_jane]
  - install ppx_sexp_conv       v0.14.3            [required by core_kernel, ppx_bap]
  - install ppx_sexp_message    v0.14.1            [required by core_kernel]
  - install ppx_sexp_value      v0.14.0            [required by ppx_bap]
  - install ppx_stable          v0.14.1            [required by ppx_jane]
  - install ppx_string          v0.14.1            [required by ppx_jane]
  - install ppx_typerep_conv    v0.14.2            [required by ppx_jane]
  - install ppx_variants_conv   v0.14.2            [required by ppx_bap]
  - install ppxlib              0.25.0~5.00preview [required by ppx_bap]
  - install re                  1.10.4             [required by ppx_expect]
  - install result              1.5                [required by angstrom]
  - install seq                 base               [required by re]
  - install sexplib             v0.14.0            [required by core_kernel]
  - install sexplib0            v0.14.0            [required by base, sexplib]
  - install splittable_random   v0.14.0            [required by core_kernel]
  - install stdio               v0.14.0            [required by core_kernel]
  - install stdlib-shims        0.3.0              [required by fileutils]
  - install stringext           1.6.0              [required by uri]
  - install time_now            v0.14.0            [required by core_kernel]
  - install typerep             v0.14.0            [required by core_kernel]
  - install uri                 4.2.0              [required by bap-bundle]
  - install variantslib         v0.14.0            [required by core_kernel]

The following system packages will first need to be installed:
    pkg-config zlib1g-dev

<><> Handling external dependencies <><><><><><><><><><><><><><><><><><><><><><>

opam believes some required external dependencies are missing. opam can:
> 1. Run apt-get to install them (may need root/sudo access)
  2. Display the recommended apt-get command and wait while you run it manually (e.g. in another terminal)
  3. Attempt installation anyway, and permanently register that this external dependency is present, but not detectable
  4. Abort the installation

[1/2/3/4] 1
+ /usr/bin/sudo "apt-get" "install" "-qq" "-yy" "pkg-config" "zlib1g-dev"
- debconf: delaying package configuration, since apt-utils is not installed
- Selecting previously unselected package libglib2.0-0:amd64.
- (Reading database ... 
(Reading database ... 5%
(Reading database ... 10%
(Reading database ... 15%
(Reading database ... 20%
(Reading database ... 25%
(Reading database ... 30%
(Reading database ... 35%
(Reading database ... 40%
(Reading database ... 45%
(Reading database ... 50%
(Reading database ... 55%
(Reading database ... 60%
(Reading database ... 65%
(Reading database ... 70%
(Reading database ... 75%
(Reading database ... 80%
(Reading database ... 85%
(Reading database ... 90%
(Reading database ... 95%
(Reading database ... 100%
(Reading database ... 18478 files and directories currently installed.)
- Preparing to unpack .../0-libglib2.0-0_2.72.1-1_amd64.deb ...
- Unpacking libglib2.0-0:amd64 (2.72.1-1) ...
- Selecting previously unselected package libglib2.0-data.
- Preparing to unpack .../1-libglib2.0-data_2.72.1-1_all.deb ...
- Unpacking libglib2.0-data (2.72.1-1) ...
- Selecting previously unselected package libicu71:amd64.
- Preparing to unpack .../2-libicu71_71.1-3_amd64.deb ...
- Unpacking libicu71:amd64 (71.1-3) ...
- Selecting previously unselected package libxml2:amd64.
- Preparing to unpack .../3-libxml2_2.9.14+dfsg-1_amd64.deb ...
- Unpacking libxml2:amd64 (2.9.14+dfsg-1) ...
- Selecting previously unselected package pkg-config.
- Preparing to unpack .../4-pkg-config_0.29.2-1_amd64.deb ...
- Unpacking pkg-config (0.29.2-1) ...
- Selecting previously unselected package shared-mime-info.
- Preparing to unpack .../5-shared-mime-info_2.2-1_amd64.deb ...
- Unpacking shared-mime-info (2.2-1) ...
- Selecting previously unselected package xdg-user-dirs.
- Preparing to unpack .../6-xdg-user-dirs_0.17-2_amd64.deb ...
- Unpacking xdg-user-dirs (0.17-2) ...
- Selecting previously unselected package zlib1g-dev:amd64.
- Preparing to unpack .../7-zlib1g-dev_1%3a1.2.11.dfsg-4_amd64.deb ...
- Unpacking zlib1g-dev:amd64 (1:1.2.11.dfsg-4) ...
- Setting up libicu71:amd64 (71.1-3) ...
- Setting up xdg-user-dirs (0.17-2) ...
- Setting up libglib2.0-0:amd64 (2.72.1-1) ...
- No schema files found: doing nothing.
- Setting up libglib2.0-data (2.72.1-1) ...
- Setting up pkg-config (0.29.2-1) ...
- Setting up zlib1g-dev:amd64 (1:1.2.11.dfsg-4) ...
- Setting up libxml2:amd64 (2.9.14+dfsg-1) ...
- Setting up shared-mime-info (2.2-1) ...
- Processing triggers for libc-bin (2.33-7) ...

<><> Processing actions <><><><><><><><><><><><><><><><><><><><><><><><><><><><>
Processing  1/218:
Processing  2/218:
Processing  3/218:
-> retrieved angstrom.0.15.0  (cached)
Processing  4/218:
Processing  5/218:
-> retrieved base_bigstring.v0.14.0  (cached)
Processing  6/218:
-> retrieved base.v0.14.3  (cached)
Processing  7/218:
-> retrieved bap-bundle.2.4.0  (cached)
Processing  8/218:
-> retrieved base_quickcheck.v0.14.1  (cached)
Processing  9/218:
-> retrieved bigstringaf.0.9.0  (cached)
Processing 10/218:
Processing 11/218:
Processing 12/218:
Processing 13/218: [conf-pkg-config: pkg-config]
-> retrieved bin_prot.v0.14.0  (cached)
Processing 14/218: [conf-pkg-config: pkg-config]
-> retrieved camlzip.1.11  (cached)
Processing 15/218: [conf-pkg-config: pkg-config]
+ /home/opam/.opam/opam-init/hooks/sandbox.sh "build" "pkg-config" "--help" (CWD=/home/opam/.opam/5.0/.opam-switch/build/conf-pkg-config.2)
- Usage:
-   pkg-config [OPTION?]
- 
- Help Options:
-   -h, --help                              Show help options
- 
- Application Options:
-   --version                               output version of pkg-config
-   --modversion                            output version for package
-   --atleast-pkgconfig-version=VERSION     require given version of pkg-config
-   --libs                                  output all linker flags
-   --static                                output linker flags for static linking
-   --short-errors                          print short errors
-   --libs-only-l                           output -l flags
-   --libs-only-other                       output other libs (e.g. -pthread)
-   --libs-only-L                           output -L flags
-   --cflags                                output all pre-processor and compiler flags
-   --cflags-only-I                         output -I flags
-   --cflags-only-other                     output cflags not covered by the cflags-only-I option
-   --variable=NAME                         get the value of variable named NAME
-   --define-variable=NAME=VALUE            set variable NAME to VALUE
-   --exists                                return 0 if the module(s) exist
-   --print-variables                       output list of variables defined by the module
-   --uninstalled                           return 0 if the uninstalled version of one or more module(s) or their dependencies will be used
-   --atleast-version=VERSION               return 0 if the module is at least version VERSION
-   --exact-version=VERSION                 return 0 if the module is at exactly version VERSION
-   --max-version=VERSION                   return 0 if the module is at no newer than version VERSION
-   --list-all                              list all known packages
-   --debug                                 show verbose debug information
-   --print-errors                          show verbose information about missing or conflicting packages (default unless --exists or --atleast/exact/max-version given on the command line)
-   --silence-errors                        be silent about errors (default when --exists or --atleast/exact/max-version given on the command line)
-   --errors-to-stdout                      print errors from --print-errors to stdout not stderr
-   --print-provides                        print which packages the package provides
-   --print-requires                        print which packages the package requires
-   --print-requires-private                print which packages the package requires for static linking
-   --validate                              validate a package's .pc file
-   --define-prefix                         try to override the value of prefix for each .pc file found with a guesstimated value based on the location of the .pc file
-   --dont-define-prefix                    don't try to override the value of prefix for each .pc file found with a guesstimated value based on the location of the .pc file
-   --prefix-variable=PREFIX                set the name of the variable that pkg-config automatically sets
- 
-> compiled  conf-pkg-config.2
Processing 15/218:
Processing 16/218: [conf-pkg-config: mkdir]
-> retrieved core_kernel.v0.14.2  (cached)
Processing 17/218: [conf-pkg-config: mkdir]
-> retrieved csexp.1.5.1  (cached)
Processing 18/218: [conf-pkg-config: mkdir]
-> retrieved dune.3.1.1, dune-configurator.3.1.1  (cached)
Processing 19/218: [conf-pkg-config: mkdir]
Processing 20/218: [dune: ocaml bootstrap.ml] [conf-pkg-config: mkdir]
+ /home/opam/.opam/opam-init/hooks/sandbox.sh "install" "mkdir" "-p" "/home/opam/.opam/5.0/lib/pkgconfig" (CWD=/home/opam/.opam/5.0/.opam-switch/build/conf-pkg-config.2)
-> installed conf-pkg-config.2
Processing 20/218: [dune: ocaml bootstrap.ml]
Processing 21/218: [conf-zlib: pkg-config zlib] [dune: ocaml bootstrap.ml]
-> retrieved fieldslib.v0.14.0  (cached)
Processing 22/218: [conf-zlib: pkg-config zlib] [dune: ocaml bootstrap.ml]
-> retrieved fileutils.0.6.3  (cached)
Processing 23/218: [conf-zlib: pkg-config zlib] [dune: ocaml bootstrap.ml]
-> retrieved jane-street-headers.v0.14.0  (cached)
Processing 24/218: [conf-zlib: pkg-config zlib] [dune: ocaml bootstrap.ml]
+ /home/opam/.opam/opam-init/hooks/sandbox.sh "build" "pkg-config" "zlib" (CWD=/home/opam/.opam/5.0/.opam-switch/build/conf-zlib.1)
-> compiled  conf-zlib.1
Processing 24/218: [dune: ocaml bootstrap.ml]
-> installed conf-zlib.1
Processing 25/218: [dune: ocaml bootstrap.ml]
-> retrieved jst-config.v0.14.1  (cached)
Processing 26/218: [dune: ocaml bootstrap.ml]
-> retrieved num.1.4  (cached)
Processing 27/218: [dune: ocaml bootstrap.ml]
-> retrieved oasis.0.4.11  (cached)
Processing 28/218: [dune: ocaml bootstrap.ml]
-> retrieved ocaml-compiler-libs.v0.12.4  (cached)
Processing 29/218: [dune: ocaml bootstrap.ml]
-> retrieved ocaml-syntax-shims.1.0.0  (cached)
Processing 30/218: [dune: ocaml bootstrap.ml]
-> retrieved ocamlbuild.0.14.1  (cached)
Processing 31/218: [dune: ocaml bootstrap.ml]
Processing 32/218: [dune: ocaml bootstrap.ml] [ocamlbuild: make configure.make]
-> retrieved ocamlfind.1.9.3  (cached)
Processing 33/218: [dune: ocaml bootstrap.ml] [ocamlbuild: make configure.make]
Processing 34/218: [dune: ocaml bootstrap.ml] [ocamlbuild: make configure.make] [ocamlfind: ./configure]
-> retrieved ocamlify.0.0.1  (cached)
Processing 35/218: [dune: ocaml bootstrap.ml] [ocamlbuild: make configure.make] [ocamlfind: ./configure]
-> retrieved ocamlmod.0.0.9  (cached)
Processing 36/218: [dune: ocaml bootstrap.ml] [ocamlbuild: make configure.make] [ocamlfind: ./configure]
-> retrieved octavius.1.2.2  (cached)
Processing 37/218: [dune: ocaml bootstrap.ml] [ocamlbuild: make configure.make] [ocamlfind: ./configure]
-> retrieved parsexp.v0.14.2  (cached)
Processing 38/218: [dune: ocaml bootstrap.ml] [ocamlbuild: make configure.make] [ocamlfind: ./configure]
-> retrieved ppx_assert.v0.14.0  (cached)
Processing 39/218: [dune: ocaml bootstrap.ml] [ocamlbuild: make configure.make] [ocamlfind: ./configure]
-> retrieved ppx_bap.v0.14.0  (cached)
Processing 40/218: [dune: ocaml bootstrap.ml] [ocamlbuild: make configure.make] [ocamlfind: ./configure]
-> retrieved ppx_base.v0.14.0  (cached)
Processing 41/218: [dune: ocaml bootstrap.ml] [ocamlbuild: make configure.make] [ocamlfind: ./configure]
-> retrieved ppx_bench.v0.14.1  (cached)
Processing 42/218: [dune: ocaml bootstrap.ml] [ocamlbuild: make configure.make] [ocamlfind: ./configure]
-> retrieved ppx_bin_prot.v0.14.0  (cached)
Processing 43/218: [dune: ocaml bootstrap.ml] [ocamlbuild: make configure.make] [ocamlfind: ./configure]
+ /home/opam/.opam/opam-init/hooks/sandbox.sh "build" "make" "-f" "configure.make" "all" "OCAMLBUILD_PREFIX=/home/opam/.opam/5.0" "OCAMLBUILD_BINDIR=/home/opam/.opam/5.0/bin" "OCAMLBUILD_LIBDIR=/home/opam/.opam/5.0/lib" "OCAMLBUILD_MANDIR=/home/opam/.opam/5.0/man" "OCAML_NATIVE=true" "OCAML_NATIVE_TOOLS=true" (CWD=/home/opam/.opam/5.0/.opam-switch/build/ocamlbuild.0.14.1)
- (echo "# This file was generated from configure.make"; \
- echo ;\
- echo "OCAML_PREFIX="; \
- echo "OCAML_BINDIR=/home/opam/.opam/5.0/bin"; \
- echo "OCAML_LIBDIR=/home/opam/.opam/5.0/lib/ocaml"; \
- echo "OCAML_MANDIR=/home/opam/.opam/5.0/man"; \
- echo ;\
- echo "EXT_OBJ=.o"; \
- echo "EXT_ASM=.s"; \
- echo "EXT_LIB=.a"; \
- echo "EXT_DLL=.so"; \
- echo "EXE="; \
- echo ;\
- echo "OCAML_NATIVE=true"; \
- echo "OCAML_NATIVE_TOOLS=true"; \
- echo "NATDYNLINK=true"; \
- echo "SUPPORT_SHARED_LIBRARIES=true"; \
- echo ;\
- echo "PREFIX=/home/opam/.opam/5.0"; \
- echo "BINDIR=/home/opam/.opam/5.0/bin"; \
- echo "LIBDIR=/home/opam/.opam/5.0/lib"; \
- echo "MANDIR=/home/opam/.opam/5.0/man"; \
- ) > Makefile.config
- (echo "(* This file was generated from ../configure.make *)"; \
- echo ;\
- echo 'let bindir = "/home/opam/.opam/5.0/bin"'; \
- echo 'let libdir = "/home/opam/.opam/5.0/lib"'; \
- echo 'let ocaml_libdir = "/home/opam/.opam/5.0/lib/ocaml"'; \
- echo 'let libdir_abs = "/home/opam/.opam/5.0/lib"'; \
- echo 'let ocaml_native = true'; \
- echo 'let ocaml_native_tools = true'; \
- echo 'let supports_shared_libraries = true';\
- echo 'let a = "a"'; \
- echo 'let o = "o"'; \
- echo 'let so = "so"'; \
- echo 'let ext_dll = ".so"'; \
- echo 'let exe = ""'; \
- echo 'let version = "0.14.1"'; \
- ) > src/ocamlbuild_config.ml
Processing 43/218: [dune: ocaml bootstrap.ml] [ocamlbuild: make check-if-preinstalled] [ocamlfind: ./configure]
-> retrieved ppx_cold.v0.14.0  (cached)
Processing 44/218: [dune: ocaml bootstrap.ml] [ocamlbuild: make check-if-preinstalled] [ocamlfind: ./configure]
-> retrieved ppx_compare.v0.14.0  (cached)
Processing 45/218: [dune: ocaml bootstrap.ml] [ocamlbuild: make check-if-preinstalled] [ocamlfind: ./configure]
-> retrieved ppx_custom_printf.v0.14.1  (cached)
Processing 46/218: [dune: ocaml bootstrap.ml] [ocamlbuild: make check-if-preinstalled] [ocamlfind: ./configure]
-> retrieved ppx_derivers.1.2.1  (cached)
Processing 47/218: [dune: ocaml bootstrap.ml] [ocamlbuild: make check-if-preinstalled] [ocamlfind: ./configure]
-> retrieved ppx_enumerate.v0.14.0  (cached)
Processing 48/218: [dune: ocaml bootstrap.ml] [ocamlbuild: make check-if-preinstalled] [ocamlfind: ./configure]
-> retrieved ppx_expect.v0.14.2  (cached)
Processing 49/218: [dune: ocaml bootstrap.ml] [ocamlbuild: make check-if-preinstalled] [ocamlfind: ./configure]
-> retrieved ppx_fields_conv.v0.14.2  (cached)
Processing 50/218: [dune: ocaml bootstrap.ml] [ocamlbuild: make check-if-preinstalled] [ocamlfind: ./configure]
-> retrieved ppx_fixed_literal.v0.14.0  (cached)
Processing 51/218: [dune: ocaml bootstrap.ml] [ocamlbuild: make check-if-preinstalled] [ocamlfind: ./configure]
-> retrieved ppx_hash.v0.14.0  (cached)
Processing 52/218: [dune: ocaml bootstrap.ml] [ocamlbuild: make check-if-preinstalled] [ocamlfind: ./configure]
-> retrieved ppx_here.v0.14.0  (cached)
Processing 53/218: [dune: ocaml bootstrap.ml] [ocamlbuild: make check-if-preinstalled] [ocamlfind: ./configure]
-> retrieved ppx_inline_test.v0.14.1  (cached)
Processing 54/218: [dune: ocaml bootstrap.ml] [ocamlbuild: make check-if-preinstalled] [ocamlfind: ./configure]
-> retrieved ppx_jane.v0.14.0  (cached)
Processing 55/218: [dune: ocaml bootstrap.ml] [ocamlbuild: make check-if-preinstalled] [ocamlfind: ./configure]
-> retrieved ppx_js_style.v0.14.1  (cached)
Processing 56/218: [dune: ocaml bootstrap.ml] [ocamlbuild: make check-if-preinstalled] [ocamlfind: ./configure]
-> retrieved ppx_let.v0.14.0  (cached)
Processing 57/218: [dune: ocaml bootstrap.ml] [ocamlbuild: make check-if-preinstalled] [ocamlfind: ./configure]
+ /home/opam/.opam/opam-init/hooks/sandbox.sh "build" "./configure" "-bindir" "/home/opam/.opam/5.0/bin" "-sitelib" "/home/opam/.opam/5.0/lib" "-mandir" "/home/opam/.opam/5.0/man" "-config" "/home/opam/.opam/5.0/lib/findlib.conf" "-no-custom" "-no-camlp4" (CWD=/home/opam/.opam/5.0/.opam-switch/build/ocamlfind.1.9.3)
- Welcome to findlib version 1.9.3
- Configuring core...
- Checking for #remove_directory...
- Testing threading model...
- systhread_supported: true
- Testing DLLs...
- Testing whether ppxopt can be supported...
- Checking for ocamlc -opaque...
- Querying installation: META list not found
- make install will double-check installed META files
- Configuring libraries...
- unix: found
- bigarray: not present (possible since 4.08)
- compiler-libs: found
- dbm: not present (normal since 4.00)
- graphics: not present (normal since 4.09)
- num: not present (normal since 4.06)
- ocamlbuild: not present (normal since 4.03)
- ocamldoc: found
- raw_spacetime: not present (normal since 4.12)
- threads: found
- str: found
- labltk: not present (normal since 4.02)
- native dynlink: found
- camlp4: disabled
- bytes: found, installing fake library
- Configuration for dynlink written to site-lib-src/dynlink/META
- Configuration for stdlib written to site-lib-src/stdlib/META
- Configuration for unix written to site-lib-src/unix/META
- Configuration for compiler-libs written to site-lib-src/compiler-libs/META
- Configuration for ocamldoc written to site-lib-src/ocamldoc/META
- Configuration for threads written to site-lib-src/threads/META
- Configuration for str written to site-lib-src/str/META
- Configuration for bytes written to site-lib-src/bytes/META
- Detecting compiler arguments: (extractor built) ok
- 
- About the OCAML core installation:
-     Standard library:      /home/opam/.opam/5.0/lib/ocaml
-     Binaries:              /home/opam/.opam/5.0/bin
-     Manual pages:          /home/opam/.opam/5.0/man
-     Multi-threading type:  posix
- The directory of site-specific packages will be
-     site-lib:              /home/opam/.opam/5.0/lib
- The configuration file is written to:
-     findlib config file:   /home/opam/.opam/5.0/lib/findlib.conf
- Software will be installed:
-     Libraries:             in <site-lib>/findlib
-     Binaries:              /home/opam/.opam/5.0/bin
-     Manual pages:          /home/opam/.opam/5.0/man
-     topfind script:        /home/opam/.opam/5.0/lib/ocaml
- Topfind ppxopt support:    yes
- Toolbox:                   no
- Link custom runtime:       no
- Need bytes compatibility:  no
- 
- Configuration has been written to Makefile.config
- 
- You can now do 'make all', and optionally 'make opt', to build ocamlfind.
Processing 57/218: [dune: ocaml bootstrap.ml] [ocamlbuild: make check-if-preinstalled] [ocamlfind: make all]
-> retrieved ppx_module_timer.v0.14.0  (cached)
Processing 58/218: [dune: ocaml bootstrap.ml] [ocamlbuild: make check-if-preinstalled] [ocamlfind: make all]
-> retrieved ppx_optcomp.v0.14.3  (cached)
Processing 59/218: [dune: ocaml bootstrap.ml] [ocamlbuild: make check-if-preinstalled] [ocamlfind: make all]
-> retrieved ppx_optional.v0.14.0  (cached)
Processing 60/218: [dune: ocaml bootstrap.ml] [ocamlbuild: make check-if-preinstalled] [ocamlfind: make all]
-> retrieved ppx_pipebang.v0.14.0  (cached)
Processing 61/218: [dune: ocaml bootstrap.ml] [ocamlbuild: make check-if-preinstalled] [ocamlfind: make all]
-> retrieved ppx_sexp_conv.v0.14.3  (cached)
Processing 62/218: [dune: ocaml bootstrap.ml] [ocamlbuild: make check-if-preinstalled] [ocamlfind: make all]
-> retrieved ppx_sexp_message.v0.14.1  (cached)
Processing 63/218: [dune: ocaml bootstrap.ml] [ocamlbuild: make check-if-preinstalled] [ocamlfind: make all]
-> retrieved ppx_sexp_value.v0.14.0  (cached)
Processing 64/218: [dune: ocaml bootstrap.ml] [ocamlbuild: make check-if-preinstalled] [ocamlfind: make all]
-> retrieved ppx_stable.v0.14.1  (cached)
Processing 65/218: [dune: ocaml bootstrap.ml] [ocamlbuild: make check-if-preinstalled] [ocamlfind: make all]
-> retrieved ppx_string.v0.14.1  (cached)
Processing 66/218: [ppxlib.0.25.0~5.00preview: git] [dune: ocaml bootstrap.ml] [ocamlbuild: make check-if-preinstalled] [ocamlfind: make all]
-> retrieved ppx_typerep_conv.v0.14.2  (cached)
Processing 67/218: [ppxlib.0.25.0~5.00preview: git] [dune: ocaml bootstrap.ml] [ocamlbuild: make check-if-preinstalled] [ocamlfind: make all]
-> retrieved ppx_variants_conv.v0.14.2  (cached)
Processing 68/218: [ppxlib.0.25.0~5.00preview: git] [dune: ocaml bootstrap.ml] [ocamlbuild: make check-if-preinstalled] [ocamlfind: make all]
-> retrieved result.1.5  (cached)
Processing 69/218: [ppxlib.0.25.0~5.00preview: git] [dune: ocaml bootstrap.ml] [ocamlbuild: make check-if-preinstalled] [ocamlfind: make all]
Processing 70/218: [ppxlib.0.25.0~5.00preview: git] [dune: ocaml bootstrap.ml] [ocamlbuild: make check-if-preinstalled] [ocamlfind: make all]
Processing 71/218: [ppxlib.0.25.0~5.00preview: git] [dune: ocaml bootstrap.ml] [ocamlbuild: make check-if-preinstalled] [ocamlfind: make all]
-> installed seq.base
Processing 72/218: [ppxlib.0.25.0~5.00preview: git] [dune: ocaml bootstrap.ml] [ocamlbuild: make check-if-preinstalled] [ocamlfind: make all]
-> retrieved re.1.10.4  (cached)
Processing 73/218: [ppxlib.0.25.0~5.00preview: git] [dune: ocaml bootstrap.ml] [ocamlbuild: make check-if-preinstalled] [ocamlfind: make all]
-> retrieved sexplib.v0.14.0  (cached)
Processing 74/218: [ppxlib.0.25.0~5.00preview: git] [dune: ocaml bootstrap.ml] [ocamlbuild: make check-if-preinstalled] [ocamlfind: make all]
-> retrieved sexplib0.v0.14.0  (cached)
Processing 75/218: [ppxlib.0.25.0~5.00preview: git] [dune: ocaml bootstrap.ml] [ocamlbuild: make check-if-preinstalled] [ocamlfind: make all]
-> retrieved splittable_random.v0.14.0  (cached)
Processing 76/218: [ppxlib.0.25.0~5.00preview: git] [dune: ocaml bootstrap.ml] [ocamlbuild: make check-if-preinstalled] [ocamlfind: make all]
-> retrieved stdio.v0.14.0  (cached)
Processing 77/218: [ppxlib.0.25.0~5.00preview: git] [dune: ocaml bootstrap.ml] [ocamlbuild: make check-if-preinstalled] [ocamlfind: make all]
-> retrieved stdlib-shims.0.3.0  (cached)
Processing 78/218: [ppxlib.0.25.0~5.00preview: git] [dune: ocaml bootstrap.ml] [ocamlbuild: make check-if-preinstalled] [ocamlfind: make all]
-> retrieved stringext.1.6.0  (cached)
Processing 79/218: [ppxlib.0.25.0~5.00preview: git] [dune: ocaml bootstrap.ml] [ocamlbuild: make check-if-preinstalled] [ocamlfind: make all]
-> retrieved time_now.v0.14.0  (cached)
Processing 80/218: [ppxlib.0.25.0~5.00preview: git] [dune: ocaml bootstrap.ml] [ocamlbuild: make check-if-preinstalled] [ocamlfind: make all]
-> retrieved typerep.v0.14.0  (cached)
Processing 81/218: [ppxlib.0.25.0~5.00preview: git] [dune: ocaml bootstrap.ml] [ocamlbuild: make check-if-preinstalled] [ocamlfind: make all]
-> retrieved variantslib.v0.14.0  (cached)
-> retrieved uri.4.2.0  (cached)
+ /home/opam/.opam/opam-init/hooks/sandbox.sh "build" "make" "all" (CWD=/home/opam/.opam/5.0/.opam-switch/build/ocamlfind.1.9.3)
- for p in findlib; do ( cd src/$p; make all ) || exit; done
- make[1]: Entering directory '/home/opam/.opam/5.0/.opam-switch/build/ocamlfind.1.9.3/src/findlib'
- ocamllex fl_meta.mll
- 22 states, 392 transitions, table size 1700 bytes
- USE_CYGPATH="0"; \
- export USE_CYGPATH; \
- cat findlib_config.mlp | \
-          ../../tools/patch '@CONFIGFILE@' '/home/opam/.opam/5.0/lib/findlib.conf' | \
-          ../../tools/patch '@STDLIB@' '/home/opam/.opam/5.0/lib/ocaml' | \
- 	sed -e 's;@AUTOLINK@;true;g' \
- 	    -e 's;@SYSTEM@;linux;g' \
- 	     >findlib_config.ml
- if [ "true" = "true" ]; then                 \
- 	cp topfind.ml.in topfind.ml;                             \
- else                                                             \
- 	sed -e '/PPXOPT_BEGIN/,/PPXOPT_END/ d' topfind.ml.in     \
- 		> topfind.ml ;                                   \
- fi
- ocamldep *.ml *.mli >depend
- ocamlc -I +compiler-libs -opaque    -g -c findlib_config.ml
- ocamlc -I +compiler-libs -opaque    -g -c fl_split.ml
- ocamlc -I +compiler-libs -opaque    -g -c fl_metatoken.ml
- ocamlc -I +compiler-libs -opaque    -g -c fl_meta.ml
- ocamlc -I +compiler-libs -opaque    -c fl_metascanner.mli
- ocamlc -I +compiler-libs -opaque    -g -c fl_metascanner.ml
- ocamlc -I +compiler-libs -opaque    -c fl_topo.mli
- ocamlc -I +compiler-libs -opaque    -g -c fl_topo.ml
- ocamlc -I +compiler-libs -opaque    -c fl_package_base.mli
- ocamlc -I +compiler-libs -opaque    -g -c fl_package_base.ml
- File "fl_package_base.ml", line 304, characters 22-40:
- 304 | 	 let pkg_ancestors = query_requirements predlist pkg in
-       	                     ^^^^^^^^^^^^^^^^^^
- Warning 6 [labels-omitted]: label preds was omitted in the application of this function.
- File "fl_package_base.ml", line 350, characters 18-36:
- 350 |   let ancestors = query_requirements predlist package_name in
-                         ^^^^^^^^^^^^^^^^^^
- Warning 6 [labels-omitted]: label preds was omitted in the application of this function.
- File "fl_package_base.ml", line 375, characters 23-41:
- 375 | 	  let pkg_ancestors = query_requirements predlist pkg in
-       	                      ^^^^^^^^^^^^^^^^^^
- Warning 6 [labels-omitted]: label preds was omitted in the application of this function.
- File "fl_package_base.ml", line 510, characters 16-35:
- 510 | 	     ( let c = package_definitions search_path pkg.package_name in
-       	               ^^^^^^^^^^^^^^^^^^^
- Warning 6 [labels-omitted]: label search_path was omitted in the application of this function.
- ocamlc -I +compiler-libs -opaque    -c findlib.mli
- ocamlc -I +compiler-libs -opaque    -g -c findlib.ml
- File "findlib.ml", line 390, characters 2-26:
- 390 |   Fl_package_base.requires predlist pkg
-         ^^^^^^^^^^^^^^^^^^^^^^^^
- Warning 6 [labels-omitted]: label preds was omitted in the application of this function.
- File "findlib.ml", line 396, characters 2-33:
- 396 |   Fl_package_base.requires_deeply predlist pkglist
-         ^^^^^^^^^^^^^^^^^^^^^^^^^^^^^^^
- Warning 6 [labels-omitted]: label preds was omitted in the application of this function.
- ocamlc -I +compiler-libs -opaque    -g -c fl_args.ml
- ocamlc -I +compiler-libs -opaque    -g -c fl_lint.ml
- ocamlc -I +compiler-libs -a -o findlib.cma findlib_config.cmo fl_split.cmo fl_metatoken.cmo fl_meta.cmo fl_metascanner.cmo fl_topo.cmo fl_package_base.cmo findlib.cmo fl_args.cmo fl_lint.cmo
- ocamlc -I +compiler-libs -opaque    -g -c ocaml_args.ml
- ocamlc -I +compiler-libs -opaque    -g -c frontend.ml
- File "frontend.ml", line 859, characters 10-39:
- 859 |           Fl_package_base.package_users predicates1 packages1
-                 ^^^^^^^^^^^^^^^^^^^^^^^^^^^^^
- Warning 6 [labels-omitted]: label preds was omitted in the application of this function.
- ocamlc -I +compiler-libs  -o ocamlfind -g findlib.cma unix.cma \
-             ocaml_args.cmo frontend.cmo
- ocamlc -I +compiler-libs -opaque    -c topfind.mli
- ocamlc -I +compiler-libs -opaque    -g -c topfind.ml
- File "topfind.ml", line 126, characters 40-63:
- 126 |                      match Hashtbl.find Toploop.directive_table "ppx" with
-                                               ^^^^^^^^^^^^^^^^^^^^^^^
- Alert deprecated: Toploop.directive_table
- File "topfind.ml", line 256, characters 4-27:
- 256 |     Toploop.directive_table
-           ^^^^^^^^^^^^^^^^^^^^^^^
- Alert deprecated: Toploop.directive_table
- File "topfind.ml", line 266, characters 4-27:
- 266 |     Toploop.directive_table
-           ^^^^^^^^^^^^^^^^^^^^^^^
- Alert deprecated: Toploop.directive_table
- File "topfind.ml", line 278, characters 4-27:
- 278 |     Toploop.directive_table
-           ^^^^^^^^^^^^^^^^^^^^^^^
- Alert deprecated: Toploop.directive_table
- File "topfind.ml", line 291, characters 4-27:
- 291 |     Toploop.directive_table
-           ^^^^^^^^^^^^^^^^^^^^^^^
- Alert deprecated: Toploop.directive_table
- File "topfind.ml", line 305, characters 4-27:
- 305 |     Toploop.directive_table
-           ^^^^^^^^^^^^^^^^^^^^^^^
- Alert deprecated: Toploop.directive_table
- File "topfind.ml", line 317, characters 4-27:
- 317 |     Toploop.directive_table
-           ^^^^^^^^^^^^^^^^^^^^^^^
- Alert deprecated: Toploop.directive_table
- ocamlc -I +compiler-libs -a -o findlib_top.cma topfind.cmo
- USE_CYGPATH="0"; \
- export USE_CYGPATH; \
- cat topfind_rd1.p | \
-          ../../tools/patch '@SITELIB@' '/home/opam/.opam/5.0/lib' \
-     	    >topfind
- ocamlc -I +compiler-libs -opaque    -c fl_dynload.mli
- ocamlc -I +compiler-libs -opaque    -g -c fl_dynload.ml
- ocamlc -I +compiler-libs -a -o findlib_dynload.cma fl_dynload.cmo
- make[1]: Leaving directory '/home/opam/.opam/5.0/.opam-switch/build/ocamlfind.1.9.3/src/findlib'
- make all-config
- make[1]: Entering directory '/home/opam/.opam/5.0/.opam-switch/build/ocamlfind.1.9.3'
- USE_CYGPATH="0"; \
- export USE_CYGPATH; \
- cat findlib.conf.in | \
-      tools/patch '@SITELIB@' '/home/opam/.opam/5.0/lib' >findlib.conf
- if ./tools/cmd_from_same_dir ocamlc; then \
- 	echo 'ocamlc="ocamlc.opt"' >>findlib.conf; \
- fi
- if ./tools/cmd_from_same_dir ocamlopt; then \
- 	echo 'ocamlopt="ocamlopt.opt"' >>findlib.conf; \
- fi
- if ./tools/cmd_from_same_dir ocamldep; then \
- 	echo 'ocamldep="ocamldep.opt"' >>findlib.conf; \
- fi
- if ./tools/cmd_from_same_dir ocamldoc; then \
- 	echo 'ocamldoc="ocamldoc.opt"' >>findlib.conf; \
- fi
- make[1]: Leaving directory '/home/opam/.opam/5.0/.opam-switch/build/ocamlfind.1.9.3'
Processing 81/218: [ppxlib.0.25.0~5.00preview: git] [dune: ocaml bootstrap.ml] [ocamlbuild: make check-if-preinstalled] [ocamlfind: make opt]
+ /home/opam/.opam/opam-init/hooks/sandbox.sh "build" "make" "opt" (CWD=/home/opam/.opam/5.0/.opam-switch/build/ocamlfind.1.9.3)
- for p in findlib; do ( cd src/$p; make opt ) || exit; done
- make[1]: Entering directory '/home/opam/.opam/5.0/.opam-switch/build/ocamlfind.1.9.3/src/findlib'
- ocamlopt -I +compiler-libs -g -opaque   -c findlib_config.ml
- ocamlopt -I +compiler-libs -g -opaque   -c fl_split.ml
- ocamlopt -I +compiler-libs -g -opaque   -c fl_metatoken.ml
- ocamlopt -I +compiler-libs -g -opaque   -c fl_meta.ml
- ocamlopt -I +compiler-libs -g -opaque   -c fl_metascanner.ml
- ocamlopt -I +compiler-libs -g -opaque   -c fl_topo.ml
- ocamlopt -I +compiler-libs -g -opaque   -c fl_package_base.ml
- File "fl_package_base.ml", line 304, characters 22-40:
- 304 | 	 let pkg_ancestors = query_requirements predlist pkg in
-       	                     ^^^^^^^^^^^^^^^^^^
- Warning 6 [labels-omitted]: label preds was omitted in the application of this function.
- File "fl_package_base.ml", line 350, characters 18-36:
- 350 |   let ancestors = query_requirements predlist package_name in
-                         ^^^^^^^^^^^^^^^^^^
- Warning 6 [labels-omitted]: label preds was omitted in the application of this function.
- File "fl_package_base.ml", line 375, characters 23-41:
- 375 | 	  let pkg_ancestors = query_requirements predlist pkg in
-       	                      ^^^^^^^^^^^^^^^^^^
- Warning 6 [labels-omitted]: label preds was omitted in the application of this function.
- File "fl_package_base.ml", line 510, characters 16-35:
- 510 | 	     ( let c = package_definitions search_path pkg.package_name in
-       	               ^^^^^^^^^^^^^^^^^^^
- Warning 6 [labels-omitted]: label search_path was omitted in the application of this function.
- ocamlopt -I +compiler-libs -g -opaque   -c findlib.ml
- File "findlib.ml", line 390, characters 2-26:
- 390 |   Fl_package_base.requires predlist pkg
-         ^^^^^^^^^^^^^^^^^^^^^^^^
- Warning 6 [labels-omitted]: label preds was omitted in the application of this function.
- File "findlib.ml", line 396, characters 2-33:
- 396 |   Fl_package_base.requires_deeply predlist pkglist
-         ^^^^^^^^^^^^^^^^^^^^^^^^^^^^^^^
- Warning 6 [labels-omitted]: label preds was omitted in the application of this function.
- ocamlopt -I +compiler-libs -g -opaque   -c fl_args.ml
- ocamlopt -I +compiler-libs -g -opaque   -c fl_lint.ml
- ocamlopt -I +compiler-libs -g -a -o findlib.cmxa findlib_config.cmx fl_split.cmx fl_metatoken.cmx fl_meta.cmx fl_metascanner.cmx fl_topo.cmx fl_package_base.cmx findlib.cmx fl_args.cmx fl_lint.cmx
- if [ 1 -gt 0 ]; then \
-     ocamlopt -I +compiler-libs -g -shared -o findlib.cmxs findlib_config.cmx fl_split.cmx fl_metatoken.cmx fl_meta.cmx fl_metascanner.cmx fl_topo.cmx fl_package_base.cmx findlib.cmx fl_args.cmx fl_lint.cmx; \
- fi
- ocamlopt -I +compiler-libs -g -opaque   -c ocaml_args.ml
- ocamlopt -I +compiler-libs -g -opaque   -c frontend.ml
- File "frontend.ml", line 859, characters 10-39:
- 859 |           Fl_package_base.package_users predicates1 packages1
-                 ^^^^^^^^^^^^^^^^^^^^^^^^^^^^^
- Warning 6 [labels-omitted]: label preds was omitted in the application of this function.
- ocamlopt -I +compiler-libs -g -o ocamlfind_opt findlib.cmxa unix.cmxa \
- 	    ocaml_args.cmx frontend.cmx
- ocamlopt -I +compiler-libs -g -opaque   -c topfind.ml
- File "topfind.ml", line 126, characters 40-63:
- 126 |                      match Hashtbl.find Toploop.directive_table "ppx" with
-                                               ^^^^^^^^^^^^^^^^^^^^^^^
- Alert deprecated: Toploop.directive_table
- File "topfind.ml", line 256, characters 4-27:
- 256 |     Toploop.directive_table
-           ^^^^^^^^^^^^^^^^^^^^^^^
- Alert deprecated: Toploop.directive_table
- File "topfind.ml", line 266, characters 4-27:
- 266 |     Toploop.directive_table
-           ^^^^^^^^^^^^^^^^^^^^^^^
- Alert deprecated: Toploop.directive_table
- File "topfind.ml", line 278, characters 4-27:
- 278 |     Toploop.directive_table
-           ^^^^^^^^^^^^^^^^^^^^^^^
- Alert deprecated: Toploop.directive_table
- File "topfind.ml", line 291, characters 4-27:
- 291 |     Toploop.directive_table
-           ^^^^^^^^^^^^^^^^^^^^^^^
- Alert deprecated: Toploop.directive_table
- File "topfind.ml", line 305, characters 4-27:
- 305 |     Toploop.directive_table
-           ^^^^^^^^^^^^^^^^^^^^^^^
- Alert deprecated: Toploop.directive_table
- File "topfind.ml", line 317, characters 4-27:
- 317 |     Toploop.directive_table
-           ^^^^^^^^^^^^^^^^^^^^^^^
- Alert deprecated: Toploop.directive_table
- ocamlopt -I +compiler-libs -g -a -o findlib_top.cmxa topfind.cmx
- if [ 1 -gt 0 ]; then \
-     ocamlopt -I +compiler-libs -g -shared -o findlib_top.cmxs topfind.cmx; \
- fi
- ocamlopt -I +compiler-libs -g -opaque   -c fl_dynload.ml
- ocamlopt -I +compiler-libs -g -a -o findlib_dynload.cmxa fl_dynload.cmx
- if [ 1 -gt 0 ]; then \
-     ocamlopt -I +compiler-libs -g -shared -o findlib_dynload.cmxs fl_dynload.cmx; \
- fi
- make[1]: Leaving directory '/home/opam/.opam/5.0/.opam-switch/build/ocamlfind.1.9.3/src/findlib'
-> compiled  ocamlfind.1.9.3
Processing 81/218: [ppxlib.0.25.0~5.00preview: git] [dune: ocaml bootstrap.ml] [ocamlbuild: make check-if-preinstalled]
Processing 82/218: [ppxlib.0.25.0~5.00preview: git] [dune: ocaml bootstrap.ml] [ocamlbuild: make check-if-preinstalled] [ocamlfind: make install]
+ /home/opam/.opam/opam-init/hooks/sandbox.sh "install" "make" "install" (CWD=/home/opam/.opam/5.0/.opam-switch/build/ocamlfind.1.9.3)
- if [ "1" -eq 1 ]; then \
-     for x in camlp4 dbm graphics labltk num ocamlbuild; do \
-       if [ -f "/home/opam/.opam/5.0/lib/$x/META" ]; then \
-         if ! grep -Fq '[distributed with Ocaml]' "//home/opam/.opam/5.0/lib/$x/META"; then \
-           rm -f site-lib-src/$x/META; \
-         fi; \
-       fi; \
-     done; \
-     test -f "site-lib-src/num/META" || rm -f "site-lib-src/num-top/META"; \
-   fi
- echo 'SITELIB_META =' > Makefile.packages.in
- for x in `ls site-lib-src`; do test ! -f "site-lib-src/$x/META" || echo $x >> Makefile.packages.in; done
- tr '\n' ' ' < Makefile.packages.in > Makefile.packages
- rm Makefile.packages.in
- mkdir -p "/home/opam/.opam/5.0/bin"
- mkdir -p "/home/opam/.opam/5.0/man"
- make install-config
- make[1]: Entering directory '/home/opam/.opam/5.0/.opam-switch/build/ocamlfind.1.9.3'
- mkdir -p "`dirname \"/home/opam/.opam/5.0/lib/findlib.conf\"`"
- test -f "/home/opam/.opam/5.0/lib/findlib.conf" || cp findlib.conf "/home/opam/.opam/5.0/lib/findlib.conf"
- make[1]: Leaving directory '/home/opam/.opam/5.0/.opam-switch/build/ocamlfind.1.9.3'
- for p in findlib; do ( cd src/$p; make install ); done
- make[1]: Entering directory '/home/opam/.opam/5.0/.opam-switch/build/ocamlfind.1.9.3/src/findlib'
- mkdir -p "/home/opam/.opam/5.0/lib/findlib"
- mkdir -p "/home/opam/.opam/5.0/bin"
- test 1 -eq 0 || cp topfind "/home/opam/.opam/5.0/lib/ocaml"
- files=` ../../tools/collect_files ../../Makefile.config \
- findlib.cmi findlib.mli findlib.cma findlib.cmxa findlib.a findlib.cmxs \
- findlib_config.cmi findlib_config.ml topfind.cmi topfind.mli \
- fl_args.cmi fl_lint.cmi fl_meta.cmi fl_split.cmi fl_topo.cmi ocaml_args.cmi \
- fl_package_base.mli fl_package_base.cmi fl_metascanner.mli fl_metascanner.cmi \
- fl_metatoken.cmi findlib_top.cma findlib_top.cmxa findlib_top.a findlib_top.cmxs \
- findlib_dynload.cma findlib_dynload.cmxa findlib_dynload.a findlib_dynload.cmxs fl_dynload.mli fl_dynload.cmi \
- META` && \
- cp $files "/home/opam/.opam/5.0/lib/findlib"
- f="ocamlfind"; { test -f ocamlfind_opt && f="ocamlfind_opt"; }; \
- cp $f "/home/opam/.opam/5.0/bin/ocamlfind"
- # the following "if" block is only needed for 4.00beta2
- if [ 1 -eq 0 -a -f "/home/opam/.opam/5.0/lib/ocaml/compiler-libs/topdirs.cmi" ]; then \
-     cd "/home/opam/.opam/5.0/lib/ocaml/compiler-libs/"; \
-     cp topdirs.cmi toploop.cmi "/home/opam/.opam/5.0/lib/findlib/"; \
- fi
- make[1]: Leaving directory '/home/opam/.opam/5.0/.opam-switch/build/ocamlfind.1.9.3/src/findlib'
- make install-meta
- make[1]: Entering directory '/home/opam/.opam/5.0/.opam-switch/build/ocamlfind.1.9.3'
- for x in bytes compiler-libs dynlink ocamldoc stdlib str threads unix ; do mkdir -p "/home/opam/.opam/5.0/lib/$x"; cp site-lib-src/$x/META "/home/opam/.opam/5.0/lib/$x/META.tmp" && mv "/home/opam/.opam/5.0/lib/$x/META.tmp" "/home/opam/.opam/5.0/lib/$x/META"; done
- mkdir -p "/home/opam/.opam/5.0/lib/findlib"; cp Makefile.packages "/home/opam/.opam/5.0/lib/findlib/Makefile.packages"
- make[1]: Leaving directory '/home/opam/.opam/5.0/.opam-switch/build/ocamlfind.1.9.3'
- test ! -f 'site-lib-src/num-top/META' || { cd src/findlib; make install-num-top; }
- test ! -f 'site-lib-src/camlp4/META' ||	cp tools/safe_camlp4 "/home/opam/.opam/5.0/bin"
- make install-doc
- make[1]: Entering directory '/home/opam/.opam/5.0/.opam-switch/build/ocamlfind.1.9.3'
- mkdir -p "/home/opam/.opam/5.0/man/man1" "/home/opam/.opam/5.0/man/man3" "/home/opam/.opam/5.0/man/man5"
- cp doc/ref-man/ocamlfind.1 "/home/opam/.opam/5.0/man/man1"
- cp doc/ref-man/META.5 doc/ref-man/site-lib.5 doc/ref-man/findlib.conf.5 "/home/opam/.opam/5.0/man/man5"
- make[1]: Leaving directory '/home/opam/.opam/5.0/.opam-switch/build/ocamlfind.1.9.3'
-> installed ocamlfind.1.9.3
Processing 82/218: [ppxlib.0.25.0~5.00preview: git] [dune: ocaml bootstrap.ml] [ocamlbuild: make check-if-preinstalled]
Processing 83/218: [ppxlib.0.25.0~5.00preview: git] [dune: ocaml bootstrap.ml] [ocamlbuild: make check-if-preinstalled]
Processing 84/218: [ppxlib.0.25.0~5.00preview: git] [camlzip: make all] [dune: ocaml bootstrap.ml] [ocamlbuild: make check-if-preinstalled]
Processing 85/218: [ppxlib.0.25.0~5.00preview: git] [camlzip: make all] [dune: ocaml bootstrap.ml] [num: make] [ocamlbuild: make check-if-preinstalled]
-> installed base-bytes.base
Processing 86/218: [ppxlib.0.25.0~5.00preview: git] [camlzip: make all] [dune: ocaml bootstrap.ml] [num: make] [ocamlbuild: make check-if-preinstalled]
-> retrieved ppxlib.0.25.0~5.00preview  (git+https://github.com/kit-ty-kate/ppxlib.git#500)
Processing 86/218: [camlzip: make all] [dune: ocaml bootstrap.ml] [num: make] [ocamlbuild: make check-if-preinstalled]
+ /home/opam/.opam/opam-init/hooks/sandbox.sh "build" "make" "all" (CWD=/home/opam/.opam/5.0/.opam-switch/build/camlzip.1.11)
- ocamlfind ocamlc -g -safe-string -bin-annot -c -ccopt -g  zlibstubs.c
- ocamlfind ocamlmklib -oc camlzip zlibstubs.o  -lz
- ocamlfind ocamlc -g -safe-string -bin-annot -c zlib.mli
- ocamlfind ocamlc -g -safe-string -bin-annot -c zlib.ml
- ocamlfind ocamlc -g -safe-string -bin-annot -c zip.mli
- ocamlfind ocamlc -g -safe-string -bin-annot -c zip.ml
- ocamlfind ocamlc -g -safe-string -bin-annot -c gzip.mli
- ocamlfind ocamlc -g -safe-string -bin-annot -c gzip.ml
- ocamlfind ocamlmklib -o zip -oc camlzip zlib.cmo zip.cmo gzip.cmo  -lz
- ocamlfind ocamlopt -safe-string -c zlib.ml
- ocamlfind ocamlopt -safe-string -c zip.ml
- ocamlfind ocamlopt -safe-string -c gzip.ml
- ocamlfind ocamlmklib -o zip -oc camlzip zlib.cmx zip.cmx gzip.cmx  -lz
- ocamlfind ocamlopt -safe-string -shared -linkall -I ./ -o zip.cmxs zip.cmxa libcamlzip.a
-> compiled  camlzip.1.11
Processing 86/218: [dune: ocaml bootstrap.ml] [num: make] [ocamlbuild: make check-if-preinstalled]
Processing 87/218: [dune: ocaml bootstrap.ml] [num: make] [ocamlbuild: make check-if-preinstalled] [camlzip: make install]
+ /home/opam/.opam/opam-init/hooks/sandbox.sh "install" "make" "install" (CWD=/home/opam/.opam/5.0/.opam-switch/build/camlzip.1.11)
- cp META-zip META && \
-         ocamlfind install zip META *.cma *.a *.mli *.cmi *.cmti *.cmt gzip.cmx zip.cmx zlib.cmx zip.cmxa zip.cmxs dllcamlzip.so && \
-         rm META
- Installed /home/opam/.opam/5.0/lib/zip/zip.cmxs
- Installed /home/opam/.opam/5.0/lib/zip/zip.cmxa
- Installed /home/opam/.opam/5.0/lib/zip/zlib.cmx
- Installed /home/opam/.opam/5.0/lib/zip/zip.cmx
- Installed /home/opam/.opam/5.0/lib/zip/gzip.cmx
- Installed /home/opam/.opam/5.0/lib/zip/zlib.cmt
- Installed /home/opam/.opam/5.0/lib/zip/zip.cmt
- Installed /home/opam/.opam/5.0/lib/zip/gzip.cmt
- Installed /home/opam/.opam/5.0/lib/zip/zlib.cmti
- Installed /home/opam/.opam/5.0/lib/zip/zip.cmti
- Installed /home/opam/.opam/5.0/lib/zip/gzip.cmti
- Installed /home/opam/.opam/5.0/lib/zip/zlib.cmi
- Installed /home/opam/.opam/5.0/lib/zip/zip.cmi
- Installed /home/opam/.opam/5.0/lib/zip/gzip.cmi
- Installed /home/opam/.opam/5.0/lib/zip/zlib.mli
- Installed /home/opam/.opam/5.0/lib/zip/zip.mli
- Installed /home/opam/.opam/5.0/lib/zip/gzip.mli
- Installed /home/opam/.opam/5.0/lib/zip/zip.a
- Installed /home/opam/.opam/5.0/lib/zip/libcamlzip.a
- Installed /home/opam/.opam/5.0/lib/zip/zip.cma
- Installed /home/opam/.opam/5.0/lib/stublibs/dllcamlzip.so
- Installed /home/opam/.opam/5.0/lib/stublibs/dllcamlzip.so.owner
- ocamlfind: [WARNING] You have installed DLLs but the directory /home/opam/.opam/5.0/lib/stublibs is not mentioned in ld.conf
- Installed /home/opam/.opam/5.0/lib/zip/META
- cp META-camlzip META && \
-         ocamlfind install camlzip META && \
-         rm META
- Installed /home/opam/.opam/5.0/lib/camlzip/META
-> installed camlzip.1.11
Processing 87/218: [dune: ocaml bootstrap.ml] [num: make] [ocamlbuild: make check-if-preinstalled]
+ /home/opam/.opam/opam-init/hooks/sandbox.sh "build" "make" (CWD=/home/opam/.opam/5.0/.opam-switch/build/num.1.4)
- make -C src all
- make[1]: Entering directory '/home/opam/.opam/5.0/.opam-switch/build/num.1.4/src'
- ocamlc -ccopt -DBNG_ARCH_amd64 -c bng.c
- ocamlc -ccopt -DBNG_ARCH_amd64 -c nat_stubs.c
- ocamlmklib -oc nums bng.o nat_stubs.o
- ocamlc -w +a-4-9-41-42-44-45-48 -warn-error A -bin-annot -g -safe-string -strict-sequence -strict-formats -c int_misc.mli
- ocamlc -w +a-4-9-41-42-44-45-48 -warn-error A -bin-annot -g -safe-string -strict-sequence -strict-formats -c int_misc.ml
- ocamlc -w +a-4-9-41-42-44-45-48 -warn-error A -bin-annot -g -safe-string -strict-sequence -strict-formats -c nat.mli
- ocamlc -w +a-4-9-41-42-44-45-48 -warn-error A -bin-annot -g -safe-string -strict-sequence -strict-formats -c nat.ml
- ocamlc -w +a-4-9-41-42-44-45-48 -warn-error A -bin-annot -g -safe-string -strict-sequence -strict-formats -c big_int.mli
- ocamlc -w +a-4-9-41-42-44-45-48 -warn-error A -bin-annot -g -safe-string -strict-sequence -strict-formats -c big_int.ml
- ocamlc -w +a-4-9-41-42-44-45-48 -warn-error A -bin-annot -g -safe-string -strict-sequence -strict-formats -c arith_flags.mli
- ocamlc -w +a-4-9-41-42-44-45-48 -warn-error A -bin-annot -g -safe-string -strict-sequence -strict-formats -c arith_flags.ml
- ocamlc -w +a-4-9-41-42-44-45-48 -warn-error A -bin-annot -g -safe-string -strict-sequence -strict-formats -c ratio.mli
- ocamlc -w +a-4-9-41-42-44-45-48 -warn-error A -bin-annot -g -safe-string -strict-sequence -strict-formats -c ratio.ml
- ocamlc -w +a-4-9-41-42-44-45-48 -warn-error A -bin-annot -g -safe-string -strict-sequence -strict-formats -c num.mli
- ocamlc -w +a-4-9-41-42-44-45-48 -warn-error A -bin-annot -g -safe-string -strict-sequence -strict-formats -c num.ml
- ocamlc -w +a-4-9-41-42-44-45-48 -warn-error A -bin-annot -g -safe-string -strict-sequence -strict-formats -c arith_status.mli
- ocamlc -w +a-4-9-41-42-44-45-48 -warn-error A -bin-annot -g -safe-string -strict-sequence -strict-formats -c arith_status.ml
- ocamlmklib -o nums -oc nums -linkall int_misc.cmo nat.cmo big_int.cmo arith_flags.cmo ratio.cmo num.cmo arith_status.cmo
- ocamlopt -w +a-4-9-41-42-44-45-48 -warn-error A -bin-annot -g -safe-string -strict-sequence -strict-formats -c int_misc.ml
- ocamlopt -w +a-4-9-41-42-44-45-48 -warn-error A -bin-annot -g -safe-string -strict-sequence -strict-formats -c nat.ml
- ocamlopt -w +a-4-9-41-42-44-45-48 -warn-error A -bin-annot -g -safe-string -strict-sequence -strict-formats -c big_int.ml
- ocamlopt -w +a-4-9-41-42-44-45-48 -warn-error A -bin-annot -g -safe-string -strict-sequence -strict-formats -c arith_flags.ml
- ocamlopt -w +a-4-9-41-42-44-45-48 -warn-error A -bin-annot -g -safe-string -strict-sequence -strict-formats -c ratio.ml
- ocamlopt -w +a-4-9-41-42-44-45-48 -warn-error A -bin-annot -g -safe-string -strict-sequence -strict-formats -c num.ml
- ocamlopt -w +a-4-9-41-42-44-45-48 -warn-error A -bin-annot -g -safe-string -strict-sequence -strict-formats -c arith_status.ml
- ocamlmklib -o nums -oc nums -linkall int_misc.cmx nat.cmx big_int.cmx arith_flags.cmx ratio.cmx num.cmx arith_status.cmx
- ocamlopt -w +a-4-9-41-42-44-45-48 -warn-error A -bin-annot -g -safe-string -strict-sequence -strict-formats -I . -shared -o nums.cmxs nums.cmxa
- make[1]: Leaving directory '/home/opam/.opam/5.0/.opam-switch/build/num.1.4/src'
- make -C toplevel all
- make[1]: Entering directory '/home/opam/.opam/5.0/.opam-switch/build/num.1.4/toplevel'
- ocamlc -I ../src -I +compiler-libs -w +a-4-9-41-42-44-45-48 -warn-error A -safe-string -strict-sequence -strict-formats -c num_top_printers.mli
- ocamlc -I ../src -I +compiler-libs -w +a-4-9-41-42-44-45-48 -warn-error A -safe-string -strict-sequence -strict-formats -c num_top_printers.ml
- ocamlc -I ../src -I +compiler-libs -w +a-4-9-41-42-44-45-48 -warn-error A -safe-string -strict-sequence -strict-formats -c num_top.mli
- ocamlc -I ../src -I +compiler-libs -w +a-4-9-41-42-44-45-48 -warn-error A -safe-string -strict-sequence -strict-formats -c num_top.ml
- ocamlc -I ../src -I +compiler-libs -w +a-4-9-41-42-44-45-48 -warn-error A -safe-string -strict-sequence -strict-formats -a -o num_top.cma num_top_printers.cmo num_top.cmo
- make[1]: Leaving directory '/home/opam/.opam/5.0/.opam-switch/build/num.1.4/toplevel'
-> compiled  num.1.4
Processing 87/218: [dune: ocaml bootstrap.ml] [ocamlbuild: make check-if-preinstalled]
Processing 88/218: [dune: ocaml bootstrap.ml] [ocamlbuild: make check-if-preinstalled] [num: ocamlfind remove]
+ /home/opam/.opam/opam-init/hooks/sandbox.sh "install" "ocamlfind" "remove" "num" (CWD=/home/opam/.opam/5.0/.opam-switch/build/num.1.4)
- ocamlfind: [WARNING] No such file: /home/opam/.opam/5.0/lib/num/META
+ /home/opam/.opam/opam-init/hooks/sandbox.sh "install" "ocamlfind" "remove" "num-top" (CWD=/home/opam/.opam/5.0/.opam-switch/build/num.1.4)
- ocamlfind: [WARNING] No such file: /home/opam/.opam/5.0/lib/num-top/META
Processing 88/218: [dune: ocaml bootstrap.ml] [ocamlbuild: make check-if-preinstalled] [num: make install]
+ /home/opam/.opam/opam-init/hooks/sandbox.sh "install" "make" "install" (CWD=/home/opam/.opam/5.0/.opam-switch/build/num.1.4)
- make -C src install
- make[1]: Entering directory '/home/opam/.opam/5.0/.opam-switch/build/num.1.4/src'
- install -d /home/opam/.opam/5.0/lib/ocaml
- sed -e 's/%%VERSION%%/1.4/g' META.in > META
- ocamlfind install num META
- Installed /home/opam/.opam/5.0/lib/num/META
- rm -f META
- install -m 644 nums.cma libnums.a big_int.cmi nat.cmi num.cmi ratio.cmi arith_status.cmi big_int.mli nat.mli num.mli ratio.mli arith_status.mli big_int.cmti nat.cmti num.cmti ratio.cmti arith_status.cmti nums.cmxa nums.a int_misc.cmx nat.cmx big_int.cmx arith_flags.cmx ratio.cmx num.cmx arith_status.cmx nums.cmxs /home/opam/.opam/5.0/lib/ocaml
- install -d /home/opam/.opam/5.0/lib/ocaml/stublibs
- install dllnums.so /home/opam/.opam/5.0/lib/ocaml/stublibs
- make[1]: Leaving directory '/home/opam/.opam/5.0/.opam-switch/build/num.1.4/src'
- make -C toplevel install
- make[1]: Entering directory '/home/opam/.opam/5.0/.opam-switch/build/num.1.4/toplevel'
- sed -e 's/%%VERSION%%/1.4/g' META.in > META
- ocamlfind install num-top META num_top.cma num_top.cmi num_top_printers.cmi
- Installed /home/opam/.opam/5.0/lib/num-top/num_top_printers.cmi
- Installed /home/opam/.opam/5.0/lib/num-top/num_top.cmi
- Installed /home/opam/.opam/5.0/lib/num-top/num_top.cma
- Installed /home/opam/.opam/5.0/lib/num-top/META
- rm -f META
- make[1]: Leaving directory '/home/opam/.opam/5.0/.opam-switch/build/num.1.4/toplevel'
-> installed num.1.4
Processing 88/218: [dune: ocaml bootstrap.ml] [ocamlbuild: make check-if-preinstalled]
+ /home/opam/.opam/opam-init/hooks/sandbox.sh "build" "make" "check-if-preinstalled" "all" "opam-install" (CWD=/home/opam/.opam/5.0/.opam-switch/build/ocamlbuild.0.14.1)
- if test -d /home/opam/.opam/5.0/lib/ocaml/ocamlbuild; then\
-   >&2 echo "ERROR: Preinstalled ocamlbuild detected at"\
-        "/home/opam/.opam/5.0/lib/ocaml/ocamlbuild";\
-   >&2 echo "Installation aborted; if you want to bypass this"\
-         "safety check, pass CHECK_IF_PREINSTALLED=false to make";\
-   exit 2;\
- fi
- ocamlc.opt -w +L -w +R -w +Z -I src -I +unix -safe-string -bin-annot -strict-sequence -c src/const.ml
- ocamlc.opt -w +L -w +R -w +Z -I src -I +unix -safe-string -bin-annot -strict-sequence -c src/loc.mli
- ocamlc.opt -w +L -w +R -w +Z -I src -I +unix -safe-string -bin-annot -strict-sequence -c src/loc.ml
- ocamlc.opt -w +L -w +R -w +Z -I src -I +unix -safe-string -bin-annot -strict-sequence -c src/discard_printf.mli
- ocamlc.opt -w +L -w +R -w +Z -I src -I +unix -safe-string -bin-annot -strict-sequence -c src/discard_printf.ml
- ocamlc.opt -w +L -w +R -w +Z -I src -I +unix -safe-string -bin-annot -strict-sequence -c src/signatures.mli
- ocamlc.opt -w +L -w +R -w +Z -I src -I +unix -safe-string -bin-annot -strict-sequence -c src/my_std.mli
- ocamlc.opt -w +L -w +R -w +Z -I src -I +unix -safe-string -bin-annot -strict-sequence -c src/my_std.ml
- ocamlc.opt -w +L -w +R -w +Z -I src -I +unix -safe-string -bin-annot -strict-sequence -c src/my_unix.mli
- ocamlc.opt -w +L -w +R -w +Z -I src -I +unix -safe-string -bin-annot -strict-sequence -c src/my_unix.ml
- ocamlc.opt -w +L -w +R -w +Z -I src -I +unix -safe-string -bin-annot -strict-sequence -c src/tags.mli
- ocamlc.opt -w +L -w +R -w +Z -I src -I +unix -safe-string -bin-annot -strict-sequence -c src/tags.ml
- ocamlc.opt -w +L -w +R -w +Z -I src -I +unix -safe-string -bin-annot -strict-sequence -c src/display.mli
- ocamlc.opt -w +L -w +R -w +Z -I src -I +unix -safe-string -bin-annot -strict-sequence -c src/display.ml
- ocamlc.opt -w +L -w +R -w +Z -I src -I +unix -safe-string -bin-annot -strict-sequence -c src/log.mli
- ocamlc.opt -w +L -w +R -w +Z -I src -I +unix -safe-string -bin-annot -strict-sequence -c src/log.ml
- ocamlc.opt -w +L -w +R -w +Z -I src -I +unix -safe-string -bin-annot -strict-sequence -c src/shell.mli
- ocamlc.opt -w +L -w +R -w +Z -I src -I +unix -safe-string -bin-annot -strict-sequence -c src/shell.ml
- ocamlc.opt -w +L -w +R -w +Z -I src -I +unix -safe-string -bin-annot -strict-sequence -c src/bool.mli
- ocamlc.opt -w +L -w +R -w +Z -I src -I +unix -safe-string -bin-annot -strict-sequence -c src/bool.ml
- ocamlc.opt -w +L -w +R -w +Z -I src -I +unix -safe-string -bin-annot -strict-sequence -c src/glob_ast.mli
- ocamlc.opt -w +L -w +R -w +Z -I src -I +unix -safe-string -bin-annot -strict-sequence -c src/glob_ast.ml
- ocamllex.opt src/glob_lexer.mll
- 55 states, 419 transitions, table size 2006 bytes
- ocamlc.opt -w +L -w +R -w +Z -I src -I +unix -safe-string -bin-annot -strict-sequence -c src/glob_lexer.mli
- ocamlc.opt -w +L -w +R -w +Z -I src -I +unix -safe-string -bin-annot -strict-sequence -c src/glob_lexer.ml
- ocamlc.opt -w +L -w +R -w +Z -I src -I +unix -safe-string -bin-annot -strict-sequence -c src/glob.mli
- ocamlc.opt -w +L -w +R -w +Z -I src -I +unix -safe-string -bin-annot -strict-sequence -c src/glob.ml
- ocamllex.opt src/lexers.mll
- 251 states, 1051 transitions, table size 5710 bytes
- 4334 additional bytes used for bindings
- ocamlc.opt -w +L -w +R -w +Z -I src -I +unix -safe-string -bin-annot -strict-sequence -c src/lexers.mli
- ocamlc.opt -w +L -w +R -w +Z -I src -I +unix -safe-string -bin-annot -strict-sequence -c src/lexers.ml
- ocamlc.opt -w +L -w +R -w +Z -I src -I +unix -safe-string -bin-annot -strict-sequence -c src/param_tags.mli
- ocamlc.opt -w +L -w +R -w +Z -I src -I +unix -safe-string -bin-annot -strict-sequence -c src/param_tags.ml
- ocamlc.opt -w +L -w +R -w +Z -I src -I +unix -safe-string -bin-annot -strict-sequence -c src/command.mli
- ocamlc.opt -w +L -w +R -w +Z -I src -I +unix -safe-string -bin-annot -strict-sequence -c src/command.ml
- ocamlc.opt -w +L -w +R -w +Z -I src -I +unix -safe-string -bin-annot -strict-sequence -c src/ocamlbuild_config.ml
- ocamlc.opt -w +L -w +R -w +Z -I src -I +unix -safe-string -bin-annot -strict-sequence -c src/ocamlbuild_where.mli
- ocamlc.opt -w +L -w +R -w +Z -I src -I +unix -safe-string -bin-annot -strict-sequence -c src/ocamlbuild_where.ml
- ocamlc.opt -w +L -w +R -w +Z -I src -I +unix -safe-string -bin-annot -strict-sequence -c src/slurp.mli
- ocamlc.opt -w +L -w +R -w +Z -I src -I +unix -safe-string -bin-annot -strict-sequence -c src/slurp.ml
- ocamlc.opt -w +L -w +R -w +Z -I src -I +unix -safe-string -bin-annot -strict-sequence -c src/options.mli
- ocamlc.opt -w +L -w +R -w +Z -I src -I +unix -safe-string -bin-annot -strict-sequence -c src/options.ml
- ocamlc.opt -w +L -w +R -w +Z -I src -I +unix -safe-string -bin-annot -strict-sequence -c src/pathname.mli
- ocamlc.opt -w +L -w +R -w +Z -I src -I +unix -safe-string -bin-annot -strict-sequence -c src/pathname.ml
- ocamlc.opt -w +L -w +R -w +Z -I src -I +unix -safe-string -bin-annot -strict-sequence -c src/configuration.mli
- ocamlc.opt -w +L -w +R -w +Z -I src -I +unix -safe-string -bin-annot -strict-sequence -c src/configuration.ml
- ocamlc.opt -w +L -w +R -w +Z -I src -I +unix -safe-string -bin-annot -strict-sequence -c src/flags.mli
- ocamlc.opt -w +L -w +R -w +Z -I src -I +unix -safe-string -bin-annot -strict-sequence -c src/flags.ml
- ocamlc.opt -w +L -w +R -w +Z -I src -I +unix -safe-string -bin-annot -strict-sequence -c src/hygiene.mli
- ocamlc.opt -w +L -w +R -w +Z -I src -I +unix -safe-string -bin-annot -strict-sequence -c src/hygiene.ml
- ocamlc.opt -w +L -w +R -w +Z -I src -I +unix -safe-string -bin-annot -strict-sequence -c src/digest_cache.mli
- ocamlc.opt -w +L -w +R -w +Z -I src -I +unix -safe-string -bin-annot -strict-sequence -c src/digest_cache.ml
- ocamlc.opt -w +L -w +R -w +Z -I src -I +unix -safe-string -bin-annot -strict-sequence -c src/resource.mli
- ocamlc.opt -w +L -w +R -w +Z -I src -I +unix -safe-string -bin-annot -strict-sequence -c src/resource.ml
- ocamlc.opt -w +L -w +R -w +Z -I src -I +unix -safe-string -bin-annot -strict-sequence -c src/rule.mli
- ocamlc.opt -w +L -w +R -w +Z -I src -I +unix -safe-string -bin-annot -strict-sequence -c src/rule.ml
- ocamlc.opt -w +L -w +R -w +Z -I src -I +unix -safe-string -bin-annot -strict-sequence -c src/solver.mli
- ocamlc.opt -w +L -w +R -w +Z -I src -I +unix -safe-string -bin-annot -strict-sequence -c src/solver.ml
- ocamlc.opt -w +L -w +R -w +Z -I src -I +unix -safe-string -bin-annot -strict-sequence -c src/report.mli
- ocamlc.opt -w +L -w +R -w +Z -I src -I +unix -safe-string -bin-annot -strict-sequence -c src/report.ml
- ocamlc.opt -w +L -w +R -w +Z -I src -I +unix -safe-string -bin-annot -strict-sequence -c src/tools.mli
- ocamlc.opt -w +L -w +R -w +Z -I src -I +unix -safe-string -bin-annot -strict-sequence -c src/tools.ml
- ocamlc.opt -w +L -w +R -w +Z -I src -I +unix -safe-string -bin-annot -strict-sequence -c src/fda.mli
- ocamlc.opt -w +L -w +R -w +Z -I src -I +unix -safe-string -bin-annot -strict-sequence -c src/fda.ml
- ocamlc.opt -w +L -w +R -w +Z -I src -I +unix -safe-string -bin-annot -strict-sequence -c src/findlib.mli
- ocamlc.opt -w +L -w +R -w +Z -I src -I +unix -safe-string -bin-annot -strict-sequence -c src/findlib.ml
- ocamlc.opt -w +L -w +R -w +Z -I src -I +unix -safe-string -bin-annot -strict-sequence -c src/ocaml_arch.mli
- ocamlc.opt -w +L -w +R -w +Z -I src -I +unix -safe-string -bin-annot -strict-sequence -c src/ocaml_arch.ml
- ocamlc.opt -w +L -w +R -w +Z -I src -I +unix -safe-string -bin-annot -strict-sequence -c src/ocaml_utils.mli
- ocamlc.opt -w +L -w +R -w +Z -I src -I +unix -safe-string -bin-annot -strict-sequence -c src/ocaml_utils.ml
- ocamlc.opt -w +L -w +R -w +Z -I src -I +unix -safe-string -bin-annot -strict-sequence -c src/ocaml_dependencies.mli
- ocamlc.opt -w +L -w +R -w +Z -I src -I +unix -safe-string -bin-annot -strict-sequence -c src/ocaml_dependencies.ml
- ocamlc.opt -w +L -w +R -w +Z -I src -I +unix -safe-string -bin-annot -strict-sequence -c src/ocaml_compiler.mli
- ocamlc.opt -w +L -w +R -w +Z -I src -I +unix -safe-string -bin-annot -strict-sequence -c src/ocaml_compiler.ml
- ocamlc.opt -w +L -w +R -w +Z -I src -I +unix -safe-string -bin-annot -strict-sequence -c src/ocaml_tools.mli
- ocamlc.opt -w +L -w +R -w +Z -I src -I +unix -safe-string -bin-annot -strict-sequence -c src/ocaml_tools.ml
- ocamlc.opt -w +L -w +R -w +Z -I src -I +unix -safe-string -bin-annot -strict-sequence -c src/ocaml_specific.mli
- ocamlc.opt -w +L -w +R -w +Z -I src -I +unix -safe-string -bin-annot -strict-sequence -c src/ocaml_specific.ml
- ocamlc.opt -w +L -w +R -w +Z -I src -I +unix -safe-string -bin-annot -strict-sequence -c src/exit_codes.mli
- ocamlc.opt -w +L -w +R -w +Z -I src -I +unix -safe-string -bin-annot -strict-sequence -c src/exit_codes.ml
- ocamlc.opt -w +L -w +R -w +Z -I src -I +unix -safe-string -bin-annot -strict-sequence -c src/plugin.mli
- ocamlc.opt -w +L -w +R -w +Z -I src -I +unix -safe-string -bin-annot -strict-sequence -c src/plugin.ml
- ocamlc.opt -w +L -w +R -w +Z -I src -I +unix -safe-string -bin-annot -strict-sequence -c src/hooks.mli
- ocamlc.opt -w +L -w +R -w +Z -I src -I +unix -safe-string -bin-annot -strict-sequence -c src/hooks.ml
- ocamlc.opt -w +L -w +R -w +Z -I src -I +unix -safe-string -bin-annot -strict-sequence -c src/main.mli
- ocamlc.opt -w +L -w +R -w +Z -I src -I +unix -safe-string -bin-annot -strict-sequence -c src/main.ml
- mkdir -p tmp
- ocamlc.opt -pack src/const.cmo src/loc.cmo src/discard_printf.cmo src/signatures.cmi src/my_std.cmo src/my_unix.cmo src/tags.cmo src/display.cmo src/log.cmo src/shell.cmo src/bool.cmo src/glob_ast.cmo src/glob_lexer.cmo src/glob.cmo src/lexers.cmo src/param_tags.cmo src/command.cmo src/ocamlbuild_config.cmo src/ocamlbuild_where.cmo src/slurp.cmo src/options.cmo src/pathname.cmo src/configuration.cmo src/flags.cmo src/hygiene.cmo src/digest_cache.cmo src/resource.cmo src/rule.cmo src/solver.cmo src/report.cmo src/tools.cmo src/fda.cmo src/findlib.cmo src/ocaml_arch.cmo src/ocaml_utils.cmo src/ocaml_dependencies.cmo src/ocaml_compiler.cmo src/ocaml_tools.cmo src/ocaml_specific.cmo src/exit_codes.cmo src/plugin.cmo src/hooks.cmo src/main.cmo -o tmp/ocamlbuild_pack.cmo
- mv tmp/ocamlbuild_pack.cmi src/ocamlbuild_pack.cmi
- mv tmp/ocamlbuild_pack.cmo src/ocamlbuild_pack.cmo
- ocamlc.opt -w +L -w +R -w +Z -I src -I +unix -safe-string -bin-annot -strict-sequence -c src/ocamlbuild_plugin.mli
- ocamlc.opt -w +L -w +R -w +Z -I src -I +unix -safe-string -bin-annot -strict-sequence -c src/ocamlbuild_plugin.ml
- ocamlc.opt -w +L -w +R -w +Z -I src -I +unix -safe-string -bin-annot -strict-sequence -c src/ocamlbuild_executor.mli
- ocamlc.opt -w +L -w +R -w +Z -I src -I +unix -safe-string -bin-annot -strict-sequence -c src/ocamlbuild_executor.ml
- ocamlc.opt -w +L -w +R -w +Z -I src -I +unix -safe-string -bin-annot -strict-sequence -c src/ocamlbuild_unix_plugin.mli
- ocamlc.opt -w +L -w +R -w +Z -I src -I +unix -safe-string -bin-annot -strict-sequence -c src/ocamlbuild_unix_plugin.ml
- ocamlc.opt -w +L -w +R -w +Z -I src -I +unix -safe-string -bin-annot -strict-sequence -c src/ocamlbuild.mli
- ocamlc.opt -w +L -w +R -w +Z -I src -I +unix -safe-string -bin-annot -strict-sequence -c src/ocamlbuild.ml
- ocamlc.opt -I +unix -I src -o ocamlbuild.byte unix.cma src/ocamlbuild_pack.cmo src/ocamlbuild_plugin.cmo src/ocamlbuild_executor.cmo src/ocamlbuild_unix_plugin.cmo src/ocamlbuild.cmo
- ocamlc.opt -a -o src/ocamlbuildlib.cma src/ocamlbuild_pack.cmo src/ocamlbuild_plugin.cmo src/ocamlbuild_executor.cmo src/ocamlbuild_unix_plugin.cmo
- ocamlopt.opt -for-pack Ocamlbuild_pack -w +L -w +R -w +Z -I src -I +unix -safe-string -bin-annot -strict-sequence -c src/const.ml
- ocamlopt.opt -for-pack Ocamlbuild_pack -w +L -w +R -w +Z -I src -I +unix -safe-string -bin-annot -strict-sequence -c src/loc.ml
- ocamlopt.opt -for-pack Ocamlbuild_pack -w +L -w +R -w +Z -I src -I +unix -safe-string -bin-annot -strict-sequence -c src/discard_printf.ml
- ocamlopt.opt -for-pack Ocamlbuild_pack -w +L -w +R -w +Z -I src -I +unix -safe-string -bin-annot -strict-sequence -c src/my_std.ml
- ocamlopt.opt -for-pack Ocamlbuild_pack -w +L -w +R -w +Z -I src -I +unix -safe-string -bin-annot -strict-sequence -c src/my_unix.ml
- ocamlopt.opt -for-pack Ocamlbuild_pack -w +L -w +R -w +Z -I src -I +unix -safe-string -bin-annot -strict-sequence -c src/tags.ml
- ocamlopt.opt -for-pack Ocamlbuild_pack -w +L -w +R -w +Z -I src -I +unix -safe-string -bin-annot -strict-sequence -c src/display.ml
- ocamlopt.opt -for-pack Ocamlbuild_pack -w +L -w +R -w +Z -I src -I +unix -safe-string -bin-annot -strict-sequence -c src/log.ml
- ocamlopt.opt -for-pack Ocamlbuild_pack -w +L -w +R -w +Z -I src -I +unix -safe-string -bin-annot -strict-sequence -c src/shell.ml
- ocamlopt.opt -for-pack Ocamlbuild_pack -w +L -w +R -w +Z -I src -I +unix -safe-string -bin-annot -strict-sequence -c src/bool.ml
- ocamlopt.opt -for-pack Ocamlbuild_pack -w +L -w +R -w +Z -I src -I +unix -safe-string -bin-annot -strict-sequence -c src/glob_ast.ml
- ocamlopt.opt -for-pack Ocamlbuild_pack -w +L -w +R -w +Z -I src -I +unix -safe-string -bin-annot -strict-sequence -c src/glob_lexer.ml
- ocamlopt.opt -for-pack Ocamlbuild_pack -w +L -w +R -w +Z -I src -I +unix -safe-string -bin-annot -strict-sequence -c src/glob.ml
- ocamlopt.opt -for-pack Ocamlbuild_pack -w +L -w +R -w +Z -I src -I +unix -safe-string -bin-annot -strict-sequence -c src/lexers.ml
- ocamlopt.opt -for-pack Ocamlbuild_pack -w +L -w +R -w +Z -I src -I +unix -safe-string -bin-annot -strict-sequence -c src/param_tags.ml
- ocamlopt.opt -for-pack Ocamlbuild_pack -w +L -w +R -w +Z -I src -I +unix -safe-string -bin-annot -strict-sequence -c src/command.ml
- ocamlopt.opt -for-pack Ocamlbuild_pack -w +L -w +R -w +Z -I src -I +unix -safe-string -bin-annot -strict-sequence -c src/ocamlbuild_config.ml
- ocamlopt.opt -for-pack Ocamlbuild_pack -w +L -w +R -w +Z -I src -I +unix -safe-string -bin-annot -strict-sequence -c src/ocamlbuild_where.ml
- ocamlopt.opt -for-pack Ocamlbuild_pack -w +L -w +R -w +Z -I src -I +unix -safe-string -bin-annot -strict-sequence -c src/slurp.ml
- ocamlopt.opt -for-pack Ocamlbuild_pack -w +L -w +R -w +Z -I src -I +unix -safe-string -bin-annot -strict-sequence -c src/options.ml
- ocamlopt.opt -for-pack Ocamlbuild_pack -w +L -w +R -w +Z -I src -I +unix -safe-string -bin-annot -strict-sequence -c src/pathname.ml
- ocamlopt.opt -for-pack Ocamlbuild_pack -w +L -w +R -w +Z -I src -I +unix -safe-string -bin-annot -strict-sequence -c src/configuration.ml
- ocamlopt.opt -for-pack Ocamlbuild_pack -w +L -w +R -w +Z -I src -I +unix -safe-string -bin-annot -strict-sequence -c src/flags.ml
- ocamlopt.opt -for-pack Ocamlbuild_pack -w +L -w +R -w +Z -I src -I +unix -safe-string -bin-annot -strict-sequence -c src/hygiene.ml
- ocamlopt.opt -for-pack Ocamlbuild_pack -w +L -w +R -w +Z -I src -I +unix -safe-string -bin-annot -strict-sequence -c src/digest_cache.ml
- ocamlopt.opt -for-pack Ocamlbuild_pack -w +L -w +R -w +Z -I src -I +unix -safe-string -bin-annot -strict-sequence -c src/resource.ml
- ocamlopt.opt -for-pack Ocamlbuild_pack -w +L -w +R -w +Z -I src -I +unix -safe-string -bin-annot -strict-sequence -c src/rule.ml
- ocamlopt.opt -for-pack Ocamlbuild_pack -w +L -w +R -w +Z -I src -I +unix -safe-string -bin-annot -strict-sequence -c src/solver.ml
- ocamlopt.opt -for-pack Ocamlbuild_pack -w +L -w +R -w +Z -I src -I +unix -safe-string -bin-annot -strict-sequence -c src/report.ml
- ocamlopt.opt -for-pack Ocamlbuild_pack -w +L -w +R -w +Z -I src -I +unix -safe-string -bin-annot -strict-sequence -c src/tools.ml
- ocamlopt.opt -for-pack Ocamlbuild_pack -w +L -w +R -w +Z -I src -I +unix -safe-string -bin-annot -strict-sequence -c src/fda.ml
- ocamlopt.opt -for-pack Ocamlbuild_pack -w +L -w +R -w +Z -I src -I +unix -safe-string -bin-annot -strict-sequence -c src/findlib.ml
- ocamlopt.opt -for-pack Ocamlbuild_pack -w +L -w +R -w +Z -I src -I +unix -safe-string -bin-annot -strict-sequence -c src/ocaml_arch.ml
- ocamlopt.opt -for-pack Ocamlbuild_pack -w +L -w +R -w +Z -I src -I +unix -safe-string -bin-annot -strict-sequence -c src/ocaml_utils.ml
- ocamlopt.opt -for-pack Ocamlbuild_pack -w +L -w +R -w +Z -I src -I +unix -safe-string -bin-annot -strict-sequence -c src/ocaml_dependencies.ml
- ocamlopt.opt -for-pack Ocamlbuild_pack -w +L -w +R -w +Z -I src -I +unix -safe-string -bin-annot -strict-sequence -c src/ocaml_compiler.ml
- ocamlopt.opt -for-pack Ocamlbuild_pack -w +L -w +R -w +Z -I src -I +unix -safe-string -bin-annot -strict-sequence -c src/ocaml_tools.ml
- ocamlopt.opt -for-pack Ocamlbuild_pack -w +L -w +R -w +Z -I src -I +unix -safe-string -bin-annot -strict-sequence -c src/ocaml_specific.ml
- ocamlopt.opt -for-pack Ocamlbuild_pack -w +L -w +R -w +Z -I src -I +unix -safe-string -bin-annot -strict-sequence -c src/exit_codes.ml
- ocamlopt.opt -for-pack Ocamlbuild_pack -w +L -w +R -w +Z -I src -I +unix -safe-string -bin-annot -strict-sequence -c src/plugin.ml
- ocamlopt.opt -for-pack Ocamlbuild_pack -w +L -w +R -w +Z -I src -I +unix -safe-string -bin-annot -strict-sequence -c src/hooks.ml
- ocamlopt.opt -for-pack Ocamlbuild_pack -w +L -w +R -w +Z -I src -I +unix -safe-string -bin-annot -strict-sequence -c src/main.ml
- mkdir -p tmp
- ocamlopt.opt -pack src/const.cmx src/loc.cmx src/discard_printf.cmx src/signatures.cmi src/my_std.cmx src/my_unix.cmx src/tags.cmx src/display.cmx src/log.cmx src/shell.cmx src/bool.cmx src/glob_ast.cmx src/glob_lexer.cmx src/glob.cmx src/lexers.cmx src/param_tags.cmx src/command.cmx src/ocamlbuild_config.cmx src/ocamlbuild_where.cmx src/slurp.cmx src/options.cmx src/pathname.cmx src/configuration.cmx src/flags.cmx src/hygiene.cmx src/digest_cache.cmx src/resource.cmx src/rule.cmx src/solver.cmx src/report.cmx src/tools.cmx src/fda.cmx src/findlib.cmx src/ocaml_arch.cmx src/ocaml_utils.cmx src/ocaml_dependencies.cmx src/ocaml_compiler.cmx src/ocaml_tools.cmx src/ocaml_specific.cmx src/exit_codes.cmx src/plugin.cmx src/hooks.cmx src/main.cmx -o tmp/ocamlbuild_pack.cmx
- mv tmp/ocamlbuild_pack.cmx src/ocamlbuild_pack.cmx
- mv tmp/ocamlbuild_pack.o src/ocamlbuild_pack.o
- ocamlopt.opt -for-pack Ocamlbuild_pack -w +L -w +R -w +Z -I src -I +unix -safe-string -bin-annot -strict-sequence -c src/ocamlbuild_plugin.ml
- ocamlopt.opt -for-pack Ocamlbuild_pack -w +L -w +R -w +Z -I src -I +unix -safe-string -bin-annot -strict-sequence -c src/ocamlbuild_executor.ml
- ocamlopt.opt -for-pack Ocamlbuild_pack -w +L -w +R -w +Z -I src -I +unix -safe-string -bin-annot -strict-sequence -c src/ocamlbuild_unix_plugin.ml
- ocamlopt.opt -for-pack Ocamlbuild_pack -w +L -w +R -w +Z -I src -I +unix -safe-string -bin-annot -strict-sequence -c src/ocamlbuild.ml
- ocamlopt.opt -I +unix -I src -o ocamlbuild.native unix.cmxa src/ocamlbuild_pack.cmx src/ocamlbuild_plugin.cmx src/ocamlbuild_executor.cmx src/ocamlbuild_unix_plugin.cmx src/ocamlbuild.cmx
- ocamlopt.opt -a -o src/ocamlbuildlib.cmxa src/ocamlbuild_pack.cmx src/ocamlbuild_plugin.cmx src/ocamlbuild_executor.cmx src/ocamlbuild_unix_plugin.cmx
- ocamlc.opt src/ocamlbuild_pack.cmo -I src man/options_man.ml -o man/options_man.byte
- ./man/options_man.byte > man/ocamlbuild.options.1
- cat man/ocamlbuild.header.1 man/ocamlbuild.options.1 man/ocamlbuild.footer.1 > man/ocamlbuild.1
- make ocamlbuild.install
- make[1]: Entering directory '/home/opam/.opam/5.0/.opam-switch/build/ocamlbuild.0.14.1'
- rm -f ocamlbuild.install
- touch ocamlbuild.install
- make install-bin-opam
- make[2]: Entering directory '/home/opam/.opam/5.0/.opam-switch/build/ocamlbuild.0.14.1'
- echo 'bin: [' >> ocamlbuild.install
- echo '  "ocamlbuild.byte" {"ocamlbuild.byte"}' >> ocamlbuild.install
- echo '  "ocamlbuild.native" {"ocamlbuild.native"}' >> ocamlbuild.install
- echo '  "ocamlbuild.native" {"ocamlbuild"}' >> ocamlbuild.install
- echo ']' >> ocamlbuild.install
- echo >> ocamlbuild.install
- make[2]: Leaving directory '/home/opam/.opam/5.0/.opam-switch/build/ocamlbuild.0.14.1'
- make install-lib-opam
- make[2]: Entering directory '/home/opam/.opam/5.0/.opam-switch/build/ocamlbuild.0.14.1'
- echo 'lib: [' >> ocamlbuild.install
- make install-lib-basics-opam
- make[3]: Entering directory '/home/opam/.opam/5.0/.opam-switch/build/ocamlbuild.0.14.1'
- echo '  "ocamlbuild.opam" {"opam"}' >> ocamlbuild.install
- echo '  "META"' >> ocamlbuild.install
- for lib in src/signatures.mli src/signatures.cmi src/signatures.cmti; do \
-   echo "  \"$lib\" {\"$(basename $lib)\"}" >> ocamlbuild.install; \
- done
- make[3]: Leaving directory '/home/opam/.opam/5.0/.opam-switch/build/ocamlbuild.0.14.1'
- make install-lib-byte-opam
- make[3]: Entering directory '/home/opam/.opam/5.0/.opam-switch/build/ocamlbuild.0.14.1'
- for lib in src/ocamlbuildlib.cma src/ocamlbuild.cmo src/ocamlbuild_pack.cmi src/ocamlbuild_plugin.cmi src/ocamlbuild_executor.cmi src/ocamlbuild_unix_plugin.cmi; do \
-   echo "  \"$lib\" {\"$(basename $lib)\"}" >> ocamlbuild.install; \
- done
- make[3]: Leaving directory '/home/opam/.opam/5.0/.opam-switch/build/ocamlbuild.0.14.1'
- make install-lib-native-opam
- make[3]: Entering directory '/home/opam/.opam/5.0/.opam-switch/build/ocamlbuild.0.14.1'
- for lib in src/ocamlbuildlib.cmxa src/ocamlbuildlib.a src/ocamlbuild.cmx src/ocamlbuild.o src/ocamlbuild_pack.cmx src/ocamlbuild_plugin.cmx src/ocamlbuild_executor.cmx src/ocamlbuild_unix_plugin.cmx src/ocamlbuild_plugin.o src/ocamlbuild_executor.o src/ocamlbuild_unix_plugin.o; do \
-   echo "  \"$lib\" {\"$(basename $lib)\"}" >> ocamlbuild.install; \
- done
- make[3]: Leaving directory '/home/opam/.opam/5.0/.opam-switch/build/ocamlbuild.0.14.1'
- echo ']' >> ocamlbuild.install
- echo >> ocamlbuild.install
- make[2]: Leaving directory '/home/opam/.opam/5.0/.opam-switch/build/ocamlbuild.0.14.1'
- make install-man-opam
- make[2]: Entering directory '/home/opam/.opam/5.0/.opam-switch/build/ocamlbuild.0.14.1'
- echo 'man: [' >> ocamlbuild.install
- echo '  "man/ocamlbuild.1" {"man1/ocamlbuild.1"}' >> ocamlbuild.install
- echo ']' >> ocamlbuild.install
- echo >> ocamlbuild.install
- make[2]: Leaving directory '/home/opam/.opam/5.0/.opam-switch/build/ocamlbuild.0.14.1'
- make install-doc-opam
- make[2]: Entering directory '/home/opam/.opam/5.0/.opam-switch/build/ocamlbuild.0.14.1'
- echo 'doc: [' >> ocamlbuild.install
- echo '  "LICENSE"' >> ocamlbuild.install
- echo '  "Changes"' >> ocamlbuild.install
- echo '  "Readme.md"' >> ocamlbuild.install
- echo ']' >> ocamlbuild.install
- make[2]: Leaving directory '/home/opam/.opam/5.0/.opam-switch/build/ocamlbuild.0.14.1'
- make[1]: Leaving directory '/home/opam/.opam/5.0/.opam-switch/build/ocamlbuild.0.14.1'
-> compiled  ocamlbuild.0.14.1
Processing 88/218: [dune: ocaml bootstrap.ml]
-> installed ocamlbuild.0.14.1
Processing 89/218: [dune: ocaml bootstrap.ml]
Processing 90/218: [dune: ocaml bootstrap.ml] [ocamlify: ocaml setup.ml]
Processing 91/218: [dune: ocaml bootstrap.ml] [ocamlify: ocaml setup.ml] [ocamlmod: ocaml setup.ml]
+ /home/opam/.opam/opam-init/hooks/sandbox.sh "build" "ocaml" "setup.ml" "-configure" "--prefix" "/home/opam/.opam/5.0" (CWD=/home/opam/.opam/5.0/.opam-switch/build/ocamlify.0.0.1)
- File "/home/gildor/programmation/oasis/src/oasis/PropList.ml", line 93, characters 13-29:
- Error: Unbound value String.lowercase
[ERROR] The compilation of ocamlify.0.0.1 failed at "ocaml setup.ml -configure --prefix /home/opam/.opam/5.0".
Processing 91/218: [dune: ocaml bootstrap.ml] [ocamlmod: ocaml setup.ml]
Processing 92/218: [dune: ocaml bootstrap.ml] [ocamlmod: ocaml setup.ml]
[ERROR] The compilation of ocamlmod.0.0.9 failed at "ocaml setup.ml -configure --prefix /home/opam/.opam/5.0".
+ /home/opam/.opam/opam-init/hooks/sandbox.sh "build" "ocaml" "setup.ml" "-configure" "--prefix" "/home/opam/.opam/5.0" (CWD=/home/opam/.opam/5.0/.opam-switch/build/ocamlmod.0.0.9)
- File "./setup.ml", line 596, characters 4-15:
- 596 |     Stream.from next
-           ^^^^^^^^^^^
- Error: Unbound module Stream
Processing 92/218: [dune: ocaml bootstrap.ml]
Processing 93/218: [dune: ocaml bootstrap.ml]
Processing 94/218: [dune: ocaml bootstrap.ml]
Processing 95/218: [dune: ocaml bootstrap.ml]
+ /home/opam/.opam/opam-init/hooks/sandbox.sh "build" "ocaml" "bootstrap.ml" "-j" "31" (CWD=/home/opam/.opam/5.0/.opam-switch/build/dune.3.1.1)
- ocamlc -output-complete-exe -w -24 -g -o .duneboot.exe -I boot unix.cma boot/libs.ml boot/duneboot.ml
- ./.duneboot.exe -j 31
- cd _boot && /home/opam/.opam/5.0/bin/ocamlopt.opt -c -g -no-alias-deps -w -49-6 -alert -unstable -I +threads build_path_prefix_map.ml
- File "vendor/build_path_prefix_map/src/build_path_prefix_map.ml", line 5, characters 17-31:
- Alert deprecated: Stdlib.Printf.kprintf
- Use Printf.ksprintf instead.
- cd _boot && /home/opam/.opam/5.0/bin/ocamlopt.opt -c -g -no-alias-deps -w -49-6 -alert -unstable -I +threads opamLexer.ml
- File "vendor/opam-file-format/src/opamLexer.mll", line 21, characters 2-16:
- Alert deprecated: Stdlib.Printf.kprintf
- Use Printf.ksprintf instead.
- 

Processing 95/218: [dune: ./dune.exe build]
+ /home/opam/.opam/opam-init/hooks/sandbox.sh "build" "./dune.exe" "build" "dune.install" "--release" "--profile" "dune-bootstrap" "-j" "31" (CWD=/home/opam/.opam/5.0/.opam-switch/build/dune.3.1.1)
-> compiled  dune.3.1.1
-> installed dune.3.1.1
Processing 97/218: [bigstringaf: dune build]
Processing 98/218: [bigstringaf: dune build] [csexp: dune build]
Processing 99/218: [bigstringaf: dune build] [csexp: dune build] [jane-street-headers: dune build]
Processing 100/218: [bigstringaf: dune build] [csexp: dune build] [jane-street-headers: dune build] [ocaml-compiler-libs: dune build]
Processing 101/218: [bigstringaf: dune build] [csexp: dune build] [jane-street-headers: dune build] [ocaml-compiler-libs: dune build] [ocaml-syntax-shims: dune build]
Processing 102/218: [bigstringaf: dune build] [csexp: dune build] [jane-street-headers: dune build] [ocaml-compiler-libs: dune build] [ocaml-syntax-shims: dune build] [octavius: dune build]
Processing 103/218: [bigstringaf: dune build] [csexp: dune build] [jane-street-headers: dune build] [ocaml-compiler-libs: dune build] [ocaml-syntax-shims: dune build] [octavius: dune build] [ppx_derivers: dune build]
Processing 104/218: [bigstringaf: dune build] [csexp: dune build] [jane-street-headers: dune build] [ocaml-compiler-libs: dune build] [ocaml-syntax-shims: dune build] [octavius: dune build] [ppx_derivers: dune build] [re: dune build]
Processing 105/218: [bigstringaf: dune build] [csexp: dune build] [jane-street-headers: dune build] [ocaml-compiler-libs: dune build] [ocaml-syntax-shims: dune build] [octavius: dune build] [ppx_derivers: dune build] [re: dune build] [result: dune build]
Processing 106/218: [bigstringaf: dune build] [csexp: dune build] [jane-street-headers: dune build] [ocaml-compiler-libs: dune build] [ocaml-syntax-shims: dune build] [octavius: dune build] [ppx_derivers: dune build] [re: dune build] [result: dune build] [sexplib0: dune build]
Processing 107/218: [bigstringaf: dune build] [csexp: dune build] [jane-street-headers: dune build] [ocaml-compiler-libs: dune build] [ocaml-syntax-shims: dune build] [octavius: dune build] [ppx_derivers: dune build] [re: dune build] [result: dune build] [sexplib0: dune build] [stdlib-shims: dune build]
Processing 108/218: [bigstringaf: dune build] [csexp: dune build] [jane-street-headers: dune build] [ocaml-compiler-libs: dune build] [ocaml-syntax-shims: dune build] [octavius: dune build] [ppx_derivers: dune build] [re: dune build] [result: dune build] [sexplib0: dune build] [stdlib-shims: dune build] [stringext: dune build]
+ /home/opam/.opam/opam-init/hooks/sandbox.sh "build" "dune" "build" "-p" "jane-street-headers" "-j" "31" (CWD=/home/opam/.opam/5.0/.opam-switch/build/jane-street-headers.v0.14.0)
-> compiled  jane-street-headers.v0.14.0
Processing 108/218: [bigstringaf: dune build] [csexp: dune build] [ocaml-compiler-libs: dune build] [ocaml-syntax-shims: dune build] [octavius: dune build] [ppx_derivers: dune build] [re: dune build] [result: dune build] [sexplib0: dune build] [stdlib-shims: dune build] [stringext: dune build]
-> installed jane-street-headers.v0.14.0
Processing 109/218: [bigstringaf: dune build] [csexp: dune build] [ocaml-compiler-libs: dune build] [ocaml-syntax-shims: dune build] [octavius: dune build] [ppx_derivers: dune build] [re: dune build] [result: dune build] [sexplib0: dune build] [stdlib-shims: dune build] [stringext: dune build]
+ /home/opam/.opam/opam-init/hooks/sandbox.sh "build" "dune" "build" "-p" "ppx_derivers" "-j" "31" (CWD=/home/opam/.opam/5.0/.opam-switch/build/ppx_derivers.1.2.1)
-> compiled  ppx_derivers.1.2.1
Processing 109/218: [bigstringaf: dune build] [csexp: dune build] [ocaml-compiler-libs: dune build] [ocaml-syntax-shims: dune build] [octavius: dune build] [re: dune build] [result: dune build] [sexplib0: dune build] [stdlib-shims: dune build] [stringext: dune build]
-> installed ppx_derivers.1.2.1
Processing 110/218: [bigstringaf: dune build] [csexp: dune build] [ocaml-compiler-libs: dune build] [ocaml-syntax-shims: dune build] [octavius: dune build] [re: dune build] [result: dune build] [sexplib0: dune build] [stdlib-shims: dune build] [stringext: dune build]
+ /home/opam/.opam/opam-init/hooks/sandbox.sh "build" "dune" "build" "-p" "bigstringaf" "-j" "31" (CWD=/home/opam/.opam/5.0/.opam-switch/build/bigstringaf.0.9.0)
- (cd _build/default/lib/freestanding && /usr/bin/gmake)
- touch libbigstringaf_freestanding_stubs.a
-> compiled  bigstringaf.0.9.0
Processing 110/218: [csexp: dune build] [ocaml-compiler-libs: dune build] [ocaml-syntax-shims: dune build] [octavius: dune build] [re: dune build] [result: dune build] [sexplib0: dune build] [stdlib-shims: dune build] [stringext: dune build]
-> installed bigstringaf.0.9.0
Processing 111/218: [csexp: dune build] [ocaml-compiler-libs: dune build] [ocaml-syntax-shims: dune build] [octavius: dune build] [re: dune build] [result: dune build] [sexplib0: dune build] [stdlib-shims: dune build] [stringext: dune build]
+ /home/opam/.opam/opam-init/hooks/sandbox.sh "build" "dune" "build" "-p" "csexp" "-j" "31" "@install" (CWD=/home/opam/.opam/5.0/.opam-switch/build/csexp.1.5.1)
-> compiled  csexp.1.5.1
Processing 111/218: [ocaml-compiler-libs: dune build] [ocaml-syntax-shims: dune build] [octavius: dune build] [re: dune build] [result: dune build] [sexplib0: dune build] [stdlib-shims: dune build] [stringext: dune build]
-> installed csexp.1.5.1
Processing 112/218: [ocaml-compiler-libs: dune build] [ocaml-syntax-shims: dune build] [octavius: dune build] [re: dune build] [result: dune build] [sexplib0: dune build] [stdlib-shims: dune build] [stringext: dune build]
Processing 113/218: [dune-configurator: rm] [ocaml-compiler-libs: dune build] [ocaml-syntax-shims: dune build] [octavius: dune build] [re: dune build] [result: dune build] [sexplib0: dune build] [stdlib-shims: dune build] [stringext: dune build]
+ /home/opam/.opam/opam-init/hooks/sandbox.sh "build" "dune" "build" "-p" "result" "-j" "31" (CWD=/home/opam/.opam/5.0/.opam-switch/build/result.1.5)
-> compiled  result.1.5
Processing 113/218: [dune-configurator: rm] [ocaml-compiler-libs: dune build] [ocaml-syntax-shims: dune build] [octavius: dune build] [re: dune build] [sexplib0: dune build] [stdlib-shims: dune build] [stringext: dune build]
-> installed result.1.5
Processing 114/218: [dune-configurator: rm] [ocaml-compiler-libs: dune build] [ocaml-syntax-shims: dune build] [octavius: dune build] [re: dune build] [sexplib0: dune build] [stdlib-shims: dune build] [stringext: dune build]
+ /home/opam/.opam/opam-init/hooks/sandbox.sh "build" "dune" "build" "-p" "sexplib0" "-j" "31" (CWD=/home/opam/.opam/5.0/.opam-switch/build/sexplib0.v0.14.0)
- (cd _build/default && /home/opam/.opam/5.0/bin/ocamlc.opt -w -40 -g -bin-annot -I src/.sexplib0.objs/byte -intf-suffix .ml -no-alias-deps -open Sexplib0__ -o src/.sexplib0.objs/byte/sexplib0__Sexp_conv.cmo -c -impl src/sexp_conv.ml)
- File "src/sexp_conv.ml", line 105, characters 15-31:
- 105 |       let id = Obj.extension_id
-                      ^^^^^^^^^^^^^^^^
- Error: Unbound value Obj.extension_id
- (cd _build/default && /home/opam/.opam/5.0/bin/ocamlopt.opt -w -40 -g -I src/.sexplib0.objs/byte -I src/.sexplib0.objs/native -intf-suffix .ml -no-alias-deps -open Sexplib0__ -o src/.sexplib0.objs/native/sexplib0__Sexp_conv.cmx -c -impl src/sexp_conv.ml)
- File "src/sexp_conv.ml", line 105, characters 15-31:
- 105 |       let id = Obj.extension_id
-                      ^^^^^^^^^^^^^^^^
- Error: Unbound value Obj.extension_id
Processing 114/218: [dune-configurator: rm] [ocaml-compiler-libs: dune build] [ocaml-syntax-shims: dune build] [octavius: dune build] [re: dune build] [stdlib-shims: dune build] [stringext: dune build]
[ERROR] The compilation of sexplib0.v0.14.0 failed at "dune build -p sexplib0 -j 31".
Processing 115/218: [dune-configurator: rm] [ocaml-compiler-libs: dune build] [ocaml-syntax-shims: dune build] [octavius: dune build] [re: dune build] [stdlib-shims: dune build] [stringext: dune build]
+ /home/opam/.opam/opam-init/hooks/sandbox.sh "build" "dune" "build" "-p" "stdlib-shims" "-j" "31" (CWD=/home/opam/.opam/5.0/.opam-switch/build/stdlib-shims.0.3.0)
-> compiled  stdlib-shims.0.3.0
Processing 115/218: [dune-configurator: rm] [ocaml-compiler-libs: dune build] [ocaml-syntax-shims: dune build] [octavius: dune build] [re: dune build] [stringext: dune build]
-> installed stdlib-shims.0.3.0
Processing 116/218: [dune-configurator: rm] [ocaml-compiler-libs: dune build] [ocaml-syntax-shims: dune build] [octavius: dune build] [re: dune build] [stringext: dune build]
Processing 117/218: [dune-configurator: rm] [fileutils: dune build] [ocaml-compiler-libs: dune build] [ocaml-syntax-shims: dune build] [octavius: dune build] [re: dune build] [stringext: dune build]
+ /home/opam/.opam/opam-init/hooks/sandbox.sh "build" "dune" "build" "-p" "stringext" "-j" "31" (CWD=/home/opam/.opam/5.0/.opam-switch/build/stringext.1.6.0)
-> compiled  stringext.1.6.0
Processing 117/218: [dune-configurator: rm] [fileutils: dune build] [ocaml-compiler-libs: dune build] [ocaml-syntax-shims: dune build] [octavius: dune build] [re: dune build]
-> installed stringext.1.6.0
Processing 118/218: [dune-configurator: rm] [fileutils: dune build] [ocaml-compiler-libs: dune build] [ocaml-syntax-shims: dune build] [octavius: dune build] [re: dune build]
+ /home/opam/.opam/opam-init/hooks/sandbox.sh "build" "rm" "-rf" "vendor/csexp" (CWD=/home/opam/.opam/5.0/.opam-switch/build/dune-configurator.3.1.1)
+ /home/opam/.opam/opam-init/hooks/sandbox.sh "build" "rm" "-rf" "vendor/pp" (CWD=/home/opam/.opam/5.0/.opam-switch/build/dune-configurator.3.1.1)
Processing 118/218: [dune-configurator: dune build] [fileutils: dune build] [ocaml-compiler-libs: dune build] [ocaml-syntax-shims: dune build] [octavius: dune build] [re: dune build]
+ /home/opam/.opam/opam-init/hooks/sandbox.sh "build" "dune" "build" "-p" "ocaml-syntax-shims" "-j" "31" "@install" (CWD=/home/opam/.opam/5.0/.opam-switch/build/ocaml-syntax-shims.1.0.0)
-> compiled  ocaml-syntax-shims.1.0.0
Processing 118/218: [dune-configurator: dune build] [fileutils: dune build] [ocaml-compiler-libs: dune build] [octavius: dune build] [re: dune build]
-> installed ocaml-syntax-shims.1.0.0
Processing 119/218: [dune-configurator: dune build] [fileutils: dune build] [ocaml-compiler-libs: dune build] [octavius: dune build] [re: dune build]
Processing 120/218: [angstrom: dune build] [dune-configurator: dune build] [fileutils: dune build] [ocaml-compiler-libs: dune build] [octavius: dune build] [re: dune build]
+ /home/opam/.opam/opam-init/hooks/sandbox.sh "build" "dune" "build" "-p" "ocaml-compiler-libs" "-j" "31" "@install" (CWD=/home/opam/.opam/5.0/.opam-switch/build/ocaml-compiler-libs.v0.12.4)
-> compiled  ocaml-compiler-libs.v0.12.4
Processing 120/218: [angstrom: dune build] [dune-configurator: dune build] [fileutils: dune build] [octavius: dune build] [re: dune build]
-> installed ocaml-compiler-libs.v0.12.4
Processing 121/218: [angstrom: dune build] [dune-configurator: dune build] [fileutils: dune build] [octavius: dune build] [re: dune build]
Processing 122/218: [angstrom: dune build] [dune-configurator: dune build] [fileutils: dune build] [octavius: dune build] [ppxlib: dune subst] [re: dune build]
+ /home/opam/.opam/opam-init/hooks/sandbox.sh "build" "dune" "build" "-p" "re" "-j" "31" (CWD=/home/opam/.opam/5.0/.opam-switch/build/re.1.10.4)
-> compiled  re.1.10.4
Processing 122/218: [angstrom: dune build] [dune-configurator: dune build] [fileutils: dune build] [octavius: dune build] [ppxlib: dune subst]
-> installed re.1.10.4
Processing 123/218: [angstrom: dune build] [dune-configurator: dune build] [fileutils: dune build] [octavius: dune build] [ppxlib: dune subst]
+ /home/opam/.opam/opam-init/hooks/sandbox.sh "build" "dune" "subst" (CWD=/home/opam/.opam/5.0/.opam-switch/build/ppxlib.0.25.0~5.00preview)
Processing 123/218: [angstrom: dune build] [dune-configurator: dune build] [fileutils: dune build] [octavius: dune build] [ppxlib: dune build]
+ /home/opam/.opam/opam-init/hooks/sandbox.sh "build" "dune" "build" "-p" "octavius" "-j" "31" "@install" (CWD=/home/opam/.opam/5.0/.opam-switch/build/octavius.1.2.2)
-> compiled  octavius.1.2.2
Processing 123/218: [angstrom: dune build] [dune-configurator: dune build] [fileutils: dune build] [ppxlib: dune build]
-> installed octavius.1.2.2
Processing 124/218: [angstrom: dune build] [dune-configurator: dune build] [fileutils: dune build] [ppxlib: dune build]
+ /home/opam/.opam/opam-init/hooks/sandbox.sh "build" "dune" "build" "-p" "angstrom" "-j" "31" (CWD=/home/opam/.opam/5.0/.opam-switch/build/angstrom.0.15.0)
-> compiled  angstrom.0.15.0
Processing 124/218: [dune-configurator: dune build] [fileutils: dune build] [ppxlib: dune build]
-> installed angstrom.0.15.0
Processing 125/218: [dune-configurator: dune build] [fileutils: dune build] [ppxlib: dune build]
Processing 126/218: [dune-configurator: dune build] [fileutils: dune build] [ppxlib: dune build] [uri: dune build]
[ERROR] The compilation of fileutils.0.6.3 failed at "dune build -p fileutils -j 31".
+ /home/opam/.opam/opam-init/hooks/sandbox.sh "build" "dune" "build" "-p" "fileutils" "-j" "31" (CWD=/home/opam/.opam/5.0/.opam-switch/build/fileutils.0.6.3)
- (cd _build/default && /home/opam/.opam/5.0/bin/ocamlc.opt -w -40 -g -bin-annot -I src/lib/fileutils/.fileutils.objs/byte -I src/lib/fileutils/.fileutils.objs/public_cmi -I /home/opam/.opam/5.0/lib/stdlib-shims -no-alias-deps -o src/lib/fileutils/.fileutils.objs/byte/fileUtilCMP.cmo -c -impl src/lib/fileutils/FileUtilCMP.ml)
- File "src/lib/fileutils/FileUtilCMP.ml", line 42, characters 8-20:
- 42 |         Stream.empty st;
-              ^^^^^^^^^^^^
- Error: Unbound module Stream
Processing 126/218: [dune-configurator: dune build] [ppxlib: dune build] [uri: dune build]
Processing 127/218: [dune-configurator: dune build] [ppxlib: dune build] [uri: dune build]
+ /home/opam/.opam/opam-init/hooks/sandbox.sh "build" "dune" "build" "-p" "dune-configurator" "-j" "31" "@install" (CWD=/home/opam/.opam/5.0/.opam-switch/build/dune-configurator.3.1.1)
-> compiled  dune-configurator.3.1.1
Processing 127/218: [ppxlib: dune build] [uri: dune build]
-> installed dune-configurator.3.1.1
Processing 128/218: [ppxlib: dune build] [uri: dune build]
Processing 129/218: [ppxlib: dune build] [uri: dune build]
Processing 130/218: [ppxlib: dune build] [uri: dune build]
Processing 131/218: [ppxlib: dune build] [uri: dune build]
Processing 132/218: [ppxlib: dune build] [uri: dune build]
Processing 133/218: [ppxlib: dune build] [uri: dune build]
Processing 134/218: [ppxlib: dune build] [uri: dune build]
Processing 135/218: [ppxlib: dune build] [uri: dune build]
Processing 136/218: [ppxlib: dune build] [uri: dune build]
Processing 137/218: [ppxlib: dune build] [uri: dune build]
Processing 138/218: [ppxlib: dune build] [uri: dune build]
Processing 139/218: [ppxlib: dune build] [uri: dune build]
Processing 140/218: [ppxlib: dune build] [uri: dune build]
Processing 141/218: [ppxlib: dune build] [uri: dune build]
Processing 142/218: [ppxlib: dune build] [uri: dune build]
+ /home/opam/.opam/opam-init/hooks/sandbox.sh "build" "dune" "build" "-p" "uri" "-j" "31" (CWD=/home/opam/.opam/5.0/.opam-switch/build/uri.4.2.0)
-> compiled  uri.4.2.0
Processing 142/218: [ppxlib: dune build]
-> installed uri.4.2.0
Processing 143/218: [ppxlib: dune build]
+ /home/opam/.opam/opam-init/hooks/sandbox.sh "build" "dune" "build" "-p" "ppxlib" "-j" "31" "@install" (CWD=/home/opam/.opam/5.0/.opam-switch/build/ppxlib.0.25.0~5.00preview)
-> compiled  ppxlib.0.25.0~5.00preview
-> installed ppxlib.0.25.0~5.00preview
Processing 155/218: [ppx_pipebang: dune build]
Processing 156/218: [ppx_pipebang: dune build]
Processing 157/218: [ppx_pipebang: dune build]
Processing 158/218: [ppx_pipebang: dune build]
Processing 159/218: [ppx_pipebang: dune build]
Processing 160/218: [ppx_pipebang: dune build]
Processing 161/218: [ppx_pipebang: dune build]
Processing 162/218: [ppx_pipebang: dune build]
Processing 163/218: [ppx_pipebang: dune build]
Processing 164/218: [ppx_pipebang: dune build]
Processing 165/218: [ppx_pipebang: dune build]
Processing 166/218: [ppx_pipebang: dune build]
Processing 167/218: [ppx_pipebang: dune build]
Processing 168/218: [ppx_pipebang: dune build]
Processing 169/218: [ppx_pipebang: dune build]
Processing 170/218: [ppx_pipebang: dune build]
Processing 171/218: [ppx_pipebang: dune build]
Processing 172/218: [ppx_pipebang: dune build]
Processing 173/218: [ppx_pipebang: dune build]
Processing 174/218: [ppx_pipebang: dune build]
Processing 175/218: [ppx_pipebang: dune build]
Processing 176/218: [ppx_pipebang: dune build]
Processing 177/218: [ppx_pipebang: dune build]
Processing 178/218: [ppx_pipebang: dune build]
Processing 179/218: [ppx_pipebang: dune build]
Processing 180/218: [ppx_pipebang: dune build]
Processing 181/218: [ppx_pipebang: dune build]
Processing 182/218: [ppx_pipebang: dune build]
Processing 183/218: [ppx_pipebang: dune build]
Processing 184/218: [ppx_pipebang: dune build]
Processing 185/218: [ppx_pipebang: dune build]
Processing 186/218: [ppx_pipebang: dune build]
Processing 187/218: [ppx_pipebang: dune build]
Processing 188/218: [ppx_pipebang: dune build]
Processing 189/218: [ppx_pipebang: dune build]
Processing 190/218: [ppx_pipebang: dune build]
Processing 191/218: [ppx_pipebang: dune build]
Processing 192/218: [ppx_pipebang: dune build]
Processing 193/218: [ppx_pipebang: dune build]
Processing 194/218: [ppx_pipebang: dune build]
Processing 195/218: [ppx_pipebang: dune build]
Processing 196/218: [ppx_pipebang: dune build]
Processing 197/218: [ppx_pipebang: dune build]
Processing 198/218: [ppx_pipebang: dune build]
Processing 199/218: [ppx_pipebang: dune build]
Processing 200/218: [ppx_pipebang: dune build]
Processing 201/218: [ppx_pipebang: dune build]
Processing 202/218: [ppx_pipebang: dune build]
Processing 203/218: [ppx_pipebang: dune build]
Processing 204/218: [ppx_pipebang: dune build]
Processing 205/218: [ppx_pipebang: dune build]
Processing 206/218: [ppx_pipebang: dune build]
Processing 207/218: [ppx_pipebang: dune build]
Processing 208/218: [ppx_pipebang: dune build]
Processing 209/218: [ppx_pipebang: dune build]
+ /home/opam/.opam/opam-init/hooks/sandbox.sh "build" "dune" "build" "-p" "ppx_pipebang" "-j" "31" (CWD=/home/opam/.opam/5.0/.opam-switch/build/ppx_pipebang.v0.14.0)
-> compiled  ppx_pipebang.v0.14.0
-> installed ppx_pipebang.v0.14.0

#=== ERROR while compiling sexplib0.v0.14.0 ===================================#
# context              2.2.0~alpha~dev | linux/x86_64 | ocaml-variants.5.0.0+trunk | file:///home/opam/opam-repository
# path                 ~/.opam/5.0/.opam-switch/build/sexplib0.v0.14.0
# command              ~/.opam/opam-init/hooks/sandbox.sh build dune build -p sexplib0 -j 31
# exit-code            1
# env-file             ~/.opam/log/sexplib0-11-2699bd.env
# output-file          ~/.opam/log/sexplib0-11-2699bd.out
### output ###
# (cd _build/default && /home/opam/.opam/5.0/bin/ocamlc.opt -w -40 -g -bin-annot -I src/.sexplib0.objs/byte -intf-suffix .ml -no-alias-deps -open Sexplib0__ -o src/.sexplib0.objs/byte/sexplib0__Sexp_conv.cmo -c -impl src/sexp_conv.ml)
# File "src/sexp_conv.ml", line 105, characters 15-31:
# 105 |       let id = Obj.extension_id
#                      ^^^^^^^^^^^^^^^^
# Error: Unbound value Obj.extension_id
# (cd _build/default && /home/opam/.opam/5.0/bin/ocamlopt.opt -w -40 -g -I src/.sexplib0.objs/byte -I src/.sexplib0.objs/native -intf-suffix .ml -no-alias-deps -open Sexplib0__ -o src/.sexplib0.objs/native/sexplib0__Sexp_conv.cmx -c -impl src/sexp_conv.ml)
# File "src/sexp_conv.ml", line 105, characters 15-31:
# 105 |       let id = Obj.extension_id
#                      ^^^^^^^^^^^^^^^^
# Error: Unbound value Obj.extension_id


#=== ERROR while compiling ocamlmod.0.0.9 =====================================#
# context              2.2.0~alpha~dev | linux/x86_64 | ocaml-variants.5.0.0+trunk | file:///home/opam/opam-repository
# path                 ~/.opam/5.0/.opam-switch/build/ocamlmod.0.0.9
# command              ~/.opam/opam-init/hooks/sandbox.sh build ocaml setup.ml -configure --prefix /home/opam/.opam/5.0
# exit-code            2
# env-file             ~/.opam/log/ocamlmod-11-0f982d.env
# output-file          ~/.opam/log/ocamlmod-11-0f982d.out
### output ###
# File "./setup.ml", line 596, characters 4-15:
# 596 |     Stream.from next
#           ^^^^^^^^^^^
# Error: Unbound module Stream


#=== ERROR while compiling ocamlify.0.0.1 =====================================#
# context              2.2.0~alpha~dev | linux/x86_64 | ocaml-variants.5.0.0+trunk | file:///home/opam/opam-repository
# path                 ~/.opam/5.0/.opam-switch/build/ocamlify.0.0.1
# command              ~/.opam/opam-init/hooks/sandbox.sh build ocaml setup.ml -configure --prefix /home/opam/.opam/5.0
# exit-code            2
# env-file             ~/.opam/log/ocamlify-11-909508.env
# output-file          ~/.opam/log/ocamlify-11-909508.out
### output ###
# File "/home/gildor/programmation/oasis/src/oasis/PropList.ml", line 93, characters 13-29:
# Error: Unbound value String.lowercase


#=== ERROR while compiling fileutils.0.6.3 ====================================#
# context              2.2.0~alpha~dev | linux/x86_64 | ocaml-variants.5.0.0+trunk | file:///home/opam/opam-repository
# path                 ~/.opam/5.0/.opam-switch/build/fileutils.0.6.3
# command              ~/.opam/opam-init/hooks/sandbox.sh build dune build -p fileutils -j 31
# exit-code            1
# env-file             ~/.opam/log/fileutils-11-7b4dfe.env
# output-file          ~/.opam/log/fileutils-11-7b4dfe.out
### output ###
# (cd _build/default && /home/opam/.opam/5.0/bin/ocamlc.opt -w -40 -g -bin-annot -I src/lib/fileutils/.fileutils.objs/byte -I src/lib/fileutils/.fileutils.objs/public_cmi -I /home/opam/.opam/5.0/lib/stdlib-shims -no-alias-deps -o src/lib/fileutils/.fileutils.objs/byte/fileUtilCMP.cmo -c -impl src/lib/fileutils/FileUtilCMP.ml)
# File "src/lib/fileutils/FileUtilCMP.ml", line 42, characters 8-20:
# 42 |         Stream.empty st;
#              ^^^^^^^^^^^^
# Error: Unbound module Stream



<><> Error report <><><><><><><><><><><><><><><><><><><><><><><><><><><><><><><>
+- The following actions were aborted
| - install bap-bundle        2.4.0
| - install base              v0.14.3
| - install base_bigstring    v0.14.0
| - install base_quickcheck   v0.14.1
| - install bin_prot          v0.14.0
| - install core_kernel       v0.14.2
| - install fieldslib         v0.14.0
| - install jst-config        v0.14.1
| - install oasis             0.4.11
| - install parsexp           v0.14.2
| - install ppx_assert        v0.14.0
| - install ppx_bap           v0.14.0
| - install ppx_base          v0.14.0
| - install ppx_bench         v0.14.1
| - install ppx_bin_prot      v0.14.0
| - install ppx_cold          v0.14.0
| - install ppx_compare       v0.14.0
| - install ppx_custom_printf v0.14.1
| - install ppx_enumerate     v0.14.0
| - install ppx_expect        v0.14.2
| - install ppx_fields_conv   v0.14.2
| - install ppx_fixed_literal v0.14.0
| - install ppx_hash          v0.14.0
| - install ppx_here          v0.14.0
| - install ppx_inline_test   v0.14.1
| - install ppx_jane          v0.14.0
| - install ppx_js_style      v0.14.1
| - install ppx_let           v0.14.0
| - install ppx_module_timer  v0.14.0
| - install ppx_optcomp       v0.14.3
| - install ppx_optional      v0.14.0
| - install ppx_sexp_conv     v0.14.3
| - install ppx_sexp_message  v0.14.1
| - install ppx_sexp_value    v0.14.0
| - install ppx_stable        v0.14.1
| - install ppx_string        v0.14.1
| - install ppx_typerep_conv  v0.14.2
| - install ppx_variants_conv v0.14.2
| - install sexplib           v0.14.0
| - install splittable_random v0.14.0
| - install stdio             v0.14.0
| - install time_now          v0.14.0
| - install typerep           v0.14.0
| - install variantslib       v0.14.0
+- 
+- The following actions failed
| - build fileutils 0.6.3
| - build ocamlify  0.0.1
| - build ocamlmod  0.0.9
| - build sexplib0  v0.14.0
+- 
+- The following changes have been performed (the rest was aborted)
| - install angstrom            0.15.0
| - install base-bytes          base
| - install bigstringaf         0.9.0
| - install camlzip             1.11
| - install conf-pkg-config     2
| - install conf-zlib           1
| - install csexp               1.5.1
| - install dune                3.1.1
| - install dune-configurator   3.1.1
| - install jane-street-headers v0.14.0
| - install num                 1.4
| - install ocaml-compiler-libs v0.12.4
| - install ocaml-syntax-shims  1.0.0
| - install ocamlbuild          0.14.1
| - install ocamlfind           1.9.3
| - install octavius            1.2.2
| - install ppx_derivers        1.2.1
| - install ppx_pipebang        v0.14.0
| - install ppxlib              0.25.0~5.00preview
| - install re                  1.10.4
| - install result              1.5
| - install seq                 base
| - install stdlib-shims        0.3.0
| - install stringext           1.6.0
| - install uri                 4.2.0
+- 
# Run eval $(opam env) to update the current shell environment

The former state can be restored with:
    /usr/bin/opam switch import "/home/opam/.opam/5.0/.opam-switch/backup/state-20220511234546.export"
'opam install -vy bap-bundle.2.4.0' failed.
"/bin/bash" "-c"
"
opam remove -y "bap-bundle.2.4.0"
opam install -vy "bap-bundle.2.4.0"
res=$?
if [ $res = 31 ]; then
    if opam show -f x-ci-accept-failures: "bap-bundle.2.4.0" | grep -q '"debian-unstable"'; then
        echo "This package failed and has been disabled for CI using the 'x-ci-accept-failures' field."
        exit 69
    fi
fi


exit $res
" failed with exit status 31
Failed: Build failed