OCamllabs icon Home|Differences with the last checks|Previous runs


Building on x86-bm-9.ocamllabs.io

(from ocaml/opam:debian-unstable@sha256:ab7f0b8ac566a6726439e621a0807bcd9fc12180ea873955fd963cfd263c279c)
Unable to find image 'ocaml/opam:debian-unstable@sha256:ab7f0b8ac566a6726439e621a0807bcd9fc12180ea873955fd963cfd263c279c' locally
docker.io/ocaml/opam@sha256:ab7f0b8ac566a6726439e621a0807bcd9fc12180ea873955fd963cfd263c279c: Pulling from ocaml/opam
7c26de214b34: Already exists
686e2e0ed2af: Pulling fs layer
6f56e1824cd6: Pulling fs layer
6f56e1824cd6: Verifying Checksum
6f56e1824cd6: Download complete
686e2e0ed2af: Verifying Checksum
686e2e0ed2af: Download complete
686e2e0ed2af: Pull complete
6f56e1824cd6: Pull complete
Digest: sha256:ab7f0b8ac566a6726439e621a0807bcd9fc12180ea873955fd963cfd263c279c
Status: Downloaded newer image for ocaml/opam@sha256:ab7f0b8ac566a6726439e621a0807bcd9fc12180ea873955fd963cfd263c279c
2022-05-11 23:17.19 ---> using "31be97220bde553e6e760a64d33a5a13bf22f7bc7b939c6db9f7e6618bb986a9" from cache

/: (user (uid 1000) (gid 1000))

/: (env OPAMPRECISETRACKING 1)

/: (env OPAMUTF8 never)

/: (env OPAMEXTERNALSOLVER builtin-0install)

/: (env OPAMCRITERIA +removed)

/: (run (shell "sudo ln -f /usr/bin/opam-dev /usr/bin/opam"))
2022-05-11 23:17.19 ---> using "179f53753baadbe2063c82b23383d48191f66b8e16101240f7dfbf1ced2cc270" from cache

/: (run (network host)
        (shell "rm -rf ~/opam-repository && git clone -q 'https://github.com/ocaml/opam-repository' ~/opam-repository && git -C ~/opam-repository checkout -q 7ebba7f05b4ae6507db523882e2a6df3fcb82fb3"))
2022-05-11 23:17.19 ---> using "e03d0e1409ca900b4238dc5a99fda90533ac437f633561f6a23a7ce554600652" from cache

/: (run (shell "rm -rf ~/.opam && opam init -ya --bare --config ~/.opamrc-sandbox ~/opam-repository"))
Configuring from /home/opam/.opamrc-sandbox, then /home/opam/.opamrc, and finally from built-in defaults.
Checking for available remotes: rsync and local, git.
  - you won't be able to use mercurial repositories unless you install the hg command on your system.
  - you won't be able to use darcs repositories unless you install the darcs command on your system.


<><> Fetching repository information ><><><><><><><><><><><><><><><><><><><><><>
[default] Initialised

User configuration:
  ~/.profile is already up-to-date.
[NOTE] Make sure that ~/.profile is well sourced in your ~/.bashrc.

2022-05-11 23:17.19 ---> using "f2b762bd14fc0fe661511410f052bca3d3a6d98c0572418fb3219e7975323dc4" from cache

/: (run (cache (opam-archives (target /home/opam/.opam/download-cache)))
        (network host)
        (shell "opam switch create --repositories=default '5.0' '5.0.0+trunk'"))

<><> Installing new switch packages <><><><><><><><><><><><><><><><><><><><><><>
Switch invariant: ["ocaml-variants" {= "5.0.0+trunk"}]

<><> Processing actions <><><><><><><><><><><><><><><><><><><><><><><><><><><><>
-> installed base-bigarray.base
-> installed base-threads.base
-> installed base-unix.base
-> retrieved ocaml-variants.5.0.0+trunk  (https://github.com/ocaml/ocaml/archive/trunk.tar.gz)
-> installed ocaml-variants.5.0.0+trunk
-> installed ocaml-config.3
-> installed ocaml.5.0.0
-> installed base-domains.base
-> installed base-nnp.base
Done.
# Run eval $(opam env --switch=5.0) to update the current shell environment
2022-05-11 23:17.19 ---> using "c9764e27e864e7eba8f1014e361a5d7af12ea512edc911d0112d8096e9653974" from cache

/: (run (network host)
        (shell "opam update --depexts"))
+ /usr/bin/sudo "apt-get" "update"
- Get:1 http://deb.debian.org/debian unstable InRelease [165 kB]
- Get:2 http://deb.debian.org/debian unstable/main amd64 Packages.diff/Index [63.6 kB]
- Ign:2 http://deb.debian.org/debian unstable/main amd64 Packages.diff/Index
- Get:3 http://deb.debian.org/debian unstable/main amd64 Packages [9165 kB]
- Fetched 9394 kB in 3s (3146 kB/s)
- Reading package lists...
- 
2022-05-11 23:17.19 ---> using "c6fb778ad179fe07c3df591e8980b4d64a3e3a6ca08ede5395a9d6665c5fcb40" from cache

/: (run (cache (opam-archives (target /home/opam/.opam/download-cache)))
        (network host)
        (shell  "\
               \nopam remove -y \"aws-lwt.1.2\"\
               \nopam install -vy \"aws-lwt.1.2\"\
               \nres=$?\
               \nif [ $res = 31 ]; then\
               \n    if opam show -f x-ci-accept-failures: \"aws-lwt.1.2\" | grep -q '\"debian-unstable\"'; then\
               \n        echo \"This package failed and has been disabled for CI using the 'x-ci-accept-failures' field.\"\
               \n        exit 69\
               \n    fi\
               \nfi\
               \n\
               \n\
               \nexit $res\
               \n"))
[NOTE] aws-lwt.1.2 is not installed.

Nothing to do.
The following actions will be performed:
=== install 79 packages
  - install angstrom            0.15.0             [required by uri]
  - install asn1-combinators    0.2.6              [required by x509]
  - install astring             0.8.5              [required by conduit, ca-certs]
  - install aws                 1.2                [required by aws-lwt]
  - install aws-lwt             1.2
  - install base                v0.15.0            [required by ppx_sexp_conv]
  - install base-bytes          base               [required by stringext]
  - install base64              3.5.0              [required by aws, cohttp]
  - install bigarray-compat     1.1.0              [required by mmap]
  - install bigstringaf         0.9.0              [required by angstrom]
  - install bos                 0.2.1              [required by ca-certs]
  - install ca-certs            0.2.2              [required by conduit-lwt-unix]
  - install calendar            2.04               [required by aws]
  - install cmdliner            1.1.1              [required by cohttp-lwt-unix]
  - install cohttp              5.0.0              [required by aws-lwt]
  - install cohttp-lwt          5.0.0              [required by aws-lwt]
  - install cohttp-lwt-unix     5.0.0              [required by aws-lwt]
  - install conduit             5.1.0              [required by conduit-lwt]
  - install conduit-lwt         5.1.0              [required by cohttp-lwt-unix]
  - install conduit-lwt-unix    5.1.0              [required by cohttp-lwt-unix]
  - install conf-gmp            4                  [required by zarith, conf-gmp-powm-sec]
  - install conf-gmp-powm-sec   3                  [required by mirage-crypto-pk]
  - install conf-pkg-config     2                  [required by digestif]
  - install cppo                1.6.8              [required by lwt]
  - install csexp               1.5.1              [required by dune-configurator]
  - install cstruct             6.1.0              [required by eqaf]
  - install digestif            1.1.2              [required by aws]
  - install domain-name         0.4.0              [required by ipaddr, x509]
  - install dune                3.1.1              [required by aws-lwt]
  - install dune-configurator   3.1.1              [required by base, lwt]
  - install duration            0.2.0              [required by mirage-crypto-rng]
  - install eqaf                0.8                [required by digestif]
  - install ezxmlm              1.1.0              [required by aws]
  - install fmt                 0.9.0              [required by cohttp-lwt-unix]
  - install fpath               0.7.3              [required by ca-certs]
  - install gmap                0.3.0              [required by x509]
  - install ipaddr              5.3.0              [required by conduit-lwt-unix]
  - install ipaddr-sexp         5.3.0              [required by conduit-lwt-unix]
  - install jsonm               1.0.1              [required by cohttp]
  - install logs                0.7.0              [required by cohttp-lwt, cohttp-lwt-unix]
  - install lwt                 5.5.0              [required by aws-lwt]
  - install macaddr             5.3.0              [required by ipaddr]
  - install magic-mime          1.2.0              [required by cohttp-lwt-unix]
  - install mirage-crypto       0.10.6             [required by ca-certs]
  - install mirage-crypto-ec    0.10.6             [required by x509]
  - install mirage-crypto-pk    0.10.6             [required by x509]
  - install mirage-crypto-rng   0.10.6             [required by x509]
  - install mirage-no-solo5     1                  [required by mirage-crypto-pk]
  - install mirage-no-xen       1                  [required by mirage-crypto-pk]
  - install mmap                1.2.0              [required by lwt]
  - install mtime               1.4.0              [required by mirage-crypto-rng]
  - install num                 1.4                [required by sexplib]
  - install ocaml-compiler-libs v0.12.4            [required by ppxlib]
  - install ocaml-syntax-shims  1.0.0              [required by angstrom, lwt]
  - install ocamlbuild          0.14.1             [required by jsonm, logs]
  - install ocamlfind           1.9.3              [required by jsonm, calendar, logs]
  - install ocplib-endian       1.2                [required by lwt]
  - install parsexp             v0.15.0            [required by sexplib]
  - install pbkdf               1.2.0              [required by x509]
  - install ppx_derivers        1.2.1              [required by ppxlib]
  - install ppx_sexp_conv       v0.15.0            [required by cohttp-lwt, cohttp, cohttp-lwt-unix]
  - install ppxlib              0.25.0~5.00preview [required by ppx_sexp_conv]
  - install ptime               1.0.0              [required by ca-certs]
  - install re                  1.10.4             [required by cohttp]
  - install result              1.5                [required by angstrom, lwt]
  - install rresult             0.7.0              [required by bos]
  - install seq                 base               [required by re]
  - install sexplib             v0.15.0            [required by conduit-lwt]
  - install sexplib0            v0.15.0            [required by cohttp, cohttp-lwt]
  - install stdlib-shims        0.3.0              [required by ppxlib]
  - install stringext           1.6.0              [required by cohttp]
  - install topkg               1.0.5              [required by jsonm, logs]
  - install uchar               0.0.2              [required by jsonm]
  - install uri                 4.2.0              [required by cohttp, aws, cohttp-lwt]
  - install uri-sexp            4.2.0              [required by cohttp]
  - install uutf                1.0.3              [required by jsonm]
  - install x509                0.16.0             [required by ca-certs]
  - install xmlm                1.4.0              [required by ezxmlm]
  - install zarith              1.12               [required by asn1-combinators, mirage-crypto-pk]

The following system packages will first need to be installed:
    libgmp-dev pkg-config

<><> Handling external dependencies <><><><><><><><><><><><><><><><><><><><><><>

opam believes some required external dependencies are missing. opam can:
> 1. Run apt-get to install them (may need root/sudo access)
  2. Display the recommended apt-get command and wait while you run it manually (e.g. in another terminal)
  3. Attempt installation anyway, and permanently register that this external dependency is present, but not detectable
  4. Abort the installation

[1/2/3/4] 1
+ /usr/bin/sudo "apt-get" "install" "-qq" "-yy" "libgmp-dev" "pkg-config"
- debconf: delaying package configuration, since apt-utils is not installed
- Selecting previously unselected package libglib2.0-0:amd64.
- (Reading database ... 
(Reading database ... 5%
(Reading database ... 10%
(Reading database ... 15%
(Reading database ... 20%
(Reading database ... 25%
(Reading database ... 30%
(Reading database ... 35%
(Reading database ... 40%
(Reading database ... 45%
(Reading database ... 50%
(Reading database ... 55%
(Reading database ... 60%
(Reading database ... 65%
(Reading database ... 70%
(Reading database ... 75%
(Reading database ... 80%
(Reading database ... 85%
(Reading database ... 90%
(Reading database ... 95%
(Reading database ... 100%
(Reading database ... 18478 files and directories currently installed.)
- Preparing to unpack .../0-libglib2.0-0_2.72.1-1_amd64.deb ...
- Unpacking libglib2.0-0:amd64 (2.72.1-1) ...
- Selecting previously unselected package libglib2.0-data.
- Preparing to unpack .../1-libglib2.0-data_2.72.1-1_all.deb ...
- Unpacking libglib2.0-data (2.72.1-1) ...
- Selecting previously unselected package libgmpxx4ldbl:amd64.
- Preparing to unpack .../2-libgmpxx4ldbl_2%3a6.2.1+dfsg-3_amd64.deb ...
- Unpacking libgmpxx4ldbl:amd64 (2:6.2.1+dfsg-3) ...
- Selecting previously unselected package libgmp-dev:amd64.
- Preparing to unpack .../3-libgmp-dev_2%3a6.2.1+dfsg-3_amd64.deb ...
- Unpacking libgmp-dev:amd64 (2:6.2.1+dfsg-3) ...
- Selecting previously unselected package libicu71:amd64.
- Preparing to unpack .../4-libicu71_71.1-3_amd64.deb ...
- Unpacking libicu71:amd64 (71.1-3) ...
- Selecting previously unselected package libxml2:amd64.
- Preparing to unpack .../5-libxml2_2.9.14+dfsg-1_amd64.deb ...
- Unpacking libxml2:amd64 (2.9.14+dfsg-1) ...
- Selecting previously unselected package pkg-config.
- Preparing to unpack .../6-pkg-config_0.29.2-1_amd64.deb ...
- Unpacking pkg-config (0.29.2-1) ...
- Selecting previously unselected package shared-mime-info.
- Preparing to unpack .../7-shared-mime-info_2.2-1_amd64.deb ...
- Unpacking shared-mime-info (2.2-1) ...
- Selecting previously unselected package xdg-user-dirs.
- Preparing to unpack .../8-xdg-user-dirs_0.17-2_amd64.deb ...
- Unpacking xdg-user-dirs (0.17-2) ...
- Setting up libicu71:amd64 (71.1-3) ...
- Setting up xdg-user-dirs (0.17-2) ...
- Setting up libglib2.0-0:amd64 (2.72.1-1) ...
- No schema files found: doing nothing.
- Setting up libglib2.0-data (2.72.1-1) ...
- Setting up libgmpxx4ldbl:amd64 (2:6.2.1+dfsg-3) ...
- Setting up pkg-config (0.29.2-1) ...
- Setting up libxml2:amd64 (2.9.14+dfsg-1) ...
- Setting up libgmp-dev:amd64 (2:6.2.1+dfsg-3) ...
- Setting up shared-mime-info (2.2-1) ...
- Processing triggers for libc-bin (2.33-7) ...

<><> Processing actions <><><><><><><><><><><><><><><><><><><><><><><><><><><><>
Processing  1/225:
Processing  2/225:
Processing  3/225:
-> retrieved asn1-combinators.0.2.6  (cached)
Processing  4/225:
-> retrieved angstrom.0.15.0  (cached)
Processing  5/225:
-> retrieved astring.0.8.5  (cached)
Processing  6/225:
Processing  7/225:
-> retrieved base.v0.15.0  (cached)
Processing  8/225:
-> retrieved base64.3.5.0  (cached)
Processing  9/225:
-> retrieved bigarray-compat.1.1.0  (cached)
Processing 10/225:
-> retrieved bigstringaf.0.9.0  (cached)
Processing 11/225:
-> retrieved bos.0.2.1  (cached)
Processing 12/225:
-> retrieved ca-certs.0.2.2  (cached)
Processing 13/225:
-> retrieved calendar.2.04  (cached)
Processing 14/225:
-> retrieved cmdliner.1.1.1  (cached)
Processing 15/225:
Processing 16/225: [cmdliner: make all]
-> retrieved aws.1.2, aws-lwt.1.2  (cached)
Processing 17/225: [cmdliner: make all]
Processing 18/225: [cmdliner: make all]
Processing 19/225: [cmdliner: make all]
Processing 20/225: [cmdliner: make all]
Processing 21/225: [cmdliner: make all] [conf-gmp: sh]
Processing 22/225: [cmdliner: make all] [conf-gmp: sh] [conf-pkg-config: pkg-config]
-> retrieved cohttp.5.0.0, cohttp-lwt.5.0.0, cohttp-lwt-unix.5.0.0  (cached)
Processing 23/225: [cmdliner: make all] [conf-gmp: sh] [conf-pkg-config: pkg-config]
-> retrieved conduit.5.1.0, conduit-lwt.5.1.0, conduit-lwt-unix.5.1.0  (cached)
Processing 24/225: [cmdliner: make all] [conf-gmp: sh] [conf-pkg-config: pkg-config]
-> retrieved cppo.1.6.8  (cached)
Processing 25/225: [cmdliner: make all] [conf-gmp: sh] [conf-pkg-config: pkg-config]
-> retrieved csexp.1.5.1  (cached)
Processing 26/225: [cmdliner: make all] [conf-gmp: sh] [conf-pkg-config: pkg-config]
-> retrieved cstruct.6.1.0  (cached)
Processing 27/225: [cmdliner: make all] [conf-gmp: sh] [conf-pkg-config: pkg-config]
+ /home/opam/.opam/opam-init/hooks/sandbox.sh "build" "sh" "-exc" "cc -c $CFLAGS -I/usr/local/include test.c" (CWD=/home/opam/.opam/5.0/.opam-switch/build/conf-gmp.4)
- + cc -c -I/usr/local/include test.c
-> compiled  conf-gmp.4
Processing 27/225: [cmdliner: make all] [conf-pkg-config: pkg-config]
-> installed conf-gmp.4
Processing 28/225: [cmdliner: make all] [conf-pkg-config: pkg-config]
Processing 29/225: [cmdliner: make all] [conf-gmp-powm-sec: sh] [conf-pkg-config: pkg-config]
+ /home/opam/.opam/opam-init/hooks/sandbox.sh "build" "pkg-config" "--help" (CWD=/home/opam/.opam/5.0/.opam-switch/build/conf-pkg-config.2)
- Usage:
-   pkg-config [OPTION?]
- 
- Help Options:
-   -h, --help                              Show help options
- 
- Application Options:
-   --version                               output version of pkg-config
-   --modversion                            output version for package
-   --atleast-pkgconfig-version=VERSION     require given version of pkg-config
-   --libs                                  output all linker flags
-   --static                                output linker flags for static linking
-   --short-errors                          print short errors
-   --libs-only-l                           output -l flags
-   --libs-only-other                       output other libs (e.g. -pthread)
-   --libs-only-L                           output -L flags
-   --cflags                                output all pre-processor and compiler flags
-   --cflags-only-I                         output -I flags
-   --cflags-only-other                     output cflags not covered by the cflags-only-I option
-   --variable=NAME                         get the value of variable named NAME
-   --define-variable=NAME=VALUE            set variable NAME to VALUE
-   --exists                                return 0 if the module(s) exist
-   --print-variables                       output list of variables defined by the module
-   --uninstalled                           return 0 if the uninstalled version of one or more module(s) or their dependencies will be used
-   --atleast-version=VERSION               return 0 if the module is at least version VERSION
-   --exact-version=VERSION                 return 0 if the module is at exactly version VERSION
-   --max-version=VERSION                   return 0 if the module is at no newer than version VERSION
-   --list-all                              list all known packages
-   --debug                                 show verbose debug information
-   --print-errors                          show verbose information about missing or conflicting packages (default unless --exists or --atleast/exact/max-version given on the command line)
-   --silence-errors                        be silent about errors (default when --exists or --atleast/exact/max-version given on the command line)
-   --errors-to-stdout                      print errors from --print-errors to stdout not stderr
-   --print-provides                        print which packages the package provides
-   --print-requires                        print which packages the package requires
-   --print-requires-private                print which packages the package requires for static linking
-   --validate                              validate a package's .pc file
-   --define-prefix                         try to override the value of prefix for each .pc file found with a guesstimated value based on the location of the .pc file
-   --dont-define-prefix                    don't try to override the value of prefix for each .pc file found with a guesstimated value based on the location of the .pc file
-   --prefix-variable=PREFIX                set the name of the variable that pkg-config automatically sets
- 
-> compiled  conf-pkg-config.2
Processing 29/225: [cmdliner: make all] [conf-gmp-powm-sec: sh]
Processing 30/225: [cmdliner: make all] [conf-gmp-powm-sec: sh] [conf-pkg-config: mkdir]
-> retrieved digestif.1.1.2  (cached)
Processing 31/225: [cmdliner: make all] [conf-gmp-powm-sec: sh] [conf-pkg-config: mkdir]
-> retrieved domain-name.0.4.0  (cached)
Processing 32/225: [cmdliner: make all] [conf-gmp-powm-sec: sh] [conf-pkg-config: mkdir]
-> retrieved dune.3.1.1, dune-configurator.3.1.1  (cached)
Processing 33/225: [cmdliner: make all] [conf-gmp-powm-sec: sh] [conf-pkg-config: mkdir]
Processing 34/225: [cmdliner: make all] [conf-gmp-powm-sec: sh] [dune: ocaml bootstrap.ml] [conf-pkg-config: mkdir]
+ /home/opam/.opam/opam-init/hooks/sandbox.sh "build" "make" "all" "PREFIX=/home/opam/.opam/5.0" (CWD=/home/opam/.opam/5.0/.opam-switch/build/cmdliner.1.1.1)
- ocaml build.ml cma
- ocaml build.ml cmxa
- ocaml build.ml cmxs
-> compiled  cmdliner.1.1.1
Processing 34/225: [conf-gmp-powm-sec: sh] [dune: ocaml bootstrap.ml] [conf-pkg-config: mkdir]
+ /home/opam/.opam/opam-init/hooks/sandbox.sh "build" "sh" "-exc" "cc -c $CFLAGS -I/usr/local/include test.c" (CWD=/home/opam/.opam/5.0/.opam-switch/build/conf-gmp-powm-sec.3)
- + cc -c -I/usr/local/include test.c
-> compiled  conf-gmp-powm-sec.3
Processing 34/225: [dune: ocaml bootstrap.ml] [conf-pkg-config: mkdir]
+ /home/opam/.opam/opam-init/hooks/sandbox.sh "install" "mkdir" "-p" "/home/opam/.opam/5.0/lib/pkgconfig" (CWD=/home/opam/.opam/5.0/.opam-switch/build/conf-pkg-config.2)
-> installed conf-pkg-config.2
Processing 34/225: [dune: ocaml bootstrap.ml]
Processing 35/225: [dune: ocaml bootstrap.ml] [cmdliner: make install]
-> retrieved duration.0.2.0  (cached)
Processing 36/225: [dune: ocaml bootstrap.ml] [cmdliner: make install]
-> retrieved eqaf.0.8  (cached)
Processing 37/225: [dune: ocaml bootstrap.ml] [cmdliner: make install]
-> retrieved ezxmlm.1.1.0  (cached)
Processing 38/225: [dune: ocaml bootstrap.ml] [cmdliner: make install]
-> retrieved fmt.0.9.0  (cached)
Processing 39/225: [dune: ocaml bootstrap.ml] [cmdliner: make install]
+ /home/opam/.opam/opam-init/hooks/sandbox.sh "install" "make" "install" "LIBDIR=/home/opam/.opam/5.0/lib/cmdliner" "DOCDIR=/home/opam/.opam/5.0/doc/cmdliner" (CWD=/home/opam/.opam/5.0/.opam-switch/build/cmdliner.1.1.1)
- install -d /home/opam/.opam/5.0/lib/cmdliner
- install pkg/META _build/cmdliner.mli _build/cmdliner.cmi _build/cmdliner.cmti /home/opam/.opam/5.0/lib/cmdliner
- install cmdliner.opam /home/opam/.opam/5.0/lib/cmdliner/opam
- install _build/cmdliner.cma /home/opam/.opam/5.0/lib/cmdliner
- install _build/cmdliner.cmxa _build/cmdliner.a _build/cmdliner.cmx _build/cmdliner_arg.cmx _build/cmdliner_base.cmx _build/cmdliner_cline.cmx _build/cmdliner_cmd.cmx _build/cmdliner_docgen.cmx _build/cmdliner_eval.cmx _build/cmdliner_exit.cmx _build/cmdliner_info.cmx _build/cmdliner_manpage.cmx _build/cmdliner_msg.cmx _build/cmdliner_term.cmx _build/cmdliner_term_deprecated.cmx _build/cmdliner_trie.cmx \
-   /home/opam/.opam/5.0/lib/cmdliner
- install _build/cmdliner.cmxs /home/opam/.opam/5.0/lib/cmdliner
Processing 39/225: [dune: ocaml bootstrap.ml] [cmdliner: make install-doc]
-> retrieved fpath.0.7.3  (cached)
Processing 40/225: [dune: ocaml bootstrap.ml] [cmdliner: make install-doc]
-> retrieved gmap.0.3.0  (cached)
Processing 41/225: [dune: ocaml bootstrap.ml] [cmdliner: make install-doc]
-> retrieved ipaddr.5.3.0, ipaddr-sexp.5.3.0, macaddr.5.3.0  (cached)
Processing 42/225: [dune: ocaml bootstrap.ml] [cmdliner: make install-doc]
+ /home/opam/.opam/opam-init/hooks/sandbox.sh "install" "make" "install-doc" "LIBDIR=/home/opam/.opam/5.0/lib/cmdliner" "DOCDIR=/home/opam/.opam/5.0/doc/cmdliner" (CWD=/home/opam/.opam/5.0/.opam-switch/build/cmdliner.1.1.1)
- install -d /home/opam/.opam/5.0/doc/cmdliner/odoc-pages
- install CHANGES.md LICENSE.md README.md /home/opam/.opam/5.0/doc/cmdliner
- install doc/index.mld doc/cli.mld doc/examples.mld doc/tutorial.mld \
-            doc/tool_man.mld /home/opam/.opam/5.0/doc/cmdliner/odoc-pages
-> installed cmdliner.1.1.1
Processing 42/225: [dune: ocaml bootstrap.ml]
-> installed conf-gmp-powm-sec.3
Processing 43/225: [dune: ocaml bootstrap.ml]
-> retrieved jsonm.1.0.1  (cached)
Processing 44/225: [dune: ocaml bootstrap.ml]
-> retrieved logs.0.7.0  (cached)
Processing 45/225: [dune: ocaml bootstrap.ml]
-> retrieved lwt.5.5.0  (cached)
Processing 46/225: [dune: ocaml bootstrap.ml]
Processing 47/225: [dune: ocaml bootstrap.ml]
Processing 48/225: [dune: ocaml bootstrap.ml]
Processing 49/225: [dune: ocaml bootstrap.ml]
Processing 50/225: [dune: ocaml bootstrap.ml]
-> installed mirage-no-solo5.1
Processing 51/225: [dune: ocaml bootstrap.ml]
-> installed mirage-no-xen.1
Processing 52/225: [dune: ocaml bootstrap.ml]
-> retrieved magic-mime.1.2.0  (cached)
Processing 53/225: [dune: ocaml bootstrap.ml]
-> retrieved mmap.1.2.0  (cached)
Processing 54/225: [dune: ocaml bootstrap.ml]
-> retrieved mtime.1.4.0  (cached)
Processing 55/225: [dune: ocaml bootstrap.ml]
-> retrieved num.1.4  (cached)
Processing 56/225: [dune: ocaml bootstrap.ml]
-> retrieved ocaml-compiler-libs.v0.12.4  (cached)
Processing 57/225: [dune: ocaml bootstrap.ml]
-> retrieved ocaml-syntax-shims.1.0.0  (cached)
Processing 58/225: [dune: ocaml bootstrap.ml]
-> retrieved ocamlbuild.0.14.1  (cached)
Processing 59/225: [dune: ocaml bootstrap.ml]
Processing 60/225: [dune: ocaml bootstrap.ml] [ocamlbuild: make configure.make]
-> retrieved ocamlfind.1.9.3  (cached)
Processing 61/225: [dune: ocaml bootstrap.ml] [ocamlbuild: make configure.make]
Processing 62/225: [dune: ocaml bootstrap.ml] [ocamlbuild: make configure.make] [ocamlfind: ./configure]
-> retrieved ocplib-endian.1.2  (cached)
Processing 63/225: [dune: ocaml bootstrap.ml] [ocamlbuild: make configure.make] [ocamlfind: ./configure]
-> retrieved parsexp.v0.15.0  (cached)
Processing 64/225: [dune: ocaml bootstrap.ml] [ocamlbuild: make configure.make] [ocamlfind: ./configure]
-> retrieved mirage-crypto.0.10.6, mirage-crypto-ec.0.10.6, mirage-crypto-pk.0.10.6, mirage-crypto-rng.0.10.6  (cached)
Processing 65/225: [dune: ocaml bootstrap.ml] [ocamlbuild: make configure.make] [ocamlfind: ./configure]
+ /home/opam/.opam/opam-init/hooks/sandbox.sh "build" "make" "-f" "configure.make" "all" "OCAMLBUILD_PREFIX=/home/opam/.opam/5.0" "OCAMLBUILD_BINDIR=/home/opam/.opam/5.0/bin" "OCAMLBUILD_LIBDIR=/home/opam/.opam/5.0/lib" "OCAMLBUILD_MANDIR=/home/opam/.opam/5.0/man" "OCAML_NATIVE=true" "OCAML_NATIVE_TOOLS=true" (CWD=/home/opam/.opam/5.0/.opam-switch/build/ocamlbuild.0.14.1)
- (echo "# This file was generated from configure.make"; \
- echo ;\
- echo "OCAML_PREFIX="; \
- echo "OCAML_BINDIR=/home/opam/.opam/5.0/bin"; \
- echo "OCAML_LIBDIR=/home/opam/.opam/5.0/lib/ocaml"; \
- echo "OCAML_MANDIR=/home/opam/.opam/5.0/man"; \
- echo ;\
- echo "EXT_OBJ=.o"; \
- echo "EXT_ASM=.s"; \
- echo "EXT_LIB=.a"; \
- echo "EXT_DLL=.so"; \
- echo "EXE="; \
- echo ;\
- echo "OCAML_NATIVE=true"; \
- echo "OCAML_NATIVE_TOOLS=true"; \
- echo "NATDYNLINK=true"; \
- echo "SUPPORT_SHARED_LIBRARIES=true"; \
- echo ;\
- echo "PREFIX=/home/opam/.opam/5.0"; \
- echo "BINDIR=/home/opam/.opam/5.0/bin"; \
- echo "LIBDIR=/home/opam/.opam/5.0/lib"; \
- echo "MANDIR=/home/opam/.opam/5.0/man"; \
- ) > Makefile.config
- (echo "(* This file was generated from ../configure.make *)"; \
- echo ;\
- echo 'let bindir = "/home/opam/.opam/5.0/bin"'; \
- echo 'let libdir = "/home/opam/.opam/5.0/lib"'; \
- echo 'let ocaml_libdir = "/home/opam/.opam/5.0/lib/ocaml"'; \
- echo 'let libdir_abs = "/home/opam/.opam/5.0/lib"'; \
- echo 'let ocaml_native = true'; \
- echo 'let ocaml_native_tools = true'; \
- echo 'let supports_shared_libraries = true';\
- echo 'let a = "a"'; \
- echo 'let o = "o"'; \
- echo 'let so = "so"'; \
- echo 'let ext_dll = ".so"'; \
- echo 'let exe = ""'; \
- echo 'let version = "0.14.1"'; \
- ) > src/ocamlbuild_config.ml
Processing 65/225: [dune: ocaml bootstrap.ml] [ocamlbuild: make check-if-preinstalled] [ocamlfind: ./configure]
-> retrieved pbkdf.1.2.0  (cached)
Processing 66/225: [ppxlib.0.25.0~5.00preview: git] [dune: ocaml bootstrap.ml] [ocamlbuild: make check-if-preinstalled] [ocamlfind: ./configure]
-> retrieved ppx_derivers.1.2.1  (cached)
Processing 67/225: [ppxlib.0.25.0~5.00preview: git] [dune: ocaml bootstrap.ml] [ocamlbuild: make check-if-preinstalled] [ocamlfind: ./configure]
-> retrieved ppx_sexp_conv.v0.15.0  (cached)
Processing 68/225: [ppxlib.0.25.0~5.00preview: git] [dune: ocaml bootstrap.ml] [ocamlbuild: make check-if-preinstalled] [ocamlfind: ./configure]
-> retrieved ptime.1.0.0  (cached)
Processing 69/225: [ppxlib.0.25.0~5.00preview: git] [dune: ocaml bootstrap.ml] [ocamlbuild: make check-if-preinstalled] [ocamlfind: ./configure]
-> retrieved result.1.5  (cached)
Processing 70/225: [ppxlib.0.25.0~5.00preview: git] [dune: ocaml bootstrap.ml] [ocamlbuild: make check-if-preinstalled] [ocamlfind: ./configure]
-> retrieved re.1.10.4  (cached)
Processing 71/225: [ppxlib.0.25.0~5.00preview: git] [dune: ocaml bootstrap.ml] [ocamlbuild: make check-if-preinstalled] [ocamlfind: ./configure]
Processing 72/225: [ppxlib.0.25.0~5.00preview: git] [dune: ocaml bootstrap.ml] [ocamlbuild: make check-if-preinstalled] [ocamlfind: ./configure]
Processing 73/225: [ppxlib.0.25.0~5.00preview: git] [dune: ocaml bootstrap.ml] [ocamlbuild: make check-if-preinstalled] [ocamlfind: ./configure]
-> installed seq.base
Processing 74/225: [ppxlib.0.25.0~5.00preview: git] [dune: ocaml bootstrap.ml] [ocamlbuild: make check-if-preinstalled] [ocamlfind: ./configure]
-> retrieved rresult.0.7.0  (cached)
Processing 75/225: [ppxlib.0.25.0~5.00preview: git] [dune: ocaml bootstrap.ml] [ocamlbuild: make check-if-preinstalled] [ocamlfind: ./configure]
-> retrieved sexplib.v0.15.0  (cached)
Processing 76/225: [ppxlib.0.25.0~5.00preview: git] [dune: ocaml bootstrap.ml] [ocamlbuild: make check-if-preinstalled] [ocamlfind: ./configure]
-> retrieved sexplib0.v0.15.0  (cached)
Processing 77/225: [ppxlib.0.25.0~5.00preview: git] [dune: ocaml bootstrap.ml] [ocamlbuild: make check-if-preinstalled] [ocamlfind: ./configure]
-> retrieved stdlib-shims.0.3.0  (cached)
Processing 78/225: [ppxlib.0.25.0~5.00preview: git] [dune: ocaml bootstrap.ml] [ocamlbuild: make check-if-preinstalled] [ocamlfind: ./configure]
-> retrieved stringext.1.6.0  (cached)
Processing 79/225: [ppxlib.0.25.0~5.00preview: git] [dune: ocaml bootstrap.ml] [ocamlbuild: make check-if-preinstalled] [ocamlfind: ./configure]
+ /home/opam/.opam/opam-init/hooks/sandbox.sh "build" "./configure" "-bindir" "/home/opam/.opam/5.0/bin" "-sitelib" "/home/opam/.opam/5.0/lib" "-mandir" "/home/opam/.opam/5.0/man" "-config" "/home/opam/.opam/5.0/lib/findlib.conf" "-no-custom" "-no-camlp4" (CWD=/home/opam/.opam/5.0/.opam-switch/build/ocamlfind.1.9.3)
- Welcome to findlib version 1.9.3
- Configuring core...
- Checking for #remove_directory...
- Testing threading model...
- systhread_supported: true
- Testing DLLs...
- Testing whether ppxopt can be supported...
- Checking for ocamlc -opaque...
- Querying installation: META list not found
- make install will double-check installed META files
- Configuring libraries...
- unix: found
- bigarray: not present (possible since 4.08)
- compiler-libs: found
- dbm: not present (normal since 4.00)
- graphics: not present (normal since 4.09)
- num: not present (normal since 4.06)
- ocamlbuild: not present (normal since 4.03)
- ocamldoc: found
- raw_spacetime: not present (normal since 4.12)
- threads: found
- str: found
- labltk: not present (normal since 4.02)
- native dynlink: found
- camlp4: disabled
- bytes: found, installing fake library
- Configuration for dynlink written to site-lib-src/dynlink/META
- Configuration for stdlib written to site-lib-src/stdlib/META
- Configuration for unix written to site-lib-src/unix/META
- Configuration for compiler-libs written to site-lib-src/compiler-libs/META
- Configuration for ocamldoc written to site-lib-src/ocamldoc/META
- Configuration for threads written to site-lib-src/threads/META
- Configuration for str written to site-lib-src/str/META
- Configuration for bytes written to site-lib-src/bytes/META
- Detecting compiler arguments: (extractor built) ok
- 
- About the OCAML core installation:
-     Standard library:      /home/opam/.opam/5.0/lib/ocaml
-     Binaries:              /home/opam/.opam/5.0/bin
-     Manual pages:          /home/opam/.opam/5.0/man
-     Multi-threading type:  posix
- The directory of site-specific packages will be
-     site-lib:              /home/opam/.opam/5.0/lib
- The configuration file is written to:
-     findlib config file:   /home/opam/.opam/5.0/lib/findlib.conf
- Software will be installed:
-     Libraries:             in <site-lib>/findlib
-     Binaries:              /home/opam/.opam/5.0/bin
-     Manual pages:          /home/opam/.opam/5.0/man
-     topfind script:        /home/opam/.opam/5.0/lib/ocaml
- Topfind ppxopt support:    yes
- Toolbox:                   no
- Link custom runtime:       no
- Need bytes compatibility:  no
- 
- Configuration has been written to Makefile.config
- 
- You can now do 'make all', and optionally 'make opt', to build ocamlfind.
Processing 79/225: [ppxlib.0.25.0~5.00preview: git] [dune: ocaml bootstrap.ml] [ocamlbuild: make check-if-preinstalled] [ocamlfind: make all]
-> retrieved uchar.0.0.2  (cached)
Processing 80/225: [ppxlib.0.25.0~5.00preview: git] [dune: ocaml bootstrap.ml] [ocamlbuild: make check-if-preinstalled] [ocamlfind: make all]
-> retrieved topkg.1.0.5  (cached)
Processing 81/225: [ppxlib.0.25.0~5.00preview: git] [dune: ocaml bootstrap.ml] [ocamlbuild: make check-if-preinstalled] [ocamlfind: make all]
-> retrieved uutf.1.0.3  (cached)
Processing 82/225: [ppxlib.0.25.0~5.00preview: git] [dune: ocaml bootstrap.ml] [ocamlbuild: make check-if-preinstalled] [ocamlfind: make all]
-> retrieved uri.4.2.0, uri-sexp.4.2.0  (cached)
Processing 83/225: [ppxlib.0.25.0~5.00preview: git] [dune: ocaml bootstrap.ml] [ocamlbuild: make check-if-preinstalled] [ocamlfind: make all]
-> retrieved x509.0.16.0  (cached)
Processing 84/225: [ppxlib.0.25.0~5.00preview: git] [dune: ocaml bootstrap.ml] [ocamlbuild: make check-if-preinstalled] [ocamlfind: make all]
-> retrieved xmlm.1.4.0  (cached)
-> retrieved zarith.1.12  (cached)
+ /home/opam/.opam/opam-init/hooks/sandbox.sh "build" "make" "all" (CWD=/home/opam/.opam/5.0/.opam-switch/build/ocamlfind.1.9.3)
- for p in findlib; do ( cd src/$p; make all ) || exit; done
- make[1]: Entering directory '/home/opam/.opam/5.0/.opam-switch/build/ocamlfind.1.9.3/src/findlib'
- ocamllex fl_meta.mll
- 22 states, 392 transitions, table size 1700 bytes
- USE_CYGPATH="0"; \
- export USE_CYGPATH; \
- cat findlib_config.mlp | \
-          ../../tools/patch '@CONFIGFILE@' '/home/opam/.opam/5.0/lib/findlib.conf' | \
-          ../../tools/patch '@STDLIB@' '/home/opam/.opam/5.0/lib/ocaml' | \
- 	sed -e 's;@AUTOLINK@;true;g' \
- 	    -e 's;@SYSTEM@;linux;g' \
- 	     >findlib_config.ml
- if [ "true" = "true" ]; then                 \
- 	cp topfind.ml.in topfind.ml;                             \
- else                                                             \
- 	sed -e '/PPXOPT_BEGIN/,/PPXOPT_END/ d' topfind.ml.in     \
- 		> topfind.ml ;                                   \
- fi
- ocamldep *.ml *.mli >depend
- ocamlc -I +compiler-libs -opaque    -g -c findlib_config.ml
- ocamlc -I +compiler-libs -opaque    -g -c fl_split.ml
- ocamlc -I +compiler-libs -opaque    -g -c fl_metatoken.ml
- ocamlc -I +compiler-libs -opaque    -g -c fl_meta.ml
- ocamlc -I +compiler-libs -opaque    -c fl_metascanner.mli
- ocamlc -I +compiler-libs -opaque    -g -c fl_metascanner.ml
- ocamlc -I +compiler-libs -opaque    -c fl_topo.mli
- ocamlc -I +compiler-libs -opaque    -g -c fl_topo.ml
- ocamlc -I +compiler-libs -opaque    -c fl_package_base.mli
- ocamlc -I +compiler-libs -opaque    -g -c fl_package_base.ml
- File "fl_package_base.ml", line 304, characters 22-40:
- 304 | 	 let pkg_ancestors = query_requirements predlist pkg in
-       	                     ^^^^^^^^^^^^^^^^^^
- Warning 6 [labels-omitted]: label preds was omitted in the application of this function.
- File "fl_package_base.ml", line 350, characters 18-36:
- 350 |   let ancestors = query_requirements predlist package_name in
-                         ^^^^^^^^^^^^^^^^^^
- Warning 6 [labels-omitted]: label preds was omitted in the application of this function.
- File "fl_package_base.ml", line 375, characters 23-41:
- 375 | 	  let pkg_ancestors = query_requirements predlist pkg in
-       	                      ^^^^^^^^^^^^^^^^^^
- Warning 6 [labels-omitted]: label preds was omitted in the application of this function.
- File "fl_package_base.ml", line 510, characters 16-35:
- 510 | 	     ( let c = package_definitions search_path pkg.package_name in
-       	               ^^^^^^^^^^^^^^^^^^^
- Warning 6 [labels-omitted]: label search_path was omitted in the application of this function.
- ocamlc -I +compiler-libs -opaque    -c findlib.mli
- ocamlc -I +compiler-libs -opaque    -g -c findlib.ml
- File "findlib.ml", line 390, characters 2-26:
- 390 |   Fl_package_base.requires predlist pkg
-         ^^^^^^^^^^^^^^^^^^^^^^^^
- Warning 6 [labels-omitted]: label preds was omitted in the application of this function.
- File "findlib.ml", line 396, characters 2-33:
- 396 |   Fl_package_base.requires_deeply predlist pkglist
-         ^^^^^^^^^^^^^^^^^^^^^^^^^^^^^^^
- Warning 6 [labels-omitted]: label preds was omitted in the application of this function.
- ocamlc -I +compiler-libs -opaque    -g -c fl_args.ml
- ocamlc -I +compiler-libs -opaque    -g -c fl_lint.ml
- ocamlc -I +compiler-libs -a -o findlib.cma findlib_config.cmo fl_split.cmo fl_metatoken.cmo fl_meta.cmo fl_metascanner.cmo fl_topo.cmo fl_package_base.cmo findlib.cmo fl_args.cmo fl_lint.cmo
- ocamlc -I +compiler-libs -opaque    -g -c ocaml_args.ml
- ocamlc -I +compiler-libs -opaque    -g -c frontend.ml
- File "frontend.ml", line 859, characters 10-39:
- 859 |           Fl_package_base.package_users predicates1 packages1
-                 ^^^^^^^^^^^^^^^^^^^^^^^^^^^^^
- Warning 6 [labels-omitted]: label preds was omitted in the application of this function.
- ocamlc -I +compiler-libs  -o ocamlfind -g findlib.cma unix.cma \
-             ocaml_args.cmo frontend.cmo
- ocamlc -I +compiler-libs -opaque    -c topfind.mli
- ocamlc -I +compiler-libs -opaque    -g -c topfind.ml
- File "topfind.ml", line 126, characters 40-63:
- 126 |                      match Hashtbl.find Toploop.directive_table "ppx" with
-                                               ^^^^^^^^^^^^^^^^^^^^^^^
- Alert deprecated: Toploop.directive_table
- File "topfind.ml", line 256, characters 4-27:
- 256 |     Toploop.directive_table
-           ^^^^^^^^^^^^^^^^^^^^^^^
- Alert deprecated: Toploop.directive_table
- File "topfind.ml", line 266, characters 4-27:
- 266 |     Toploop.directive_table
-           ^^^^^^^^^^^^^^^^^^^^^^^
- Alert deprecated: Toploop.directive_table
- File "topfind.ml", line 278, characters 4-27:
- 278 |     Toploop.directive_table
-           ^^^^^^^^^^^^^^^^^^^^^^^
- Alert deprecated: Toploop.directive_table
- File "topfind.ml", line 291, characters 4-27:
- 291 |     Toploop.directive_table
-           ^^^^^^^^^^^^^^^^^^^^^^^
- Alert deprecated: Toploop.directive_table
- File "topfind.ml", line 305, characters 4-27:
- 305 |     Toploop.directive_table
-           ^^^^^^^^^^^^^^^^^^^^^^^
- Alert deprecated: Toploop.directive_table
- File "topfind.ml", line 317, characters 4-27:
- 317 |     Toploop.directive_table
-           ^^^^^^^^^^^^^^^^^^^^^^^
- Alert deprecated: Toploop.directive_table
- ocamlc -I +compiler-libs -a -o findlib_top.cma topfind.cmo
- USE_CYGPATH="0"; \
- export USE_CYGPATH; \
- cat topfind_rd1.p | \
-          ../../tools/patch '@SITELIB@' '/home/opam/.opam/5.0/lib' \
-     	    >topfind
- ocamlc -I +compiler-libs -opaque    -c fl_dynload.mli
- ocamlc -I +compiler-libs -opaque    -g -c fl_dynload.ml
- ocamlc -I +compiler-libs -a -o findlib_dynload.cma fl_dynload.cmo
- make[1]: Leaving directory '/home/opam/.opam/5.0/.opam-switch/build/ocamlfind.1.9.3/src/findlib'
- make all-config
- make[1]: Entering directory '/home/opam/.opam/5.0/.opam-switch/build/ocamlfind.1.9.3'
- USE_CYGPATH="0"; \
- export USE_CYGPATH; \
- cat findlib.conf.in | \
-      tools/patch '@SITELIB@' '/home/opam/.opam/5.0/lib' >findlib.conf
- if ./tools/cmd_from_same_dir ocamlc; then \
- 	echo 'ocamlc="ocamlc.opt"' >>findlib.conf; \
- fi
- if ./tools/cmd_from_same_dir ocamlopt; then \
- 	echo 'ocamlopt="ocamlopt.opt"' >>findlib.conf; \
- fi
- if ./tools/cmd_from_same_dir ocamldep; then \
- 	echo 'ocamldep="ocamldep.opt"' >>findlib.conf; \
- fi
- if ./tools/cmd_from_same_dir ocamldoc; then \
- 	echo 'ocamldoc="ocamldoc.opt"' >>findlib.conf; \
- fi
- make[1]: Leaving directory '/home/opam/.opam/5.0/.opam-switch/build/ocamlfind.1.9.3'
Processing 84/225: [ppxlib.0.25.0~5.00preview: git] [dune: ocaml bootstrap.ml] [ocamlbuild: make check-if-preinstalled] [ocamlfind: make opt]
-> retrieved ppxlib.0.25.0~5.00preview  (git+https://github.com/kit-ty-kate/ppxlib.git#500)
Processing 84/225: [dune: ocaml bootstrap.ml] [ocamlbuild: make check-if-preinstalled] [ocamlfind: make opt]
+ /home/opam/.opam/opam-init/hooks/sandbox.sh "build" "make" "opt" (CWD=/home/opam/.opam/5.0/.opam-switch/build/ocamlfind.1.9.3)
- for p in findlib; do ( cd src/$p; make opt ) || exit; done
- make[1]: Entering directory '/home/opam/.opam/5.0/.opam-switch/build/ocamlfind.1.9.3/src/findlib'
- ocamlopt -I +compiler-libs -g -opaque   -c findlib_config.ml
- ocamlopt -I +compiler-libs -g -opaque   -c fl_split.ml
- ocamlopt -I +compiler-libs -g -opaque   -c fl_metatoken.ml
- ocamlopt -I +compiler-libs -g -opaque   -c fl_meta.ml
- ocamlopt -I +compiler-libs -g -opaque   -c fl_metascanner.ml
- ocamlopt -I +compiler-libs -g -opaque   -c fl_topo.ml
- ocamlopt -I +compiler-libs -g -opaque   -c fl_package_base.ml
- File "fl_package_base.ml", line 304, characters 22-40:
- 304 | 	 let pkg_ancestors = query_requirements predlist pkg in
-       	                     ^^^^^^^^^^^^^^^^^^
- Warning 6 [labels-omitted]: label preds was omitted in the application of this function.
- File "fl_package_base.ml", line 350, characters 18-36:
- 350 |   let ancestors = query_requirements predlist package_name in
-                         ^^^^^^^^^^^^^^^^^^
- Warning 6 [labels-omitted]: label preds was omitted in the application of this function.
- File "fl_package_base.ml", line 375, characters 23-41:
- 375 | 	  let pkg_ancestors = query_requirements predlist pkg in
-       	                      ^^^^^^^^^^^^^^^^^^
- Warning 6 [labels-omitted]: label preds was omitted in the application of this function.
- File "fl_package_base.ml", line 510, characters 16-35:
- 510 | 	     ( let c = package_definitions search_path pkg.package_name in
-       	               ^^^^^^^^^^^^^^^^^^^
- Warning 6 [labels-omitted]: label search_path was omitted in the application of this function.
- ocamlopt -I +compiler-libs -g -opaque   -c findlib.ml
- File "findlib.ml", line 390, characters 2-26:
- 390 |   Fl_package_base.requires predlist pkg
-         ^^^^^^^^^^^^^^^^^^^^^^^^
- Warning 6 [labels-omitted]: label preds was omitted in the application of this function.
- File "findlib.ml", line 396, characters 2-33:
- 396 |   Fl_package_base.requires_deeply predlist pkglist
-         ^^^^^^^^^^^^^^^^^^^^^^^^^^^^^^^
- Warning 6 [labels-omitted]: label preds was omitted in the application of this function.
- ocamlopt -I +compiler-libs -g -opaque   -c fl_args.ml
- ocamlopt -I +compiler-libs -g -opaque   -c fl_lint.ml
- ocamlopt -I +compiler-libs -g -a -o findlib.cmxa findlib_config.cmx fl_split.cmx fl_metatoken.cmx fl_meta.cmx fl_metascanner.cmx fl_topo.cmx fl_package_base.cmx findlib.cmx fl_args.cmx fl_lint.cmx
- if [ 1 -gt 0 ]; then \
-     ocamlopt -I +compiler-libs -g -shared -o findlib.cmxs findlib_config.cmx fl_split.cmx fl_metatoken.cmx fl_meta.cmx fl_metascanner.cmx fl_topo.cmx fl_package_base.cmx findlib.cmx fl_args.cmx fl_lint.cmx; \
- fi
- ocamlopt -I +compiler-libs -g -opaque   -c ocaml_args.ml
- ocamlopt -I +compiler-libs -g -opaque   -c frontend.ml
- File "frontend.ml", line 859, characters 10-39:
- 859 |           Fl_package_base.package_users predicates1 packages1
-                 ^^^^^^^^^^^^^^^^^^^^^^^^^^^^^
- Warning 6 [labels-omitted]: label preds was omitted in the application of this function.
- ocamlopt -I +compiler-libs -g -o ocamlfind_opt findlib.cmxa unix.cmxa \
- 	    ocaml_args.cmx frontend.cmx
- ocamlopt -I +compiler-libs -g -opaque   -c topfind.ml
- File "topfind.ml", line 126, characters 40-63:
- 126 |                      match Hashtbl.find Toploop.directive_table "ppx" with
-                                               ^^^^^^^^^^^^^^^^^^^^^^^
- Alert deprecated: Toploop.directive_table
- File "topfind.ml", line 256, characters 4-27:
- 256 |     Toploop.directive_table
-           ^^^^^^^^^^^^^^^^^^^^^^^
- Alert deprecated: Toploop.directive_table
- File "topfind.ml", line 266, characters 4-27:
- 266 |     Toploop.directive_table
-           ^^^^^^^^^^^^^^^^^^^^^^^
- Alert deprecated: Toploop.directive_table
- File "topfind.ml", line 278, characters 4-27:
- 278 |     Toploop.directive_table
-           ^^^^^^^^^^^^^^^^^^^^^^^
- Alert deprecated: Toploop.directive_table
- File "topfind.ml", line 291, characters 4-27:
- 291 |     Toploop.directive_table
-           ^^^^^^^^^^^^^^^^^^^^^^^
- Alert deprecated: Toploop.directive_table
- File "topfind.ml", line 305, characters 4-27:
- 305 |     Toploop.directive_table
-           ^^^^^^^^^^^^^^^^^^^^^^^
- Alert deprecated: Toploop.directive_table
- File "topfind.ml", line 317, characters 4-27:
- 317 |     Toploop.directive_table
-           ^^^^^^^^^^^^^^^^^^^^^^^
- Alert deprecated: Toploop.directive_table
- ocamlopt -I +compiler-libs -g -a -o findlib_top.cmxa topfind.cmx
- if [ 1 -gt 0 ]; then \
-     ocamlopt -I +compiler-libs -g -shared -o findlib_top.cmxs topfind.cmx; \
- fi
- ocamlopt -I +compiler-libs -g -opaque   -c fl_dynload.ml
- ocamlopt -I +compiler-libs -g -a -o findlib_dynload.cmxa fl_dynload.cmx
- if [ 1 -gt 0 ]; then \
-     ocamlopt -I +compiler-libs -g -shared -o findlib_dynload.cmxs fl_dynload.cmx; \
- fi
- make[1]: Leaving directory '/home/opam/.opam/5.0/.opam-switch/build/ocamlfind.1.9.3/src/findlib'
-> compiled  ocamlfind.1.9.3
Processing 84/225: [dune: ocaml bootstrap.ml] [ocamlbuild: make check-if-preinstalled]
Processing 85/225: [dune: ocaml bootstrap.ml] [ocamlbuild: make check-if-preinstalled] [ocamlfind: make install]
+ /home/opam/.opam/opam-init/hooks/sandbox.sh "install" "make" "install" (CWD=/home/opam/.opam/5.0/.opam-switch/build/ocamlfind.1.9.3)
- if [ "1" -eq 1 ]; then \
-     for x in camlp4 dbm graphics labltk num ocamlbuild; do \
-       if [ -f "/home/opam/.opam/5.0/lib/$x/META" ]; then \
-         if ! grep -Fq '[distributed with Ocaml]' "//home/opam/.opam/5.0/lib/$x/META"; then \
-           rm -f site-lib-src/$x/META; \
-         fi; \
-       fi; \
-     done; \
-     test -f "site-lib-src/num/META" || rm -f "site-lib-src/num-top/META"; \
-   fi
- echo 'SITELIB_META =' > Makefile.packages.in
- for x in `ls site-lib-src`; do test ! -f "site-lib-src/$x/META" || echo $x >> Makefile.packages.in; done
- tr '\n' ' ' < Makefile.packages.in > Makefile.packages
- rm Makefile.packages.in
- mkdir -p "/home/opam/.opam/5.0/bin"
- mkdir -p "/home/opam/.opam/5.0/man"
- make install-config
- make[1]: Entering directory '/home/opam/.opam/5.0/.opam-switch/build/ocamlfind.1.9.3'
- mkdir -p "`dirname \"/home/opam/.opam/5.0/lib/findlib.conf\"`"
- test -f "/home/opam/.opam/5.0/lib/findlib.conf" || cp findlib.conf "/home/opam/.opam/5.0/lib/findlib.conf"
- make[1]: Leaving directory '/home/opam/.opam/5.0/.opam-switch/build/ocamlfind.1.9.3'
- for p in findlib; do ( cd src/$p; make install ); done
- make[1]: Entering directory '/home/opam/.opam/5.0/.opam-switch/build/ocamlfind.1.9.3/src/findlib'
- mkdir -p "/home/opam/.opam/5.0/lib/findlib"
- mkdir -p "/home/opam/.opam/5.0/bin"
- test 1 -eq 0 || cp topfind "/home/opam/.opam/5.0/lib/ocaml"
- files=` ../../tools/collect_files ../../Makefile.config \
- findlib.cmi findlib.mli findlib.cma findlib.cmxa findlib.a findlib.cmxs \
- findlib_config.cmi findlib_config.ml topfind.cmi topfind.mli \
- fl_args.cmi fl_lint.cmi fl_meta.cmi fl_split.cmi fl_topo.cmi ocaml_args.cmi \
- fl_package_base.mli fl_package_base.cmi fl_metascanner.mli fl_metascanner.cmi \
- fl_metatoken.cmi findlib_top.cma findlib_top.cmxa findlib_top.a findlib_top.cmxs \
- findlib_dynload.cma findlib_dynload.cmxa findlib_dynload.a findlib_dynload.cmxs fl_dynload.mli fl_dynload.cmi \
- META` && \
- cp $files "/home/opam/.opam/5.0/lib/findlib"
- f="ocamlfind"; { test -f ocamlfind_opt && f="ocamlfind_opt"; }; \
- cp $f "/home/opam/.opam/5.0/bin/ocamlfind"
- # the following "if" block is only needed for 4.00beta2
- if [ 1 -eq 0 -a -f "/home/opam/.opam/5.0/lib/ocaml/compiler-libs/topdirs.cmi" ]; then \
-     cd "/home/opam/.opam/5.0/lib/ocaml/compiler-libs/"; \
-     cp topdirs.cmi toploop.cmi "/home/opam/.opam/5.0/lib/findlib/"; \
- fi
- make[1]: Leaving directory '/home/opam/.opam/5.0/.opam-switch/build/ocamlfind.1.9.3/src/findlib'
- make install-meta
- make[1]: Entering directory '/home/opam/.opam/5.0/.opam-switch/build/ocamlfind.1.9.3'
- for x in bytes compiler-libs dynlink ocamldoc stdlib str threads unix ; do mkdir -p "/home/opam/.opam/5.0/lib/$x"; cp site-lib-src/$x/META "/home/opam/.opam/5.0/lib/$x/META.tmp" && mv "/home/opam/.opam/5.0/lib/$x/META.tmp" "/home/opam/.opam/5.0/lib/$x/META"; done
- mkdir -p "/home/opam/.opam/5.0/lib/findlib"; cp Makefile.packages "/home/opam/.opam/5.0/lib/findlib/Makefile.packages"
- make[1]: Leaving directory '/home/opam/.opam/5.0/.opam-switch/build/ocamlfind.1.9.3'
- test ! -f 'site-lib-src/num-top/META' || { cd src/findlib; make install-num-top; }
- test ! -f 'site-lib-src/camlp4/META' ||	cp tools/safe_camlp4 "/home/opam/.opam/5.0/bin"
- make install-doc
- make[1]: Entering directory '/home/opam/.opam/5.0/.opam-switch/build/ocamlfind.1.9.3'
- mkdir -p "/home/opam/.opam/5.0/man/man1" "/home/opam/.opam/5.0/man/man3" "/home/opam/.opam/5.0/man/man5"
- cp doc/ref-man/ocamlfind.1 "/home/opam/.opam/5.0/man/man1"
- cp doc/ref-man/META.5 doc/ref-man/site-lib.5 doc/ref-man/findlib.conf.5 "/home/opam/.opam/5.0/man/man5"
- make[1]: Leaving directory '/home/opam/.opam/5.0/.opam-switch/build/ocamlfind.1.9.3'
-> installed ocamlfind.1.9.3
Processing 85/225: [dune: ocaml bootstrap.ml] [ocamlbuild: make check-if-preinstalled]
Processing 86/225: [dune: ocaml bootstrap.ml] [ocamlbuild: make check-if-preinstalled]
Processing 87/225: [calendar: ./configure] [dune: ocaml bootstrap.ml] [ocamlbuild: make check-if-preinstalled]
Processing 88/225: [calendar: ./configure] [dune: ocaml bootstrap.ml] [num: make] [ocamlbuild: make check-if-preinstalled]
Processing 89/225: [calendar: ./configure] [dune: ocaml bootstrap.ml] [num: make] [ocamlbuild: make check-if-preinstalled] [zarith: ./configure]
-> installed base-bytes.base
Processing 90/225: [calendar: ./configure] [dune: ocaml bootstrap.ml] [num: make] [ocamlbuild: make check-if-preinstalled] [zarith: ./configure]
+ /home/opam/.opam/opam-init/hooks/sandbox.sh "build" "./configure" (CWD=/home/opam/.opam/5.0/.opam-switch/build/calendar.2.04)
- checking for ocamlc... ocamlc
- ocaml version is 5.0.0+dev0-2021-11-05: Unsupported version!
[ERROR] The compilation of calendar.2.04 failed at "./configure".
Processing 90/225: [dune: ocaml bootstrap.ml] [num: make] [ocamlbuild: make check-if-preinstalled] [zarith: ./configure]
Processing 91/225: [dune: ocaml bootstrap.ml] [num: make] [ocamlbuild: make check-if-preinstalled] [zarith: ./configure]
+ /home/opam/.opam/opam-init/hooks/sandbox.sh "build" "./configure" (CWD=/home/opam/.opam/5.0/.opam-switch/build/zarith.1.12)
- binary ocaml: found in /home/opam/.opam/5.0/bin
- binary ocamlc: found in /home/opam/.opam/5.0/bin
- binary ocamldep: found in /home/opam/.opam/5.0/bin
- binary ocamlmklib: found in /home/opam/.opam/5.0/bin
- binary ocamldoc: found in /home/opam/.opam/5.0/bin
- binary gcc: found in /usr/bin
- binary ocamlopt: found in /home/opam/.opam/5.0/bin
- checking compilation with gcc -O3 -Wall -Wextra : working
- include caml/mlvalues.h: found
- library dynlink.cmxa: found
- binary ocamlfind: found in /home/opam/.opam/5.0/bin
- OCaml's word size is 64
- binary uname: found in /bin
- include gmp.h: found
- library gmp: found
- OCaml supports -bin-annot to produce documentation
- 
- detected configuration:
- 
-   native-code:          yes
-   dynamic linking:      yes
-   defines:              -DHAS_GMP 
-   libraries:             -lgmp
-   C options:            -O3 -Wall -Wextra 
-   installation path:    /home/opam/.opam/5.0/lib
-   installation method   findlib
- 
- configuration successful!
- now type "make" to build
- then type "make install" or "sudo make install" to install
Processing 91/225: [dune: ocaml bootstrap.ml] [num: make] [ocamlbuild: make check-if-preinstalled] [zarith: make]
+ /home/opam/.opam/opam-init/hooks/sandbox.sh "build" "make" (CWD=/home/opam/.opam/5.0/.opam-switch/build/num.1.4)
- make -C src all
- make[1]: Entering directory '/home/opam/.opam/5.0/.opam-switch/build/num.1.4/src'
- ocamlc -ccopt -DBNG_ARCH_amd64 -c bng.c
- ocamlc -ccopt -DBNG_ARCH_amd64 -c nat_stubs.c
- ocamlmklib -oc nums bng.o nat_stubs.o
- ocamlc -w +a-4-9-41-42-44-45-48 -warn-error A -bin-annot -g -safe-string -strict-sequence -strict-formats -c int_misc.mli
- ocamlc -w +a-4-9-41-42-44-45-48 -warn-error A -bin-annot -g -safe-string -strict-sequence -strict-formats -c int_misc.ml
- ocamlc -w +a-4-9-41-42-44-45-48 -warn-error A -bin-annot -g -safe-string -strict-sequence -strict-formats -c nat.mli
- ocamlc -w +a-4-9-41-42-44-45-48 -warn-error A -bin-annot -g -safe-string -strict-sequence -strict-formats -c nat.ml
- ocamlc -w +a-4-9-41-42-44-45-48 -warn-error A -bin-annot -g -safe-string -strict-sequence -strict-formats -c big_int.mli
- ocamlc -w +a-4-9-41-42-44-45-48 -warn-error A -bin-annot -g -safe-string -strict-sequence -strict-formats -c big_int.ml
- ocamlc -w +a-4-9-41-42-44-45-48 -warn-error A -bin-annot -g -safe-string -strict-sequence -strict-formats -c arith_flags.mli
- ocamlc -w +a-4-9-41-42-44-45-48 -warn-error A -bin-annot -g -safe-string -strict-sequence -strict-formats -c arith_flags.ml
- ocamlc -w +a-4-9-41-42-44-45-48 -warn-error A -bin-annot -g -safe-string -strict-sequence -strict-formats -c ratio.mli
- ocamlc -w +a-4-9-41-42-44-45-48 -warn-error A -bin-annot -g -safe-string -strict-sequence -strict-formats -c ratio.ml
- ocamlc -w +a-4-9-41-42-44-45-48 -warn-error A -bin-annot -g -safe-string -strict-sequence -strict-formats -c num.mli
- ocamlc -w +a-4-9-41-42-44-45-48 -warn-error A -bin-annot -g -safe-string -strict-sequence -strict-formats -c num.ml
- ocamlc -w +a-4-9-41-42-44-45-48 -warn-error A -bin-annot -g -safe-string -strict-sequence -strict-formats -c arith_status.mli
- ocamlc -w +a-4-9-41-42-44-45-48 -warn-error A -bin-annot -g -safe-string -strict-sequence -strict-formats -c arith_status.ml
- ocamlmklib -o nums -oc nums -linkall int_misc.cmo nat.cmo big_int.cmo arith_flags.cmo ratio.cmo num.cmo arith_status.cmo
- ocamlopt -w +a-4-9-41-42-44-45-48 -warn-error A -bin-annot -g -safe-string -strict-sequence -strict-formats -c int_misc.ml
- ocamlopt -w +a-4-9-41-42-44-45-48 -warn-error A -bin-annot -g -safe-string -strict-sequence -strict-formats -c nat.ml
- ocamlopt -w +a-4-9-41-42-44-45-48 -warn-error A -bin-annot -g -safe-string -strict-sequence -strict-formats -c big_int.ml
- ocamlopt -w +a-4-9-41-42-44-45-48 -warn-error A -bin-annot -g -safe-string -strict-sequence -strict-formats -c arith_flags.ml
- ocamlopt -w +a-4-9-41-42-44-45-48 -warn-error A -bin-annot -g -safe-string -strict-sequence -strict-formats -c ratio.ml
- ocamlopt -w +a-4-9-41-42-44-45-48 -warn-error A -bin-annot -g -safe-string -strict-sequence -strict-formats -c num.ml
- ocamlopt -w +a-4-9-41-42-44-45-48 -warn-error A -bin-annot -g -safe-string -strict-sequence -strict-formats -c arith_status.ml
- ocamlmklib -o nums -oc nums -linkall int_misc.cmx nat.cmx big_int.cmx arith_flags.cmx ratio.cmx num.cmx arith_status.cmx
- ocamlopt -w +a-4-9-41-42-44-45-48 -warn-error A -bin-annot -g -safe-string -strict-sequence -strict-formats -I . -shared -o nums.cmxs nums.cmxa
- make[1]: Leaving directory '/home/opam/.opam/5.0/.opam-switch/build/num.1.4/src'
- make -C toplevel all
- make[1]: Entering directory '/home/opam/.opam/5.0/.opam-switch/build/num.1.4/toplevel'
- ocamlc -I ../src -I +compiler-libs -w +a-4-9-41-42-44-45-48 -warn-error A -safe-string -strict-sequence -strict-formats -c num_top_printers.mli
- ocamlc -I ../src -I +compiler-libs -w +a-4-9-41-42-44-45-48 -warn-error A -safe-string -strict-sequence -strict-formats -c num_top_printers.ml
- ocamlc -I ../src -I +compiler-libs -w +a-4-9-41-42-44-45-48 -warn-error A -safe-string -strict-sequence -strict-formats -c num_top.mli
- ocamlc -I ../src -I +compiler-libs -w +a-4-9-41-42-44-45-48 -warn-error A -safe-string -strict-sequence -strict-formats -c num_top.ml
- ocamlc -I ../src -I +compiler-libs -w +a-4-9-41-42-44-45-48 -warn-error A -safe-string -strict-sequence -strict-formats -a -o num_top.cma num_top_printers.cmo num_top.cmo
- make[1]: Leaving directory '/home/opam/.opam/5.0/.opam-switch/build/num.1.4/toplevel'
-> compiled  num.1.4
Processing 91/225: [dune: ocaml bootstrap.ml] [ocamlbuild: make check-if-preinstalled] [zarith: make]
Processing 92/225: [dune: ocaml bootstrap.ml] [ocamlbuild: make check-if-preinstalled] [zarith: make] [num: ocamlfind remove]
+ /home/opam/.opam/opam-init/hooks/sandbox.sh "install" "ocamlfind" "remove" "num" (CWD=/home/opam/.opam/5.0/.opam-switch/build/num.1.4)
- ocamlfind: [WARNING] No such file: /home/opam/.opam/5.0/lib/num/META
+ /home/opam/.opam/opam-init/hooks/sandbox.sh "install" "ocamlfind" "remove" "num-top" (CWD=/home/opam/.opam/5.0/.opam-switch/build/num.1.4)
- ocamlfind: [WARNING] No such file: /home/opam/.opam/5.0/lib/num-top/META
Processing 92/225: [dune: ocaml bootstrap.ml] [ocamlbuild: make check-if-preinstalled] [zarith: make] [num: make install]
+ /home/opam/.opam/opam-init/hooks/sandbox.sh "install" "make" "install" (CWD=/home/opam/.opam/5.0/.opam-switch/build/num.1.4)
- make -C src install
- make[1]: Entering directory '/home/opam/.opam/5.0/.opam-switch/build/num.1.4/src'
- install -d /home/opam/.opam/5.0/lib/ocaml
- sed -e 's/%%VERSION%%/1.4/g' META.in > META
- ocamlfind install num META
- Installed /home/opam/.opam/5.0/lib/num/META
- rm -f META
- install -m 644 nums.cma libnums.a big_int.cmi nat.cmi num.cmi ratio.cmi arith_status.cmi big_int.mli nat.mli num.mli ratio.mli arith_status.mli big_int.cmti nat.cmti num.cmti ratio.cmti arith_status.cmti nums.cmxa nums.a int_misc.cmx nat.cmx big_int.cmx arith_flags.cmx ratio.cmx num.cmx arith_status.cmx nums.cmxs /home/opam/.opam/5.0/lib/ocaml
- install -d /home/opam/.opam/5.0/lib/ocaml/stublibs
- install dllnums.so /home/opam/.opam/5.0/lib/ocaml/stublibs
- make[1]: Leaving directory '/home/opam/.opam/5.0/.opam-switch/build/num.1.4/src'
- make -C toplevel install
- make[1]: Entering directory '/home/opam/.opam/5.0/.opam-switch/build/num.1.4/toplevel'
- sed -e 's/%%VERSION%%/1.4/g' META.in > META
- ocamlfind install num-top META num_top.cma num_top.cmi num_top_printers.cmi
- Installed /home/opam/.opam/5.0/lib/num-top/num_top_printers.cmi
- Installed /home/opam/.opam/5.0/lib/num-top/num_top.cmi
- Installed /home/opam/.opam/5.0/lib/num-top/num_top.cma
- Installed /home/opam/.opam/5.0/lib/num-top/META
- rm -f META
- make[1]: Leaving directory '/home/opam/.opam/5.0/.opam-switch/build/num.1.4/toplevel'
-> installed num.1.4
Processing 92/225: [dune: ocaml bootstrap.ml] [ocamlbuild: make check-if-preinstalled] [zarith: make]
+ /home/opam/.opam/opam-init/hooks/sandbox.sh "build" "make" (CWD=/home/opam/.opam/5.0/.opam-switch/build/zarith.1.12)
- (echo "let"; grep "version" META | head -1) > zarith_version.ml
- ocamldep -native  zarith_version.ml z.ml q.ml big_int_Z.ml z.mli q.mli big_int_Z.mli > depend
- ocamlc -I +compiler-libs -bin-annot  -c zarith_version.ml
- ocamlc -I +compiler-libs -bin-annot  -c z.mli
- ocamlc -I +compiler-libs -bin-annot  -c z.ml
- ocamlc -I +compiler-libs -bin-annot  -c q.mli
- ocamlc -I +compiler-libs -bin-annot  -c q.ml
- File "q.ml", line 537, characters 9-23:
- 537 |         (Z.of_substring s 0 i)
-                ^^^^^^^^^^^^^^
- Warning 6 [labels-omitted]: labels pos, len were omitted in the application of this function.
- File "q.ml", line 538, characters 9-23:
- 538 |         (Z.of_substring s (i+1) (String.length s-i-1))
-                ^^^^^^^^^^^^^^
- Warning 6 [labels-omitted]: labels pos, len were omitted in the application of this function.
- ocamlc -I +compiler-libs -bin-annot  -c big_int_Z.mli
- ocamlc -I +compiler-libs -bin-annot  -c big_int_Z.ml
- ocamlmklib -failsafe -o zarith zarith_version.cmo z.cmo q.cmo big_int_Z.cmo -lgmp
- ocamlc -ccopt "-I/home/opam/.opam/5.0/lib/ocaml  -DHAS_GMP  -O3 -Wall -Wextra " -c caml_z.c
- ocamlmklib -failsafe -o zarith caml_z.o -lgmp
- ocamlc -I +compiler-libs -bin-annot  -c zarith_top.ml
- ocamlc -o zarith_top.cma -a zarith_top.cmo
- ocamlopt -I +compiler-libs  -c zarith_version.ml
- ocamlopt -I +compiler-libs  -c z.ml
- ocamlopt -I +compiler-libs  -c q.ml
- File "q.ml", line 537, characters 9-23:
- 537 |         (Z.of_substring s 0 i)
-                ^^^^^^^^^^^^^^
- Warning 6 [labels-omitted]: labels pos, len were omitted in the application of this function.
- File "q.ml", line 538, characters 9-23:
- 538 |         (Z.of_substring s (i+1) (String.length s-i-1))
-                ^^^^^^^^^^^^^^
- Warning 6 [labels-omitted]: labels pos, len were omitted in the application of this function.
- ocamlopt -I +compiler-libs  -c big_int_Z.ml
- ocamlmklib -failsafe -o zarith zarith_version.cmx z.cmx q.cmx big_int_Z.cmx -lgmp
- ocamlopt -shared -o zarith.cmxs -I . zarith.cmxa -linkall
-> compiled  zarith.1.12
Processing 92/225: [dune: ocaml bootstrap.ml] [ocamlbuild: make check-if-preinstalled]
Processing 93/225: [dune: ocaml bootstrap.ml] [ocamlbuild: make check-if-preinstalled] [zarith: make install]
+ /home/opam/.opam/opam-init/hooks/sandbox.sh "install" "make" "install" (CWD=/home/opam/.opam/5.0/.opam-switch/build/zarith.1.12)
- ocamlfind install -destdir "/home/opam/.opam/5.0/lib" zarith META zarith.cma libzarith.a z.cmi q.cmi big_int_Z.cmi zarith_top.cma z.mli zarith.cmxa z.cmx q.cmx big_int_Z.cmx zarith.cmxs zarith.h q.mli big_int_Z.mli zarith.a z.cmti q.cmti big_int_Z.cmti -optional dllzarith.so
- Installed /home/opam/.opam/5.0/lib/zarith/big_int_Z.cmti
- Installed /home/opam/.opam/5.0/lib/zarith/q.cmti
- Installed /home/opam/.opam/5.0/lib/zarith/z.cmti
- Installed /home/opam/.opam/5.0/lib/zarith/zarith.a
- Installed /home/opam/.opam/5.0/lib/zarith/big_int_Z.mli
- Installed /home/opam/.opam/5.0/lib/zarith/q.mli
- Installed /home/opam/.opam/5.0/lib/zarith/zarith.h
- Installed /home/opam/.opam/5.0/lib/zarith/zarith.cmxs
- Installed /home/opam/.opam/5.0/lib/zarith/big_int_Z.cmx
- Installed /home/opam/.opam/5.0/lib/zarith/q.cmx
- Installed /home/opam/.opam/5.0/lib/zarith/z.cmx
- Installed /home/opam/.opam/5.0/lib/zarith/zarith.cmxa
- Installed /home/opam/.opam/5.0/lib/zarith/z.mli
- Installed /home/opam/.opam/5.0/lib/zarith/zarith_top.cma
- Installed /home/opam/.opam/5.0/lib/zarith/big_int_Z.cmi
- Installed /home/opam/.opam/5.0/lib/zarith/q.cmi
- Installed /home/opam/.opam/5.0/lib/zarith/z.cmi
- Installed /home/opam/.opam/5.0/lib/zarith/libzarith.a
- Installed /home/opam/.opam/5.0/lib/zarith/zarith.cma
- Installed /home/opam/.opam/5.0/lib/stublibs/dllzarith.so
- Installed /home/opam/.opam/5.0/lib/stublibs/dllzarith.so.owner
- ocamlfind: [WARNING] You have installed DLLs but the directory /home/opam/.opam/5.0/lib/stublibs is not mentioned in ld.conf
- Installed /home/opam/.opam/5.0/lib/zarith/META
-> installed zarith.1.12
Processing 93/225: [dune: ocaml bootstrap.ml] [ocamlbuild: make check-if-preinstalled]
+ /home/opam/.opam/opam-init/hooks/sandbox.sh "build" "make" "check-if-preinstalled" "all" "opam-install" (CWD=/home/opam/.opam/5.0/.opam-switch/build/ocamlbuild.0.14.1)
- if test -d /home/opam/.opam/5.0/lib/ocaml/ocamlbuild; then\
-   >&2 echo "ERROR: Preinstalled ocamlbuild detected at"\
-        "/home/opam/.opam/5.0/lib/ocaml/ocamlbuild";\
-   >&2 echo "Installation aborted; if you want to bypass this"\
-         "safety check, pass CHECK_IF_PREINSTALLED=false to make";\
-   exit 2;\
- fi
- ocamlc.opt -w +L -w +R -w +Z -I src -I +unix -safe-string -bin-annot -strict-sequence -c src/const.ml
- ocamlc.opt -w +L -w +R -w +Z -I src -I +unix -safe-string -bin-annot -strict-sequence -c src/loc.mli
- ocamlc.opt -w +L -w +R -w +Z -I src -I +unix -safe-string -bin-annot -strict-sequence -c src/loc.ml
- ocamlc.opt -w +L -w +R -w +Z -I src -I +unix -safe-string -bin-annot -strict-sequence -c src/discard_printf.mli
- ocamlc.opt -w +L -w +R -w +Z -I src -I +unix -safe-string -bin-annot -strict-sequence -c src/discard_printf.ml
- ocamlc.opt -w +L -w +R -w +Z -I src -I +unix -safe-string -bin-annot -strict-sequence -c src/signatures.mli
- ocamlc.opt -w +L -w +R -w +Z -I src -I +unix -safe-string -bin-annot -strict-sequence -c src/my_std.mli
- ocamlc.opt -w +L -w +R -w +Z -I src -I +unix -safe-string -bin-annot -strict-sequence -c src/my_std.ml
- ocamlc.opt -w +L -w +R -w +Z -I src -I +unix -safe-string -bin-annot -strict-sequence -c src/my_unix.mli
- ocamlc.opt -w +L -w +R -w +Z -I src -I +unix -safe-string -bin-annot -strict-sequence -c src/my_unix.ml
- ocamlc.opt -w +L -w +R -w +Z -I src -I +unix -safe-string -bin-annot -strict-sequence -c src/tags.mli
- ocamlc.opt -w +L -w +R -w +Z -I src -I +unix -safe-string -bin-annot -strict-sequence -c src/tags.ml
- ocamlc.opt -w +L -w +R -w +Z -I src -I +unix -safe-string -bin-annot -strict-sequence -c src/display.mli
- ocamlc.opt -w +L -w +R -w +Z -I src -I +unix -safe-string -bin-annot -strict-sequence -c src/display.ml
- ocamlc.opt -w +L -w +R -w +Z -I src -I +unix -safe-string -bin-annot -strict-sequence -c src/log.mli
- ocamlc.opt -w +L -w +R -w +Z -I src -I +unix -safe-string -bin-annot -strict-sequence -c src/log.ml
- ocamlc.opt -w +L -w +R -w +Z -I src -I +unix -safe-string -bin-annot -strict-sequence -c src/shell.mli
- ocamlc.opt -w +L -w +R -w +Z -I src -I +unix -safe-string -bin-annot -strict-sequence -c src/shell.ml
- ocamlc.opt -w +L -w +R -w +Z -I src -I +unix -safe-string -bin-annot -strict-sequence -c src/bool.mli
- ocamlc.opt -w +L -w +R -w +Z -I src -I +unix -safe-string -bin-annot -strict-sequence -c src/bool.ml
- ocamlc.opt -w +L -w +R -w +Z -I src -I +unix -safe-string -bin-annot -strict-sequence -c src/glob_ast.mli
- ocamlc.opt -w +L -w +R -w +Z -I src -I +unix -safe-string -bin-annot -strict-sequence -c src/glob_ast.ml
- ocamllex.opt src/glob_lexer.mll
- 55 states, 419 transitions, table size 2006 bytes
- ocamlc.opt -w +L -w +R -w +Z -I src -I +unix -safe-string -bin-annot -strict-sequence -c src/glob_lexer.mli
- ocamlc.opt -w +L -w +R -w +Z -I src -I +unix -safe-string -bin-annot -strict-sequence -c src/glob_lexer.ml
- ocamlc.opt -w +L -w +R -w +Z -I src -I +unix -safe-string -bin-annot -strict-sequence -c src/glob.mli
- ocamlc.opt -w +L -w +R -w +Z -I src -I +unix -safe-string -bin-annot -strict-sequence -c src/glob.ml
- ocamllex.opt src/lexers.mll
- 251 states, 1051 transitions, table size 5710 bytes
- 4334 additional bytes used for bindings
- ocamlc.opt -w +L -w +R -w +Z -I src -I +unix -safe-string -bin-annot -strict-sequence -c src/lexers.mli
- ocamlc.opt -w +L -w +R -w +Z -I src -I +unix -safe-string -bin-annot -strict-sequence -c src/lexers.ml
- ocamlc.opt -w +L -w +R -w +Z -I src -I +unix -safe-string -bin-annot -strict-sequence -c src/param_tags.mli
- ocamlc.opt -w +L -w +R -w +Z -I src -I +unix -safe-string -bin-annot -strict-sequence -c src/param_tags.ml
- ocamlc.opt -w +L -w +R -w +Z -I src -I +unix -safe-string -bin-annot -strict-sequence -c src/command.mli
- ocamlc.opt -w +L -w +R -w +Z -I src -I +unix -safe-string -bin-annot -strict-sequence -c src/command.ml
- ocamlc.opt -w +L -w +R -w +Z -I src -I +unix -safe-string -bin-annot -strict-sequence -c src/ocamlbuild_config.ml
- ocamlc.opt -w +L -w +R -w +Z -I src -I +unix -safe-string -bin-annot -strict-sequence -c src/ocamlbuild_where.mli
- ocamlc.opt -w +L -w +R -w +Z -I src -I +unix -safe-string -bin-annot -strict-sequence -c src/ocamlbuild_where.ml
- ocamlc.opt -w +L -w +R -w +Z -I src -I +unix -safe-string -bin-annot -strict-sequence -c src/slurp.mli
- ocamlc.opt -w +L -w +R -w +Z -I src -I +unix -safe-string -bin-annot -strict-sequence -c src/slurp.ml
- ocamlc.opt -w +L -w +R -w +Z -I src -I +unix -safe-string -bin-annot -strict-sequence -c src/options.mli
- ocamlc.opt -w +L -w +R -w +Z -I src -I +unix -safe-string -bin-annot -strict-sequence -c src/options.ml
- ocamlc.opt -w +L -w +R -w +Z -I src -I +unix -safe-string -bin-annot -strict-sequence -c src/pathname.mli
- ocamlc.opt -w +L -w +R -w +Z -I src -I +unix -safe-string -bin-annot -strict-sequence -c src/pathname.ml
- ocamlc.opt -w +L -w +R -w +Z -I src -I +unix -safe-string -bin-annot -strict-sequence -c src/configuration.mli
- ocamlc.opt -w +L -w +R -w +Z -I src -I +unix -safe-string -bin-annot -strict-sequence -c src/configuration.ml
- ocamlc.opt -w +L -w +R -w +Z -I src -I +unix -safe-string -bin-annot -strict-sequence -c src/flags.mli
- ocamlc.opt -w +L -w +R -w +Z -I src -I +unix -safe-string -bin-annot -strict-sequence -c src/flags.ml
- ocamlc.opt -w +L -w +R -w +Z -I src -I +unix -safe-string -bin-annot -strict-sequence -c src/hygiene.mli
- ocamlc.opt -w +L -w +R -w +Z -I src -I +unix -safe-string -bin-annot -strict-sequence -c src/hygiene.ml
- ocamlc.opt -w +L -w +R -w +Z -I src -I +unix -safe-string -bin-annot -strict-sequence -c src/digest_cache.mli
- ocamlc.opt -w +L -w +R -w +Z -I src -I +unix -safe-string -bin-annot -strict-sequence -c src/digest_cache.ml
- ocamlc.opt -w +L -w +R -w +Z -I src -I +unix -safe-string -bin-annot -strict-sequence -c src/resource.mli
- ocamlc.opt -w +L -w +R -w +Z -I src -I +unix -safe-string -bin-annot -strict-sequence -c src/resource.ml
- ocamlc.opt -w +L -w +R -w +Z -I src -I +unix -safe-string -bin-annot -strict-sequence -c src/rule.mli
- ocamlc.opt -w +L -w +R -w +Z -I src -I +unix -safe-string -bin-annot -strict-sequence -c src/rule.ml
- ocamlc.opt -w +L -w +R -w +Z -I src -I +unix -safe-string -bin-annot -strict-sequence -c src/solver.mli
- ocamlc.opt -w +L -w +R -w +Z -I src -I +unix -safe-string -bin-annot -strict-sequence -c src/solver.ml
- ocamlc.opt -w +L -w +R -w +Z -I src -I +unix -safe-string -bin-annot -strict-sequence -c src/report.mli
- ocamlc.opt -w +L -w +R -w +Z -I src -I +unix -safe-string -bin-annot -strict-sequence -c src/report.ml
- ocamlc.opt -w +L -w +R -w +Z -I src -I +unix -safe-string -bin-annot -strict-sequence -c src/tools.mli
- ocamlc.opt -w +L -w +R -w +Z -I src -I +unix -safe-string -bin-annot -strict-sequence -c src/tools.ml
- ocamlc.opt -w +L -w +R -w +Z -I src -I +unix -safe-string -bin-annot -strict-sequence -c src/fda.mli
- ocamlc.opt -w +L -w +R -w +Z -I src -I +unix -safe-string -bin-annot -strict-sequence -c src/fda.ml
- ocamlc.opt -w +L -w +R -w +Z -I src -I +unix -safe-string -bin-annot -strict-sequence -c src/findlib.mli
- ocamlc.opt -w +L -w +R -w +Z -I src -I +unix -safe-string -bin-annot -strict-sequence -c src/findlib.ml
- ocamlc.opt -w +L -w +R -w +Z -I src -I +unix -safe-string -bin-annot -strict-sequence -c src/ocaml_arch.mli
- ocamlc.opt -w +L -w +R -w +Z -I src -I +unix -safe-string -bin-annot -strict-sequence -c src/ocaml_arch.ml
- ocamlc.opt -w +L -w +R -w +Z -I src -I +unix -safe-string -bin-annot -strict-sequence -c src/ocaml_utils.mli
- ocamlc.opt -w +L -w +R -w +Z -I src -I +unix -safe-string -bin-annot -strict-sequence -c src/ocaml_utils.ml
- ocamlc.opt -w +L -w +R -w +Z -I src -I +unix -safe-string -bin-annot -strict-sequence -c src/ocaml_dependencies.mli
- ocamlc.opt -w +L -w +R -w +Z -I src -I +unix -safe-string -bin-annot -strict-sequence -c src/ocaml_dependencies.ml
- ocamlc.opt -w +L -w +R -w +Z -I src -I +unix -safe-string -bin-annot -strict-sequence -c src/ocaml_compiler.mli
- ocamlc.opt -w +L -w +R -w +Z -I src -I +unix -safe-string -bin-annot -strict-sequence -c src/ocaml_compiler.ml
- ocamlc.opt -w +L -w +R -w +Z -I src -I +unix -safe-string -bin-annot -strict-sequence -c src/ocaml_tools.mli
- ocamlc.opt -w +L -w +R -w +Z -I src -I +unix -safe-string -bin-annot -strict-sequence -c src/ocaml_tools.ml
- ocamlc.opt -w +L -w +R -w +Z -I src -I +unix -safe-string -bin-annot -strict-sequence -c src/ocaml_specific.mli
- ocamlc.opt -w +L -w +R -w +Z -I src -I +unix -safe-string -bin-annot -strict-sequence -c src/ocaml_specific.ml
- ocamlc.opt -w +L -w +R -w +Z -I src -I +unix -safe-string -bin-annot -strict-sequence -c src/exit_codes.mli
- ocamlc.opt -w +L -w +R -w +Z -I src -I +unix -safe-string -bin-annot -strict-sequence -c src/exit_codes.ml
- ocamlc.opt -w +L -w +R -w +Z -I src -I +unix -safe-string -bin-annot -strict-sequence -c src/plugin.mli
- ocamlc.opt -w +L -w +R -w +Z -I src -I +unix -safe-string -bin-annot -strict-sequence -c src/plugin.ml
- ocamlc.opt -w +L -w +R -w +Z -I src -I +unix -safe-string -bin-annot -strict-sequence -c src/hooks.mli
- ocamlc.opt -w +L -w +R -w +Z -I src -I +unix -safe-string -bin-annot -strict-sequence -c src/hooks.ml
- ocamlc.opt -w +L -w +R -w +Z -I src -I +unix -safe-string -bin-annot -strict-sequence -c src/main.mli
- ocamlc.opt -w +L -w +R -w +Z -I src -I +unix -safe-string -bin-annot -strict-sequence -c src/main.ml
- mkdir -p tmp
- ocamlc.opt -pack src/const.cmo src/loc.cmo src/discard_printf.cmo src/signatures.cmi src/my_std.cmo src/my_unix.cmo src/tags.cmo src/display.cmo src/log.cmo src/shell.cmo src/bool.cmo src/glob_ast.cmo src/glob_lexer.cmo src/glob.cmo src/lexers.cmo src/param_tags.cmo src/command.cmo src/ocamlbuild_config.cmo src/ocamlbuild_where.cmo src/slurp.cmo src/options.cmo src/pathname.cmo src/configuration.cmo src/flags.cmo src/hygiene.cmo src/digest_cache.cmo src/resource.cmo src/rule.cmo src/solver.cmo src/report.cmo src/tools.cmo src/fda.cmo src/findlib.cmo src/ocaml_arch.cmo src/ocaml_utils.cmo src/ocaml_dependencies.cmo src/ocaml_compiler.cmo src/ocaml_tools.cmo src/ocaml_specific.cmo src/exit_codes.cmo src/plugin.cmo src/hooks.cmo src/main.cmo -o tmp/ocamlbuild_pack.cmo
- mv tmp/ocamlbuild_pack.cmi src/ocamlbuild_pack.cmi
- mv tmp/ocamlbuild_pack.cmo src/ocamlbuild_pack.cmo
- ocamlc.opt -w +L -w +R -w +Z -I src -I +unix -safe-string -bin-annot -strict-sequence -c src/ocamlbuild_plugin.mli
- ocamlc.opt -w +L -w +R -w +Z -I src -I +unix -safe-string -bin-annot -strict-sequence -c src/ocamlbuild_plugin.ml
- ocamlc.opt -w +L -w +R -w +Z -I src -I +unix -safe-string -bin-annot -strict-sequence -c src/ocamlbuild_executor.mli
- ocamlc.opt -w +L -w +R -w +Z -I src -I +unix -safe-string -bin-annot -strict-sequence -c src/ocamlbuild_executor.ml
- ocamlc.opt -w +L -w +R -w +Z -I src -I +unix -safe-string -bin-annot -strict-sequence -c src/ocamlbuild_unix_plugin.mli
- ocamlc.opt -w +L -w +R -w +Z -I src -I +unix -safe-string -bin-annot -strict-sequence -c src/ocamlbuild_unix_plugin.ml
- ocamlc.opt -w +L -w +R -w +Z -I src -I +unix -safe-string -bin-annot -strict-sequence -c src/ocamlbuild.mli
- ocamlc.opt -w +L -w +R -w +Z -I src -I +unix -safe-string -bin-annot -strict-sequence -c src/ocamlbuild.ml
- ocamlc.opt -I +unix -I src -o ocamlbuild.byte unix.cma src/ocamlbuild_pack.cmo src/ocamlbuild_plugin.cmo src/ocamlbuild_executor.cmo src/ocamlbuild_unix_plugin.cmo src/ocamlbuild.cmo
- ocamlc.opt -a -o src/ocamlbuildlib.cma src/ocamlbuild_pack.cmo src/ocamlbuild_plugin.cmo src/ocamlbuild_executor.cmo src/ocamlbuild_unix_plugin.cmo
- ocamlopt.opt -for-pack Ocamlbuild_pack -w +L -w +R -w +Z -I src -I +unix -safe-string -bin-annot -strict-sequence -c src/const.ml
- ocamlopt.opt -for-pack Ocamlbuild_pack -w +L -w +R -w +Z -I src -I +unix -safe-string -bin-annot -strict-sequence -c src/loc.ml
- ocamlopt.opt -for-pack Ocamlbuild_pack -w +L -w +R -w +Z -I src -I +unix -safe-string -bin-annot -strict-sequence -c src/discard_printf.ml
- ocamlopt.opt -for-pack Ocamlbuild_pack -w +L -w +R -w +Z -I src -I +unix -safe-string -bin-annot -strict-sequence -c src/my_std.ml
- ocamlopt.opt -for-pack Ocamlbuild_pack -w +L -w +R -w +Z -I src -I +unix -safe-string -bin-annot -strict-sequence -c src/my_unix.ml
- ocamlopt.opt -for-pack Ocamlbuild_pack -w +L -w +R -w +Z -I src -I +unix -safe-string -bin-annot -strict-sequence -c src/tags.ml
- ocamlopt.opt -for-pack Ocamlbuild_pack -w +L -w +R -w +Z -I src -I +unix -safe-string -bin-annot -strict-sequence -c src/display.ml
- ocamlopt.opt -for-pack Ocamlbuild_pack -w +L -w +R -w +Z -I src -I +unix -safe-string -bin-annot -strict-sequence -c src/log.ml
- ocamlopt.opt -for-pack Ocamlbuild_pack -w +L -w +R -w +Z -I src -I +unix -safe-string -bin-annot -strict-sequence -c src/shell.ml
- ocamlopt.opt -for-pack Ocamlbuild_pack -w +L -w +R -w +Z -I src -I +unix -safe-string -bin-annot -strict-sequence -c src/bool.ml
- ocamlopt.opt -for-pack Ocamlbuild_pack -w +L -w +R -w +Z -I src -I +unix -safe-string -bin-annot -strict-sequence -c src/glob_ast.ml
- ocamlopt.opt -for-pack Ocamlbuild_pack -w +L -w +R -w +Z -I src -I +unix -safe-string -bin-annot -strict-sequence -c src/glob_lexer.ml
- ocamlopt.opt -for-pack Ocamlbuild_pack -w +L -w +R -w +Z -I src -I +unix -safe-string -bin-annot -strict-sequence -c src/glob.ml
- ocamlopt.opt -for-pack Ocamlbuild_pack -w +L -w +R -w +Z -I src -I +unix -safe-string -bin-annot -strict-sequence -c src/lexers.ml
- ocamlopt.opt -for-pack Ocamlbuild_pack -w +L -w +R -w +Z -I src -I +unix -safe-string -bin-annot -strict-sequence -c src/param_tags.ml
- ocamlopt.opt -for-pack Ocamlbuild_pack -w +L -w +R -w +Z -I src -I +unix -safe-string -bin-annot -strict-sequence -c src/command.ml
- ocamlopt.opt -for-pack Ocamlbuild_pack -w +L -w +R -w +Z -I src -I +unix -safe-string -bin-annot -strict-sequence -c src/ocamlbuild_config.ml
- ocamlopt.opt -for-pack Ocamlbuild_pack -w +L -w +R -w +Z -I src -I +unix -safe-string -bin-annot -strict-sequence -c src/ocamlbuild_where.ml
- ocamlopt.opt -for-pack Ocamlbuild_pack -w +L -w +R -w +Z -I src -I +unix -safe-string -bin-annot -strict-sequence -c src/slurp.ml
- ocamlopt.opt -for-pack Ocamlbuild_pack -w +L -w +R -w +Z -I src -I +unix -safe-string -bin-annot -strict-sequence -c src/options.ml
- ocamlopt.opt -for-pack Ocamlbuild_pack -w +L -w +R -w +Z -I src -I +unix -safe-string -bin-annot -strict-sequence -c src/pathname.ml
- ocamlopt.opt -for-pack Ocamlbuild_pack -w +L -w +R -w +Z -I src -I +unix -safe-string -bin-annot -strict-sequence -c src/configuration.ml
- ocamlopt.opt -for-pack Ocamlbuild_pack -w +L -w +R -w +Z -I src -I +unix -safe-string -bin-annot -strict-sequence -c src/flags.ml
- ocamlopt.opt -for-pack Ocamlbuild_pack -w +L -w +R -w +Z -I src -I +unix -safe-string -bin-annot -strict-sequence -c src/hygiene.ml
- ocamlopt.opt -for-pack Ocamlbuild_pack -w +L -w +R -w +Z -I src -I +unix -safe-string -bin-annot -strict-sequence -c src/digest_cache.ml
- ocamlopt.opt -for-pack Ocamlbuild_pack -w +L -w +R -w +Z -I src -I +unix -safe-string -bin-annot -strict-sequence -c src/resource.ml
- ocamlopt.opt -for-pack Ocamlbuild_pack -w +L -w +R -w +Z -I src -I +unix -safe-string -bin-annot -strict-sequence -c src/rule.ml
- ocamlopt.opt -for-pack Ocamlbuild_pack -w +L -w +R -w +Z -I src -I +unix -safe-string -bin-annot -strict-sequence -c src/solver.ml
- ocamlopt.opt -for-pack Ocamlbuild_pack -w +L -w +R -w +Z -I src -I +unix -safe-string -bin-annot -strict-sequence -c src/report.ml
- ocamlopt.opt -for-pack Ocamlbuild_pack -w +L -w +R -w +Z -I src -I +unix -safe-string -bin-annot -strict-sequence -c src/tools.ml
- ocamlopt.opt -for-pack Ocamlbuild_pack -w +L -w +R -w +Z -I src -I +unix -safe-string -bin-annot -strict-sequence -c src/fda.ml
- ocamlopt.opt -for-pack Ocamlbuild_pack -w +L -w +R -w +Z -I src -I +unix -safe-string -bin-annot -strict-sequence -c src/findlib.ml
- ocamlopt.opt -for-pack Ocamlbuild_pack -w +L -w +R -w +Z -I src -I +unix -safe-string -bin-annot -strict-sequence -c src/ocaml_arch.ml
- ocamlopt.opt -for-pack Ocamlbuild_pack -w +L -w +R -w +Z -I src -I +unix -safe-string -bin-annot -strict-sequence -c src/ocaml_utils.ml
- ocamlopt.opt -for-pack Ocamlbuild_pack -w +L -w +R -w +Z -I src -I +unix -safe-string -bin-annot -strict-sequence -c src/ocaml_dependencies.ml
- ocamlopt.opt -for-pack Ocamlbuild_pack -w +L -w +R -w +Z -I src -I +unix -safe-string -bin-annot -strict-sequence -c src/ocaml_compiler.ml
- ocamlopt.opt -for-pack Ocamlbuild_pack -w +L -w +R -w +Z -I src -I +unix -safe-string -bin-annot -strict-sequence -c src/ocaml_tools.ml
- ocamlopt.opt -for-pack Ocamlbuild_pack -w +L -w +R -w +Z -I src -I +unix -safe-string -bin-annot -strict-sequence -c src/ocaml_specific.ml
- ocamlopt.opt -for-pack Ocamlbuild_pack -w +L -w +R -w +Z -I src -I +unix -safe-string -bin-annot -strict-sequence -c src/exit_codes.ml
- ocamlopt.opt -for-pack Ocamlbuild_pack -w +L -w +R -w +Z -I src -I +unix -safe-string -bin-annot -strict-sequence -c src/plugin.ml
- ocamlopt.opt -for-pack Ocamlbuild_pack -w +L -w +R -w +Z -I src -I +unix -safe-string -bin-annot -strict-sequence -c src/hooks.ml
- ocamlopt.opt -for-pack Ocamlbuild_pack -w +L -w +R -w +Z -I src -I +unix -safe-string -bin-annot -strict-sequence -c src/main.ml
- mkdir -p tmp
- ocamlopt.opt -pack src/const.cmx src/loc.cmx src/discard_printf.cmx src/signatures.cmi src/my_std.cmx src/my_unix.cmx src/tags.cmx src/display.cmx src/log.cmx src/shell.cmx src/bool.cmx src/glob_ast.cmx src/glob_lexer.cmx src/glob.cmx src/lexers.cmx src/param_tags.cmx src/command.cmx src/ocamlbuild_config.cmx src/ocamlbuild_where.cmx src/slurp.cmx src/options.cmx src/pathname.cmx src/configuration.cmx src/flags.cmx src/hygiene.cmx src/digest_cache.cmx src/resource.cmx src/rule.cmx src/solver.cmx src/report.cmx src/tools.cmx src/fda.cmx src/findlib.cmx src/ocaml_arch.cmx src/ocaml_utils.cmx src/ocaml_dependencies.cmx src/ocaml_compiler.cmx src/ocaml_tools.cmx src/ocaml_specific.cmx src/exit_codes.cmx src/plugin.cmx src/hooks.cmx src/main.cmx -o tmp/ocamlbuild_pack.cmx
- mv tmp/ocamlbuild_pack.cmx src/ocamlbuild_pack.cmx
- mv tmp/ocamlbuild_pack.o src/ocamlbuild_pack.o
- ocamlopt.opt -for-pack Ocamlbuild_pack -w +L -w +R -w +Z -I src -I +unix -safe-string -bin-annot -strict-sequence -c src/ocamlbuild_plugin.ml
- ocamlopt.opt -for-pack Ocamlbuild_pack -w +L -w +R -w +Z -I src -I +unix -safe-string -bin-annot -strict-sequence -c src/ocamlbuild_executor.ml
- ocamlopt.opt -for-pack Ocamlbuild_pack -w +L -w +R -w +Z -I src -I +unix -safe-string -bin-annot -strict-sequence -c src/ocamlbuild_unix_plugin.ml
- ocamlopt.opt -for-pack Ocamlbuild_pack -w +L -w +R -w +Z -I src -I +unix -safe-string -bin-annot -strict-sequence -c src/ocamlbuild.ml
- ocamlopt.opt -I +unix -I src -o ocamlbuild.native unix.cmxa src/ocamlbuild_pack.cmx src/ocamlbuild_plugin.cmx src/ocamlbuild_executor.cmx src/ocamlbuild_unix_plugin.cmx src/ocamlbuild.cmx
- ocamlopt.opt -a -o src/ocamlbuildlib.cmxa src/ocamlbuild_pack.cmx src/ocamlbuild_plugin.cmx src/ocamlbuild_executor.cmx src/ocamlbuild_unix_plugin.cmx
- ocamlc.opt src/ocamlbuild_pack.cmo -I src man/options_man.ml -o man/options_man.byte
- ./man/options_man.byte > man/ocamlbuild.options.1
- cat man/ocamlbuild.header.1 man/ocamlbuild.options.1 man/ocamlbuild.footer.1 > man/ocamlbuild.1
- make ocamlbuild.install
- make[1]: Entering directory '/home/opam/.opam/5.0/.opam-switch/build/ocamlbuild.0.14.1'
- rm -f ocamlbuild.install
- touch ocamlbuild.install
- make install-bin-opam
- make[2]: Entering directory '/home/opam/.opam/5.0/.opam-switch/build/ocamlbuild.0.14.1'
- echo 'bin: [' >> ocamlbuild.install
- echo '  "ocamlbuild.byte" {"ocamlbuild.byte"}' >> ocamlbuild.install
- echo '  "ocamlbuild.native" {"ocamlbuild.native"}' >> ocamlbuild.install
- echo '  "ocamlbuild.native" {"ocamlbuild"}' >> ocamlbuild.install
- echo ']' >> ocamlbuild.install
- echo >> ocamlbuild.install
- make[2]: Leaving directory '/home/opam/.opam/5.0/.opam-switch/build/ocamlbuild.0.14.1'
- make install-lib-opam
- make[2]: Entering directory '/home/opam/.opam/5.0/.opam-switch/build/ocamlbuild.0.14.1'
- echo 'lib: [' >> ocamlbuild.install
- make install-lib-basics-opam
- make[3]: Entering directory '/home/opam/.opam/5.0/.opam-switch/build/ocamlbuild.0.14.1'
- echo '  "ocamlbuild.opam" {"opam"}' >> ocamlbuild.install
- echo '  "META"' >> ocamlbuild.install
- for lib in src/signatures.mli src/signatures.cmi src/signatures.cmti; do \
-   echo "  \"$lib\" {\"$(basename $lib)\"}" >> ocamlbuild.install; \
- done
- make[3]: Leaving directory '/home/opam/.opam/5.0/.opam-switch/build/ocamlbuild.0.14.1'
- make install-lib-byte-opam
- make[3]: Entering directory '/home/opam/.opam/5.0/.opam-switch/build/ocamlbuild.0.14.1'
- for lib in src/ocamlbuildlib.cma src/ocamlbuild.cmo src/ocamlbuild_pack.cmi src/ocamlbuild_plugin.cmi src/ocamlbuild_executor.cmi src/ocamlbuild_unix_plugin.cmi; do \
-   echo "  \"$lib\" {\"$(basename $lib)\"}" >> ocamlbuild.install; \
- done
- make[3]: Leaving directory '/home/opam/.opam/5.0/.opam-switch/build/ocamlbuild.0.14.1'
- make install-lib-native-opam
- make[3]: Entering directory '/home/opam/.opam/5.0/.opam-switch/build/ocamlbuild.0.14.1'
- for lib in src/ocamlbuildlib.cmxa src/ocamlbuildlib.a src/ocamlbuild.cmx src/ocamlbuild.o src/ocamlbuild_pack.cmx src/ocamlbuild_plugin.cmx src/ocamlbuild_executor.cmx src/ocamlbuild_unix_plugin.cmx src/ocamlbuild_plugin.o src/ocamlbuild_executor.o src/ocamlbuild_unix_plugin.o; do \
-   echo "  \"$lib\" {\"$(basename $lib)\"}" >> ocamlbuild.install; \
- done
- make[3]: Leaving directory '/home/opam/.opam/5.0/.opam-switch/build/ocamlbuild.0.14.1'
- echo ']' >> ocamlbuild.install
- echo >> ocamlbuild.install
- make[2]: Leaving directory '/home/opam/.opam/5.0/.opam-switch/build/ocamlbuild.0.14.1'
- make install-man-opam
- make[2]: Entering directory '/home/opam/.opam/5.0/.opam-switch/build/ocamlbuild.0.14.1'
- echo 'man: [' >> ocamlbuild.install
- echo '  "man/ocamlbuild.1" {"man1/ocamlbuild.1"}' >> ocamlbuild.install
- echo ']' >> ocamlbuild.install
- echo >> ocamlbuild.install
- make[2]: Leaving directory '/home/opam/.opam/5.0/.opam-switch/build/ocamlbuild.0.14.1'
- make install-doc-opam
- make[2]: Entering directory '/home/opam/.opam/5.0/.opam-switch/build/ocamlbuild.0.14.1'
- echo 'doc: [' >> ocamlbuild.install
- echo '  "LICENSE"' >> ocamlbuild.install
- echo '  "Changes"' >> ocamlbuild.install
- echo '  "Readme.md"' >> ocamlbuild.install
- echo ']' >> ocamlbuild.install
- make[2]: Leaving directory '/home/opam/.opam/5.0/.opam-switch/build/ocamlbuild.0.14.1'
- make[1]: Leaving directory '/home/opam/.opam/5.0/.opam-switch/build/ocamlbuild.0.14.1'
-> compiled  ocamlbuild.0.14.1
Processing 93/225: [dune: ocaml bootstrap.ml]
-> installed ocamlbuild.0.14.1
Processing 94/225: [dune: ocaml bootstrap.ml]
Processing 95/225: [dune: ocaml bootstrap.ml] [topkg: ocaml build]
Processing 96/225: [dune: ocaml bootstrap.ml] [topkg: ocaml build] [uchar: ocaml]
+ /home/opam/.opam/opam-init/hooks/sandbox.sh "build" "ocaml" "pkg/git.ml" (CWD=/home/opam/.opam/5.0/.opam-switch/build/uchar.0.0.2)
+ /home/opam/.opam/opam-init/hooks/sandbox.sh "build" "ocaml" "pkg/build.ml" "native=true" "native-dynlink=true" (CWD=/home/opam/.opam/5.0/.opam-switch/build/uchar.0.0.2)
-> compiled  uchar.0.0.2
Processing 96/225: [dune: ocaml bootstrap.ml] [topkg: ocaml build]
-> installed uchar.0.0.2
Processing 97/225: [dune: ocaml bootstrap.ml] [topkg: ocaml build]
+ /home/opam/.opam/opam-init/hooks/sandbox.sh "build" "ocaml" "pkg/pkg.ml" "build" "--pkg-name" "topkg" "--dev-pkg" "false" (CWD=/home/opam/.opam/5.0/.opam-switch/build/topkg.1.0.5)
- ocamlfind ocamldep -modules src/topkg.ml > src/topkg.ml.depends
- ocamlfind ocamldep -modules src/topkg.mli > src/topkg.mli.depends
- ocamlfind ocamlc -c -g -bin-annot -safe-string -I src -I test -I src-care -I src-bin -o src/topkg.cmi src/topkg.mli
- ocamlfind ocamldep -modules src/topkg_build.ml > src/topkg_build.ml.depends
- ocamlfind ocamldep -modules src/topkg_build.mli > src/topkg_build.mli.depends
- ocamlfind ocamldep -modules src/topkg_cmd.mli > src/topkg_cmd.mli.depends
- ocamlfind ocamldep -modules src/topkg_fpath.mli > src/topkg_fpath.mli.depends
- ocamlfind ocamlc -c -g -bin-annot -safe-string -I src -I test -I src-care -I src-bin -o src/topkg_fpath.cmi src/topkg_fpath.mli
- ocamlfind ocamldep -modules src/topkg_codec.mli > src/topkg_codec.mli.depends
- ocamlfind ocamlc -c -g -bin-annot -safe-string -I src -I test -I src-care -I src-bin -o src/topkg_cmd.cmi src/topkg_cmd.mli
- ocamlfind ocamldep -modules src/topkg_result.mli > src/topkg_result.mli.depends
- ocamlfind ocamlc -c -g -bin-annot -safe-string -I src -I test -I src-care -I src-bin -o src/topkg_result.cmi src/topkg_result.mli
- ocamlfind ocamldep -modules src/topkg_conf.mli > src/topkg_conf.mli.depends
- ocamlfind ocamlc -c -g -bin-annot -safe-string -I src -I test -I src-care -I src-bin -o src/topkg_codec.cmi src/topkg_codec.mli
- ocamlfind ocamlc -c -g -bin-annot -safe-string -I src -I test -I src-care -I src-bin -o src/topkg_conf.cmi src/topkg_conf.mli
- ocamlfind ocamlc -c -g -bin-annot -safe-string -I src -I test -I src-care -I src-bin -o src/topkg_build.cmi src/topkg_build.mli
- ocamlfind ocamldep -modules src/topkg_cmd.ml > src/topkg_cmd.ml.depends
- ocamlfind ocamldep -modules src/topkg_fpath.ml > src/topkg_fpath.ml.depends
- ocamlfind ocamldep -modules src/topkg_string.ml > src/topkg_string.ml.depends
- ocamlfind ocamldep -modules src/topkg_string.mli > src/topkg_string.mli.depends
- ocamlfind ocamlc -c -g -bin-annot -safe-string -I src -I test -I src-care -I src-bin -o src/topkg_string.cmi src/topkg_string.mli
- ocamlfind ocamlopt -c -g -bin-annot -safe-string -I src -I test -I src-care -I src-bin -o src/topkg_string.cmx src/topkg_string.ml
- ocamlfind ocamlopt -c -g -bin-annot -safe-string -I src -I test -I src-care -I src-bin -o src/topkg_fpath.cmx src/topkg_fpath.ml
- ocamlfind ocamldep -modules src/topkg_codec.ml > src/topkg_codec.ml.depends
- ocamlfind ocamlopt -c -g -bin-annot -safe-string -I src -I test -I src-care -I src-bin -o src/topkg_cmd.cmx src/topkg_cmd.ml
- ocamlfind ocamldep -modules src/topkg_os.ml > src/topkg_os.ml.depends
- ocamlfind ocamldep -modules src/topkg_os.mli > src/topkg_os.mli.depends
- ocamlfind ocamlc -c -g -bin-annot -safe-string -I src -I test -I src-care -I src-bin -o src/topkg_os.cmi src/topkg_os.mli
- ocamlfind ocamldep -modules src/topkg_log.ml > src/topkg_log.ml.depends
- ocamlfind ocamldep -modules src/topkg_log.mli > src/topkg_log.mli.depends
- ocamlfind ocamlc -c -g -bin-annot -safe-string -I src -I test -I src-care -I src-bin -o src/topkg_log.cmi src/topkg_log.mli
- ocamlfind ocamldep -modules src/topkg_result.ml > src/topkg_result.ml.depends
- ocamlfind ocamlopt -c -g -bin-annot -safe-string -I src -I test -I src-care -I src-bin -o src/topkg_result.cmx src/topkg_result.ml
- ocamlfind ocamlopt -c -g -bin-annot -safe-string -I src -I test -I src-care -I src-bin -o src/topkg_log.cmx src/topkg_log.ml
- ocamlfind ocamlopt -c -g -bin-annot -safe-string -I src -I test -I src-care -I src-bin -o src/topkg_os.cmx src/topkg_os.ml
- ocamlfind ocamldep -modules src/topkg_conf.ml > src/topkg_conf.ml.depends
- ocamlfind ocamlopt -c -g -bin-annot -safe-string -I src -I test -I src-care -I src-bin -o src/topkg_codec.cmx src/topkg_codec.ml
- ocamlfind ocamldep -modules src/topkg_vcs.ml > src/topkg_vcs.ml.depends
- ocamlfind ocamldep -modules src/topkg_vcs.mli > src/topkg_vcs.mli.depends
- ocamlfind ocamlc -c -g -bin-annot -safe-string -I src -I test -I src-care -I src-bin -o src/topkg_vcs.cmi src/topkg_vcs.mli
- ocamlfind ocamlopt -c -g -bin-annot -safe-string -I src -I test -I src-care -I src-bin -o src/topkg_vcs.cmx src/topkg_vcs.ml
- ocamlfind ocamlopt -c -g -bin-annot -safe-string -I src -I test -I src-care -I src-bin -o src/topkg_conf.cmx src/topkg_conf.ml
- ocamlfind ocamldep -modules src/topkg_distrib.ml > src/topkg_distrib.ml.depends
- ocamlfind ocamldep -modules src/topkg_distrib.mli > src/topkg_distrib.mli.depends
- ocamlfind ocamlc -c -g -bin-annot -safe-string -I src -I test -I src-care -I src-bin -o src/topkg_distrib.cmi src/topkg_distrib.mli
- ocamlfind ocamldep -modules src/topkg_opam.ml > src/topkg_opam.ml.depends
- ocamlfind ocamldep -modules src/topkg_opam.mli > src/topkg_opam.mli.depends
- ocamlfind ocamlc -c -g -bin-annot -safe-string -I src -I test -I src-care -I src-bin -o src/topkg_opam.cmi src/topkg_opam.mli
- ocamlfind ocamlopt -c -g -bin-annot -safe-string -I src -I test -I src-care -I src-bin -o src/topkg_opam.cmx src/topkg_opam.ml
- ocamlfind ocamldep -modules src/topkg_fexts.ml > src/topkg_fexts.ml.depends
- ocamlfind ocamldep -modules src/topkg_fexts.mli > src/topkg_fexts.mli.depends
- ocamlfind ocamlc -c -g -bin-annot -safe-string -I src -I test -I src-care -I src-bin -o src/topkg_fexts.cmi src/topkg_fexts.mli
- ocamlfind ocamldep -modules src/topkg_install.ml > src/topkg_install.ml.depends
- ocamlfind ocamldep -modules src/topkg_install.mli > src/topkg_install.mli.depends
- ocamlfind ocamldep -modules src/topkg_test.mli > src/topkg_test.mli.depends
- ocamlfind ocamlc -c -g -bin-annot -safe-string -I src -I test -I src-care -I src-bin -o src/topkg_test.cmi src/topkg_test.mli
- ocamlfind ocamlc -c -g -bin-annot -safe-string -I src -I test -I src-care -I src-bin -o src/topkg_install.cmi src/topkg_install.mli
- ocamlfind ocamlopt -c -g -bin-annot -safe-string -I src -I test -I src-care -I src-bin -o src/topkg_fexts.cmx src/topkg_fexts.ml
- ocamlfind ocamldep -modules src/topkg_test.ml > src/topkg_test.ml.depends
- ocamlfind ocamlopt -c -g -bin-annot -safe-string -I src -I test -I src-care -I src-bin -o src/topkg_test.cmx src/topkg_test.ml
- ocamlfind ocamldep -modules src/topkg_ipc.ml > src/topkg_ipc.ml.depends
- ocamlfind ocamldep -modules src/topkg_ipc.mli > src/topkg_ipc.mli.depends
- ocamlfind ocamldep -modules src/topkg_pkg.mli > src/topkg_pkg.mli.depends
- ocamlfind ocamldep -modules src/topkg_publish.mli > src/topkg_publish.mli.depends
- ocamlfind ocamlc -c -g -bin-annot -safe-string -I src -I test -I src-care -I src-bin -o src/topkg_publish.cmi src/topkg_publish.mli
- ocamlfind ocamlc -c -g -bin-annot -safe-string -I src -I test -I src-care -I src-bin -o src/topkg_pkg.cmi src/topkg_pkg.mli
- ocamlfind ocamlc -c -g -bin-annot -safe-string -I src -I test -I src-care -I src-bin -o src/topkg_ipc.cmi src/topkg_ipc.mli
- ocamlfind ocamldep -modules src/topkg_pkg.ml > src/topkg_pkg.ml.depends
- ocamlfind ocamlopt -c -g -bin-annot -safe-string -I src -I test -I src-care -I src-bin -o src/topkg_build.cmx src/topkg_build.ml
- ocamlfind ocamlopt -c -g -bin-annot -safe-string -I src -I test -I src-care -I src-bin -o src/topkg_distrib.cmx src/topkg_distrib.ml
- ocamlfind ocamlopt -c -g -bin-annot -safe-string -I src -I test -I src-care -I src-bin -o src/topkg_install.cmx src/topkg_install.ml
- ocamlfind ocamldep -modules src/topkg_publish.ml > src/topkg_publish.ml.depends
- ocamlfind ocamlopt -c -g -bin-annot -safe-string -I src -I test -I src-care -I src-bin -o src/topkg_publish.cmx src/topkg_publish.ml
- ocamlfind ocamlopt -c -g -bin-annot -safe-string -I src -I test -I src-care -I src-bin -o src/topkg_pkg.cmx src/topkg_pkg.ml
- ocamlfind ocamldep -modules src/topkg_main.ml > src/topkg_main.ml.depends
- ocamlfind ocamldep -modules src/topkg_main.mli > src/topkg_main.mli.depends
- ocamlfind ocamlc -c -g -bin-annot -safe-string -I src -I test -I src-care -I src-bin -o src/topkg_main.cmi src/topkg_main.mli
- ocamlfind ocamlopt -c -g -bin-annot -safe-string -I src -I test -I src-care -I src-bin -o src/topkg_ipc.cmx src/topkg_ipc.ml
- ocamlfind ocamlopt -c -g -bin-annot -safe-string -I src -I test -I src-care -I src-bin -o src/topkg_main.cmx src/topkg_main.ml
- ocamlfind ocamlopt -c -g -bin-annot -safe-string -I src -I test -I src-care -I src-bin -o src/topkg.cmx src/topkg.ml
- ocamlfind ocamlopt -a -I src src/topkg_string.cmx src/topkg_fpath.cmx src/topkg_cmd.cmx src/topkg_result.cmx src/topkg_log.cmx src/topkg_os.cmx src/topkg_codec.cmx src/topkg_vcs.cmx src/topkg_conf.cmx src/topkg_build.cmx src/topkg_opam.cmx src/topkg_distrib.cmx src/topkg_fexts.cmx src/topkg_test.cmx src/topkg_install.cmx src/topkg_publish.cmx src/topkg_pkg.cmx src/topkg_ipc.cmx src/topkg_main.cmx src/topkg.cmx -o src/topkg.cmxa
- ocamlfind ocamlopt -shared -linkall -I src src/topkg.cmxa -o src/topkg.cmxs
- ocamlfind ocamlc -c -g -bin-annot -safe-string -I src -I test -I src-care -I src-bin -o src/topkg.cmo src/topkg.ml
- ocamlfind ocamlc -c -g -bin-annot -safe-string -I src -I test -I src-care -I src-bin -o src/topkg_build.cmo src/topkg_build.ml
- ocamlfind ocamlc -c -g -bin-annot -safe-string -I src -I test -I src-care -I src-bin -o src/topkg_cmd.cmo src/topkg_cmd.ml
- ocamlfind ocamlc -c -g -bin-annot -safe-string -I src -I test -I src-care -I src-bin -o src/topkg_codec.cmo src/topkg_codec.ml
- ocamlfind ocamlc -c -g -bin-annot -safe-string -I src -I test -I src-care -I src-bin -o src/topkg_conf.cmo src/topkg_conf.ml
- ocamlfind ocamlc -c -g -bin-annot -safe-string -I src -I test -I src-care -I src-bin -o src/topkg_distrib.cmo src/topkg_distrib.ml
- ocamlfind ocamlc -c -g -bin-annot -safe-string -I src -I test -I src-care -I src-bin -o src/topkg_fexts.cmo src/topkg_fexts.ml
- ocamlfind ocamlc -c -g -bin-annot -safe-string -I src -I test -I src-care -I src-bin -o src/topkg_fpath.cmo src/topkg_fpath.ml
- ocamlfind ocamlc -c -g -bin-annot -safe-string -I src -I test -I src-care -I src-bin -o src/topkg_install.cmo src/topkg_install.ml
- ocamlfind ocamlc -c -g -bin-annot -safe-string -I src -I test -I src-care -I src-bin -o src/topkg_ipc.cmo src/topkg_ipc.ml
- ocamlfind ocamlc -c -g -bin-annot -safe-string -I src -I test -I src-care -I src-bin -o src/topkg_log.cmo src/topkg_log.ml
- ocamlfind ocamlc -c -g -bin-annot -safe-string -I src -I test -I src-care -I src-bin -o src/topkg_main.cmo src/topkg_main.ml
- ocamlfind ocamlc -c -g -bin-annot -safe-string -I src -I test -I src-care -I src-bin -o src/topkg_opam.cmo src/topkg_opam.ml
- ocamlfind ocamlc -c -g -bin-annot -safe-string -I src -I test -I src-care -I src-bin -o src/topkg_os.cmo src/topkg_os.ml
- ocamlfind ocamlc -c -g -bin-annot -safe-string -I src -I test -I src-care -I src-bin -o src/topkg_pkg.cmo src/topkg_pkg.ml
- ocamlfind ocamlc -c -g -bin-annot -safe-string -I src -I test -I src-care -I src-bin -o src/topkg_publish.cmo src/topkg_publish.ml
- ocamlfind ocamlc -c -g -bin-annot -safe-string -I src -I test -I src-care -I src-bin -o src/topkg_result.cmo src/topkg_result.ml
- ocamlfind ocamlc -c -g -bin-annot -safe-string -I src -I test -I src-care -I src-bin -o src/topkg_string.cmo src/topkg_string.ml
- ocamlfind ocamlc -c -g -bin-annot -safe-string -I src -I test -I src-care -I src-bin -o src/topkg_test.cmo src/topkg_test.ml
- ocamlfind ocamlc -c -g -bin-annot -safe-string -I src -I test -I src-care -I src-bin -o src/topkg_vcs.cmo src/topkg_vcs.ml
- ocamlfind ocamlc -a -I src src/topkg_string.cmo src/topkg_fpath.cmo src/topkg_cmd.cmo src/topkg_result.cmo src/topkg_log.cmo src/topkg_os.cmo src/topkg_codec.cmo src/topkg_vcs.cmo src/topkg_conf.cmo src/topkg_build.cmo src/topkg_opam.cmo src/topkg_distrib.cmo src/topkg_fexts.cmo src/topkg_test.cmo src/topkg_install.cmo src/topkg_publish.cmo src/topkg_pkg.cmo src/topkg_ipc.cmo src/topkg_main.cmo src/topkg.cmo -o src/topkg.cma
- # Parallel statistics: { count(total): 2(84), max: 20, min: 2, average(total): 11.000(1.238) }
-> compiled  topkg.1.0.5
Processing 97/225: [dune: ocaml bootstrap.ml]
-> installed topkg.1.0.5
Processing 98/225: [dune: ocaml bootstrap.ml]
Processing 99/225: [astring: ocaml build] [dune: ocaml bootstrap.ml]
Processing 100/225: [astring: ocaml build] [dune: ocaml bootstrap.ml] [fmt: ocaml build]
Processing 101/225: [astring: ocaml build] [dune: ocaml bootstrap.ml] [fmt: ocaml build] [mtime: ocaml build]
Processing 102/225: [astring: ocaml build] [dune: ocaml bootstrap.ml] [fmt: ocaml build] [mtime: ocaml build] [ptime: ocaml build]
Processing 103/225: [astring: ocaml build] [dune: ocaml bootstrap.ml] [fmt: ocaml build] [mtime: ocaml build] [ptime: ocaml build] [rresult: ocaml build]
Processing 104/225: [astring: ocaml build] [dune: ocaml bootstrap.ml] [fmt: ocaml build] [mtime: ocaml build] [ptime: ocaml build] [rresult: ocaml build] [uutf: ocaml build]
Processing 105/225: [astring: ocaml build] [dune: ocaml bootstrap.ml] [fmt: ocaml build] [mtime: ocaml build] [ptime: ocaml build] [rresult: ocaml build] [uutf: ocaml build] [xmlm: ocaml build]
+ /home/opam/.opam/opam-init/hooks/sandbox.sh "build" "ocaml" "pkg/pkg.ml" "build" "--dev-pkg" "false" (CWD=/home/opam/.opam/5.0/.opam-switch/build/rresult.0.7.0)
- ocamlfind ocamldep -modules src/rresult.ml > src/rresult.ml.depends
- ocamlfind ocamldep -modules src/rresult.mli > src/rresult.mli.depends
- ocamlfind ocamlc -c -g -bin-annot -safe-string -I src -I test -o src/rresult.cmi src/rresult.mli
- ocamlfind ocamlopt -c -g -bin-annot -safe-string -I src -I test -o src/rresult.cmx src/rresult.ml
- ocamlfind ocamlopt -a -I src src/rresult.cmx -o src/rresult.cmxa
- ocamlfind ocamlopt -shared -linkall -I src src/rresult.cmxa -o src/rresult.cmxs
- ocamlfind ocamlc -c -g -bin-annot -safe-string -I src -I test -o src/rresult.cmo src/rresult.ml
- ocamlfind ocamlc -a -I src src/rresult.cmo -o src/rresult.cma
- ocamlfind ocamldep -package compiler-libs.toplevel -modules src/rresult_top.ml > src/rresult_top.ml.depends
- ocamlfind ocamlc -c -g -bin-annot -safe-string -package compiler-libs.toplevel -I src -I test -o src/rresult_top.cmo src/rresult_top.ml
- ocamlfind ocamlopt -c -g -bin-annot -safe-string -package compiler-libs.toplevel -I src -I test -o src/rresult_top.cmx src/rresult_top.ml
- ocamlfind ocamlopt -a -package compiler-libs.toplevel -I src src/rresult_top.cmx -o src/rresult_top.cmxa
- ocamlfind ocamlopt -shared -linkall -package compiler-libs.toplevel -I src src/rresult_top.cmxa -o src/rresult_top.cmxs
- ocamlfind ocamlc -a -package compiler-libs.toplevel -I src src/rresult_top.cmo -o src/rresult_top.cma
- # No parallelism done
-> compiled  rresult.0.7.0
Processing 105/225: [astring: ocaml build] [dune: ocaml bootstrap.ml] [fmt: ocaml build] [mtime: ocaml build] [ptime: ocaml build] [uutf: ocaml build] [xmlm: ocaml build]
-> installed rresult.0.7.0
Processing 106/225: [astring: ocaml build] [dune: ocaml bootstrap.ml] [fmt: ocaml build] [mtime: ocaml build] [ptime: ocaml build] [uutf: ocaml build] [xmlm: ocaml build]
+ /home/opam/.opam/opam-init/hooks/sandbox.sh "build" "ocaml" "pkg/pkg.ml" "build" "--dev-pkg" "false" (CWD=/home/opam/.opam/5.0/.opam-switch/build/mtime.1.4.0)
- ocamlfind ocamlopt unix.cmxa -I /home/opam/.opam/5.0/lib/ocamlbuild /home/opam/.opam/5.0/lib/ocamlbuild/ocamlbuildlib.cmxa -linkpkg myocamlbuild.ml /home/opam/.opam/5.0/lib/ocamlbuild/ocamlbuild.cmx -o myocamlbuild
- ocamlfind ocamldep -modules src/mtime.ml > src/mtime.ml.depends
- ocamlfind ocamldep -modules src/mtime.mli > src/mtime.mli.depends
- ocamlfind ocamlc -c -g -bin-annot -safe-string -I src -o src/mtime.cmi src/mtime.mli
- ocamlfind ocamlopt -c -g -bin-annot -safe-string -I src -o src/mtime.cmx src/mtime.ml
- ocamlfind ocamlopt -a -I src src/mtime.cmx -o src/mtime.cmxa
- ocamlfind ocamlopt -shared -linkall -I src src/mtime.cmxa -o src/mtime.cmxs
- ocamlfind ocamlc -c -g -bin-annot -safe-string -I src -o src/mtime.cmo src/mtime.ml
- ocamlfind ocamlc -a -I src src/mtime.cmo -o src/mtime.cma
- ocamlfind ocamldep -package compiler-libs.toplevel -modules src/mtime_top.ml > src/mtime_top.ml.depends
- ocamlfind ocamlc -c -g -bin-annot -safe-string -package compiler-libs.toplevel -I src -o src/mtime_top.cmo src/mtime_top.ml
- ocamlfind ocamlopt -c -g -bin-annot -safe-string -package compiler-libs.toplevel -I src -o src/mtime_top.cmx src/mtime_top.ml
- ocamlfind ocamlopt -a -package compiler-libs.toplevel -I src src/mtime_top.cmx -o src/mtime_top.cmxa
- ocamlfind ocamlopt -shared -linkall -package compiler-libs.toplevel -I src src/mtime_top.cmxa -o src/mtime_top.cmxs
- ocamlfind ocamlc -a -package compiler-libs.toplevel -I src src/mtime_top.cmo -o src/mtime_top.cma
- ocamlfind ocamldep -modules src/mtime_clock.mli > src/mtime_clock.mli.depends
- ocamlfind ocamlc -c -g -bin-annot -safe-string -I src -o src/mtime_clock.cmi src/mtime_clock.mli
- ocamlfind ocamlc -g -c src-clock/mtime_clock_stubs.c
- mv mtime_clock_stubs.o src-clock/mtime_clock_stubs.o
- ocamlfind ocamlmklib -o src-clock/mtime_clock_stubs -g src-clock/mtime_clock_stubs.o
- ocamlfind ocamldep -modules src-clock/mtime_clock.ml > src-clock/mtime_clock.ml.depends
- ocamlfind ocamldep -modules src-clock/mtime_clock.mli > src-clock/mtime_clock.mli.depends
- ocamlfind ocamlc -c -g -bin-annot -safe-string -I src-clock -I src -o src-clock/mtime_clock.cmi src-clock/mtime_clock.mli
- ocamlfind ocamlopt -c -g -bin-annot -safe-string -I src-clock -I src -o src-clock/mtime_clock.cmx src-clock/mtime_clock.ml
- + ocamlfind ocamlopt -c -g -bin-annot -safe-string -I src-clock -I src -o src-clock/mtime_clock.cmx src-clock/mtime_clock.ml
- findlib: [WARNING] Interface mtime_clock.cmi occurs in several directories: src, src-clock
- ocamlfind ocamlopt -a -cclib -lmtime_clock_stubs -cclib -lrt -I src-clock src-clock/mtime_clock.cmx -o src-clock/mtime_clock.cmxa
- ocamlfind ocamlopt -shared -linkall src-clock/libmtime_clock_stubs.a -I src-clock src-clock/mtime_clock.cmxa -o src-clock/mtime_clock.cmxs
- ocamlfind ocamlc -c -g -bin-annot -safe-string -I src-clock -I src -o src-clock/mtime_clock.cmo src-clock/mtime_clock.ml
- + ocamlfind ocamlc -c -g -bin-annot -safe-string -I src-clock -I src -o src-clock/mtime_clock.cmo src-clock/mtime_clock.ml
- findlib: [WARNING] Interface mtime_clock.cmi occurs in several directories: src, src-clock
- ocamlfind ocamlc -a -dllib -lmtime_clock_stubs -cclib -lrt -cclib -lmtime_clock_stubs -cclib -lrt -I src-clock src-clock/mtime_clock.cmo -o src-clock/mtime_clock.cma
- # No parallelism done
-> compiled  mtime.1.4.0
Processing 106/225: [astring: ocaml build] [dune: ocaml bootstrap.ml] [fmt: ocaml build] [ptime: ocaml build] [uutf: ocaml build] [xmlm: ocaml build]
-> installed mtime.1.4.0
Processing 107/225: [astring: ocaml build] [dune: ocaml bootstrap.ml] [fmt: ocaml build] [ptime: ocaml build] [uutf: ocaml build] [xmlm: ocaml build]
+ /home/opam/.opam/opam-init/hooks/sandbox.sh "build" "ocaml" "pkg/pkg.ml" "build" "--dev-pkg" "false" "--with-cmdliner" "true" (CWD=/home/opam/.opam/5.0/.opam-switch/build/uutf.1.0.3)
- ocamlfind ocamldep -modules src/uutf.ml > src/uutf.ml.depends
- ocamlfind ocamldep -modules src/uutf.mli > src/uutf.mli.depends
- ocamlfind ocamlc -c -g -bin-annot -safe-string -I src -I test -o src/uutf.cmi src/uutf.mli
- ocamlfind ocamlopt -c -g -bin-annot -safe-string -I src -I test -o src/uutf.cmx src/uutf.ml
- ocamlfind ocamlopt -a -I src src/uutf.cmx -o src/uutf.cmxa
- ocamlfind ocamlopt -shared -linkall -I src src/uutf.cmxa -o src/uutf.cmxs
- ocamlfind ocamlc -c -g -bin-annot -safe-string -I src -I test -o src/uutf.cmo src/uutf.ml
- ocamlfind ocamlc -a -I src src/uutf.cmo -o src/uutf.cma
- ocamlfind ocamldep -package unix -package cmdliner -modules test/utftrip.ml > test/utftrip.ml.depends
- ocamlfind ocamlc -c -g -bin-annot -safe-string -package unix -package cmdliner -I test -I src -o test/utftrip.cmo test/utftrip.ml
- + ocamlfind ocamlc -c -g -bin-annot -safe-string -package unix -package cmdliner -I test -I src -o test/utftrip.cmo test/utftrip.ml
- File "test/utftrip.ml", line 385, characters 8-12:
- 385 |   Term.(pure do_cmd $ cmd $ file $ sin $ sout $ use_unix $ usize $
-               ^^^^
- Alert deprecated: Cmdliner.Term.pure
- Use Term.const instead.
- File "test/utftrip.ml", line 387, characters 2-11:
- 387 |   Term.info "utftrip" ~version:"v1.0.3" ~doc ~man
-         ^^^^^^^^^
- Alert deprecated: Cmdliner.Term.info
- Use Cmd.info instead.
- File "test/utftrip.ml", line 389, characters 15-24:
- 389 | let () = match Term.eval cmd with
-                      ^^^^^^^^^
- Alert deprecated: Cmdliner.Term.eval
- Use Cmd.v and one of Cmd.eval* instead.
- ocamlfind ocamlopt -c -g -bin-annot -safe-string -package unix -package cmdliner -I test -I src -o test/utftrip.cmx test/utftrip.ml
- + ocamlfind ocamlopt -c -g -bin-annot -safe-string -package unix -package cmdliner -I test -I src -o test/utftrip.cmx test/utftrip.ml
- File "test/utftrip.ml", line 385, characters 8-12:
- 385 |   Term.(pure do_cmd $ cmd $ file $ sin $ sout $ use_unix $ usize $
-               ^^^^
- Alert deprecated: Cmdliner.Term.pure
- Use Term.const instead.
- File "test/utftrip.ml", line 387, characters 2-11:
- 387 |   Term.info "utftrip" ~version:"v1.0.3" ~doc ~man
-         ^^^^^^^^^
- Alert deprecated: Cmdliner.Term.info
- Use Cmd.info instead.
- File "test/utftrip.ml", line 389, characters 15-24:
- 389 | let () = match Term.eval cmd with
-                      ^^^^^^^^^
- Alert deprecated: Cmdliner.Term.eval
- Use Cmd.v and one of Cmd.eval* instead.
- ocamlfind ocamlopt -linkpkg -g -package unix -package cmdliner -I src -I test src/uutf.cmx test/utftrip.cmx -o test/utftrip.native
- # No parallelism done
-> compiled  uutf.1.0.3
Processing 107/225: [astring: ocaml build] [dune: ocaml bootstrap.ml] [fmt: ocaml build] [ptime: ocaml build] [xmlm: ocaml build]
-> installed uutf.1.0.3
Processing 108/225: [astring: ocaml build] [dune: ocaml bootstrap.ml] [fmt: ocaml build] [ptime: ocaml build] [xmlm: ocaml build]
Processing 109/225: [astring: ocaml build] [dune: ocaml bootstrap.ml] [fmt: ocaml build] [jsonm: ocaml build] [ptime: ocaml build] [xmlm: ocaml build]
+ /home/opam/.opam/opam-init/hooks/sandbox.sh "build" "ocaml" "pkg/pkg.ml" "build" "--dev-pkg" "false" "--with-base-unix" "true" "--with-cmdliner" "true" (CWD=/home/opam/.opam/5.0/.opam-switch/build/fmt.0.9.0)
- ocamlfind ocamldep -modules src/fmt.ml > src/fmt.ml.depends
- ocamlfind ocamldep -modules src/fmt.mli > src/fmt.mli.depends
- ocamlfind ocamlc -c -g -bin-annot -safe-string -I src -I test -o src/fmt.cmi src/fmt.mli
- ocamlfind ocamlopt -c -g -bin-annot -safe-string -I src -I test -o src/fmt.cmx src/fmt.ml
- ocamlfind ocamlopt -a -I src src/fmt.cmx -o src/fmt.cmxa
- ocamlfind ocamlopt -shared -linkall -I src src/fmt.cmxa -o src/fmt.cmxs
- ocamlfind ocamlc -c -g -bin-annot -safe-string -I src -I test -o src/fmt.cmo src/fmt.ml
- ocamlfind ocamlc -a -I src src/fmt.cmo -o src/fmt.cma
- ocamlfind ocamldep -package unix -modules src/fmt_tty.ml > src/fmt_tty.ml.depends
- ocamlfind ocamldep -package unix -modules src/fmt_tty.mli > src/fmt_tty.mli.depends
- ocamlfind ocamlc -c -g -bin-annot -safe-string -package unix -I src -I test -o src/fmt_tty.cmi src/fmt_tty.mli
- ocamlfind ocamlopt -c -g -bin-annot -safe-string -package unix -I src -I test -o src/fmt_tty.cmx src/fmt_tty.ml
- + ocamlfind ocamlopt -c -g -bin-annot -safe-string -package unix -I src -I test -o src/fmt_tty.cmx src/fmt_tty.ml
- File "src/fmt_tty.ml", line 49, characters 12-20:
- 49 |         try is_infix "UTF-8" (String.uppercase_ascii (Sys.getenv var))
-                  ^^^^^^^^
- Warning 6 [labels-omitted]: label affix was omitted in the application of this function.
- ocamlfind ocamlopt -a -package unix -I src src/fmt_tty.cmx -o src/fmt_tty.cmxa
- ocamlfind ocamlopt -shared -linkall -package unix -I src src/fmt_tty.cmxa -o src/fmt_tty.cmxs
- ocamlfind ocamlc -c -g -bin-annot -safe-string -package unix -I src -I test -o src/fmt_tty.cmo src/fmt_tty.ml
- + ocamlfind ocamlc -c -g -bin-annot -safe-string -package unix -I src -I test -o src/fmt_tty.cmo src/fmt_tty.ml
- File "src/fmt_tty.ml", line 49, characters 12-20:
- 49 |         try is_infix "UTF-8" (String.uppercase_ascii (Sys.getenv var))
-                  ^^^^^^^^
- Warning 6 [labels-omitted]: label affix was omitted in the application of this function.
- ocamlfind ocamlc -a -package unix -I src src/fmt_tty.cmo -o src/fmt_tty.cma
- ocamlfind ocamldep -package cmdliner -modules src/fmt_cli.ml > src/fmt_cli.ml.depends
- ocamlfind ocamldep -package cmdliner -modules src/fmt_cli.mli > src/fmt_cli.mli.depends
- ocamlfind ocamlc -c -g -bin-annot -safe-string -package cmdliner -I src -I test -o src/fmt_cli.cmi src/fmt_cli.mli
- + ocamlfind ocamlc -c -g -bin-annot -safe-string -package cmdliner -I src -I test -o src/fmt_cli.cmi src/fmt_cli.mli
- File "src/fmt_cli.mli", line 10, characters 26-42:
- 10 | val style_renderer : ?env:Cmdliner.Arg.env -> ?docs:string -> unit ->
-                                ^^^^^^^^^^^^^^^^
- Alert deprecated: Cmdliner.Arg.env
- Use Cmd.Env.info instead.
- ocamlfind ocamlopt -c -g -bin-annot -safe-string -package cmdliner -I src -I test -o src/fmt_cli.cmx src/fmt_cli.ml
- ocamlfind ocamlopt -a -package cmdliner -I src src/fmt_cli.cmx -o src/fmt_cli.cmxa
- ocamlfind ocamlopt -shared -linkall -package cmdliner -I src src/fmt_cli.cmxa -o src/fmt_cli.cmxs
- ocamlfind ocamlc -c -g -bin-annot -safe-string -package cmdliner -I src -I test -o src/fmt_cli.cmo src/fmt_cli.ml
- ocamlfind ocamlc -a -package cmdliner -I src src/fmt_cli.cmo -o src/fmt_cli.cma
- ocamlfind ocamldep -package compiler-libs.toplevel -modules src/fmt_top.ml > src/fmt_top.ml.depends
- ocamlfind ocamlc -c -g -bin-annot -safe-string -package compiler-libs.toplevel -I src -I test -o src/fmt_top.cmo src/fmt_top.ml
- ocamlfind ocamlopt -c -g -bin-annot -safe-string -package compiler-libs.toplevel -I src -I test -o src/fmt_top.cmx src/fmt_top.ml
- ocamlfind ocamlopt -a -package compiler-libs.toplevel -I src src/fmt_top.cmx -o src/fmt_top.cmxa
- ocamlfind ocamlopt -shared -linkall -package compiler-libs.toplevel -I src src/fmt_top.cmxa -o src/fmt_top.cmxs
- ocamlfind ocamlc -a -package compiler-libs.toplevel -I src src/fmt_top.cmo -o src/fmt_top.cma
- # No parallelism done
-> compiled  fmt.0.9.0
Processing 109/225: [astring: ocaml build] [dune: ocaml bootstrap.ml] [jsonm: ocaml build] [ptime: ocaml build] [xmlm: ocaml build]
-> installed fmt.0.9.0
Processing 110/225: [astring: ocaml build] [dune: ocaml bootstrap.ml] [jsonm: ocaml build] [ptime: ocaml build] [xmlm: ocaml build]
+ /home/opam/.opam/opam-init/hooks/sandbox.sh "build" "ocaml" "pkg/pkg.ml" "build" "--dev-pkg" "false" (CWD=/home/opam/.opam/5.0/.opam-switch/build/xmlm.1.4.0)
- ocamlfind ocamldep -modules src/xmlm.ml > src/xmlm.ml.depends
- ocamlfind ocamldep -modules src/xmlm.mli > src/xmlm.mli.depends
- ocamlfind ocamlc -c -g -bin-annot -safe-string -I src -I test -o src/xmlm.cmi src/xmlm.mli
- ocamlfind ocamlopt -c -g -bin-annot -safe-string -I src -I test -o src/xmlm.cmx src/xmlm.ml
- ocamlfind ocamlopt -a -I src src/xmlm.cmx -o src/xmlm.cmxa
- ocamlfind ocamlopt -shared -linkall -I src src/xmlm.cmxa -o src/xmlm.cmxs
- ocamlfind ocamlc -c -g -bin-annot -safe-string -I src -I test -o src/xmlm.cmo src/xmlm.ml
- ocamlfind ocamlc -a -I src src/xmlm.cmo -o src/xmlm.cma
- ocamlfind ocamldep -modules test/xmltrip.ml > test/xmltrip.ml.depends
- ocamlfind ocamldep -modules test/xhtml.ml > test/xhtml.ml.depends
- ocamlfind ocamlc -c -g -bin-annot -safe-string -I test -I src -o test/xhtml.cmo test/xhtml.ml
- ocamlfind ocamlc -c -g -bin-annot -safe-string -I test -I src -o test/xmltrip.cmo test/xmltrip.ml
- ocamlfind ocamlopt -c -g -bin-annot -safe-string -I test -I src -o test/xhtml.cmx test/xhtml.ml
- ocamlfind ocamlopt -c -g -bin-annot -safe-string -I test -I src -o test/xmltrip.cmx test/xmltrip.ml
- ocamlfind ocamlopt -linkpkg -g -I src -I test src/xmlm.cmx test/xhtml.cmx test/xmltrip.cmx -o test/xmltrip.native
- # No parallelism done
-> compiled  xmlm.1.4.0
Processing 110/225: [astring: ocaml build] [dune: ocaml bootstrap.ml] [jsonm: ocaml build] [ptime: ocaml build]
-> installed xmlm.1.4.0
Processing 111/225: [astring: ocaml build] [dune: ocaml bootstrap.ml] [jsonm: ocaml build] [ptime: ocaml build]
+ /home/opam/.opam/opam-init/hooks/sandbox.sh "build" "ocaml" "pkg/pkg.ml" "build" "--pinned" "false" (CWD=/home/opam/.opam/5.0/.opam-switch/build/astring.0.8.5)
- ocamlfind ocamldep -modules src/astring_unsafe.ml > src/astring_unsafe.ml.depends
- ocamlfind ocamlc -c -g -bin-annot -safe-string -I src -I test -o src/astring_unsafe.cmo src/astring_unsafe.ml
- ocamlfind ocamldep -modules src/astring_base.ml > src/astring_base.ml.depends
- ocamlfind ocamlc -c -g -bin-annot -safe-string -I src -I test -o src/astring_base.cmo src/astring_base.ml
- ocamlfind ocamlopt -c -g -bin-annot -safe-string -I src -I test -o src/astring_unsafe.cmx src/astring_unsafe.ml
- ocamlfind ocamldep -modules src/astring_escape.ml > src/astring_escape.ml.depends
- ocamlfind ocamlc -c -g -bin-annot -safe-string -I src -I test -o src/astring_escape.cmo src/astring_escape.ml
- ocamlfind ocamldep -modules src/astring_char.ml > src/astring_char.ml.depends
- ocamlfind ocamlc -c -g -bin-annot -safe-string -I src -I test -o src/astring_char.cmo src/astring_char.ml
- ocamlfind ocamlopt -c -g -bin-annot -safe-string -I src -I test -o src/astring_escape.cmx src/astring_escape.ml
- ocamlfind ocamldep -modules src/astring_sub.ml > src/astring_sub.ml.depends
- ocamlfind ocamlc -c -g -bin-annot -safe-string -I src -I test -o src/astring_sub.cmo src/astring_sub.ml
- ocamlfind ocamlopt -c -g -bin-annot -safe-string -I src -I test -o src/astring_base.cmx src/astring_base.ml
- ocamlfind ocamlopt -c -g -bin-annot -safe-string -I src -I test -o src/astring_char.cmx src/astring_char.ml
- ocamlfind ocamldep -modules src/astring_string.ml > src/astring_string.ml.depends
- ocamlfind ocamlc -c -g -bin-annot -safe-string -I src -I test -o src/astring_string.cmo src/astring_string.ml
- ocamlfind ocamlopt -c -g -bin-annot -safe-string -I src -I test -o src/astring_sub.cmx src/astring_sub.ml
- ocamlfind ocamldep -modules src/astring.ml > src/astring.ml.depends
- ocamlfind ocamldep -modules src/astring.mli > src/astring.mli.depends
- ocamlfind ocamlc -c -g -bin-annot -safe-string -I src -I test -o src/astring.cmi src/astring.mli
- ocamlfind ocamlopt -c -g -bin-annot -safe-string -I src -I test -o src/astring_string.cmx src/astring_string.ml
- ocamlfind ocamlopt -c -g -bin-annot -safe-string -I src -I test -o src/astring.cmx src/astring.ml
- ocamlfind ocamlopt -a -I src src/astring_unsafe.cmx src/astring_base.cmx src/astring_escape.cmx src/astring_char.cmx src/astring_sub.cmx src/astring_string.cmx src/astring.cmx -o src/astring.cmxa
- ocamlfind ocamlopt -shared -linkall -I src src/astring.cmxa -o src/astring.cmxs
- ocamlfind ocamlc -c -g -bin-annot -safe-string -I src -I test -o src/astring.cmo src/astring.ml
- ocamlfind ocamlc -a -I src src/astring_unsafe.cmo src/astring_base.cmo src/astring_escape.cmo src/astring_char.cmo src/astring_sub.cmo src/astring_string.cmo src/astring.cmo -o src/astring.cma
- ocamlfind ocamldep -package compiler-libs.toplevel -modules src/astring_top.ml > src/astring_top.ml.depends
- ocamlfind ocamlc -c -g -bin-annot -safe-string -package compiler-libs.toplevel -I src -I test -o src/astring_top.cmo src/astring_top.ml
- ocamlfind ocamlopt -c -g -bin-annot -safe-string -package compiler-libs.toplevel -I src -I test -o src/astring_top.cmx src/astring_top.ml
- ocamlfind ocamlopt -a -package compiler-libs.toplevel -I src src/astring_top.cmx -o src/astring_top.cmxa
- ocamlfind ocamlopt -shared -linkall -package compiler-libs.toplevel -I src src/astring_top.cmxa -o src/astring_top.cmxs
- ocamlfind ocamlc -a -package compiler-libs.toplevel -I src src/astring_top.cmo -o src/astring_top.cma
- # No parallelism done
-> compiled  astring.0.8.5
Processing 111/225: [dune: ocaml bootstrap.ml] [jsonm: ocaml build] [ptime: ocaml build]
-> installed astring.0.8.5
Processing 112/225: [dune: ocaml bootstrap.ml] [jsonm: ocaml build] [ptime: ocaml build]
Processing 113/225: [dune: ocaml bootstrap.ml] [fpath: ocaml build] [jsonm: ocaml build] [ptime: ocaml build]
+ /home/opam/.opam/opam-init/hooks/sandbox.sh "build" "ocaml" "pkg/pkg.ml" "build" "--dev-pkg" "false" (CWD=/home/opam/.opam/5.0/.opam-switch/build/ptime.1.0.0)
- ocamlfind ocamlopt unix.cmxa -I /home/opam/.opam/5.0/lib/ocamlbuild /home/opam/.opam/5.0/lib/ocamlbuild/ocamlbuildlib.cmxa -linkpkg myocamlbuild.ml /home/opam/.opam/5.0/lib/ocamlbuild/ocamlbuild.cmx -o myocamlbuild
- ocamlfind ocamldep -modules src/ptime.ml > src/ptime.ml.depends
- ocamlfind ocamldep -modules src/ptime.mli > src/ptime.mli.depends
- ocamlfind ocamlc -c -g -bin-annot -safe-string -I src -I src-clock -o src/ptime.cmi src/ptime.mli
- ocamlfind ocamlopt -c -g -bin-annot -safe-string -I src -I src-clock -o src/ptime.cmx src/ptime.ml
- ocamlfind ocamlopt -a -I src src/ptime.cmx -o src/ptime.cmxa
- ocamlfind ocamlopt -shared -linkall -I src src/ptime.cmxa -o src/ptime.cmxs
- ocamlfind ocamlc -c -g -bin-annot -safe-string -I src -I src-clock -o src/ptime.cmo src/ptime.ml
- ocamlfind ocamlc -a -I src src/ptime.cmo -o src/ptime.cma
- ocamlfind ocamldep -package compiler-libs.toplevel -modules src/ptime_top.ml > src/ptime_top.ml.depends
- ocamlfind ocamlc -c -g -bin-annot -safe-string -package compiler-libs.toplevel -I src -I src-clock -o src/ptime_top.cmo src/ptime_top.ml
- ocamlfind ocamlopt -c -g -bin-annot -safe-string -package compiler-libs.toplevel -I src -I src-clock -o src/ptime_top.cmx src/ptime_top.ml
- ocamlfind ocamlopt -a -package compiler-libs.toplevel -I src src/ptime_top.cmx -o src/ptime_top.cmxa
- ocamlfind ocamlopt -shared -linkall -package compiler-libs.toplevel -I src src/ptime_top.cmxa -o src/ptime_top.cmxs
- ocamlfind ocamlc -a -package compiler-libs.toplevel -I src src/ptime_top.cmo -o src/ptime_top.cma
- ocamlfind ocamldep -modules src/ptime_clock.mli > src/ptime_clock.mli.depends
- ocamlfind ocamlc -c -g -bin-annot -safe-string -I src -I src-clock -o src/ptime_clock.cmi src/ptime_clock.mli
- ocamlfind ocamlc -g -c src-clock/ptime_clock_stubs.c
- mv ptime_clock_stubs.o src-clock/ptime_clock_stubs.o
- ocamlfind ocamlmklib -o src-clock/ptime_clock_stubs -g src-clock/ptime_clock_stubs.o
- ocamlfind ocamldep -modules src-clock/ptime_clock.ml > src-clock/ptime_clock.ml.depends
- ocamlfind ocamldep -modules src-clock/ptime_clock.mli > src-clock/ptime_clock.mli.depends
- ocamlfind ocamlc -c -g -bin-annot -safe-string -I src-clock -I src -o src-clock/ptime_clock.cmi src-clock/ptime_clock.mli
- ocamlfind ocamlopt -c -g -bin-annot -safe-string -I src-clock -I src -o src-clock/ptime_clock.cmx src-clock/ptime_clock.ml
- + ocamlfind ocamlopt -c -g -bin-annot -safe-string -I src-clock -I src -o src-clock/ptime_clock.cmx src-clock/ptime_clock.ml
- findlib: [WARNING] Interface ptime_clock.cmi occurs in several directories: src, src-clock
- ocamlfind ocamlopt -a -cclib -lptime_clock_stubs -cclib -lrt -I src-clock src-clock/ptime_clock.cmx -o src-clock/ptime_clock.cmxa
- ocamlfind ocamlopt -shared -linkall src-clock/libptime_clock_stubs.a -I src-clock src-clock/ptime_clock.cmxa -o src-clock/ptime_clock.cmxs
- ocamlfind ocamlc -c -g -bin-annot -safe-string -I src-clock -I src -o src-clock/ptime_clock.cmo src-clock/ptime_clock.ml
- + ocamlfind ocamlc -c -g -bin-annot -safe-string -I src-clock -I src -o src-clock/ptime_clock.cmo src-clock/ptime_clock.ml
- findlib: [WARNING] Interface ptime_clock.cmi occurs in several directories: src, src-clock
- ocamlfind ocamlc -a -dllib -lptime_clock_stubs -cclib -lrt -cclib -lptime_clock_stubs -cclib -lrt -I src-clock src-clock/ptime_clock.cmo -o src-clock/ptime_clock.cma
- # No parallelism done
-> compiled  ptime.1.0.0
Processing 113/225: [dune: ocaml bootstrap.ml] [fpath: ocaml build] [jsonm: ocaml build]
-> installed ptime.1.0.0
Processing 114/225: [dune: ocaml bootstrap.ml] [fpath: ocaml build] [jsonm: ocaml build]
+ /home/opam/.opam/opam-init/hooks/sandbox.sh "build" "ocaml" "bootstrap.ml" "-j" "31" (CWD=/home/opam/.opam/5.0/.opam-switch/build/dune.3.1.1)
- ocamlc -output-complete-exe -w -24 -g -o .duneboot.exe -I boot unix.cma boot/libs.ml boot/duneboot.ml
- ./.duneboot.exe -j 31
- cd _boot && /home/opam/.opam/5.0/bin/ocamlopt.opt -c -g -no-alias-deps -w -49-6 -alert -unstable -I +threads build_path_prefix_map.ml
- File "vendor/build_path_prefix_map/src/build_path_prefix_map.ml", line 5, characters 17-31:
- Alert deprecated: Stdlib.Printf.kprintf
- Use Printf.ksprintf instead.
- cd _boot && /home/opam/.opam/5.0/bin/ocamlopt.opt -c -g -no-alias-deps -w -49-6 -alert -unstable -I +threads opamLexer.ml
- File "vendor/opam-file-format/src/opamLexer.mll", line 21, characters 2-16:
- Alert deprecated: Stdlib.Printf.kprintf
- Use Printf.ksprintf instead.
- 

Processing 114/225: [dune: ./dune.exe build] [fpath: ocaml build] [jsonm: ocaml build]
+ /home/opam/.opam/opam-init/hooks/sandbox.sh "build" "ocaml" "pkg/pkg.ml" "build" (CWD=/home/opam/.opam/5.0/.opam-switch/build/fpath.0.7.3)
- ocamlfind ocamldep -package astring -modules src/fpath.ml > src/fpath.ml.depends
- ocamlfind ocamldep -package astring -modules src/fpath.mli > src/fpath.mli.depends
- ocamlfind ocamlc -c -g -bin-annot -safe-string -package astring -I src -I test -o src/fpath.cmi src/fpath.mli
- ocamlfind ocamlopt -c -g -bin-annot -safe-string -package astring -I src -I test -o src/fpath.cmx src/fpath.ml
- + ocamlfind ocamlopt -c -g -bin-annot -safe-string -package astring -I src -I test -o src/fpath.cmx src/fpath.ml
- File "src/fpath.ml", line 40, characters 22-38:
- 40 |   let is_unc_path p = String.is_prefix "\\\\" p
-                            ^^^^^^^^^^^^^^^^
- Warning 6 [labels-omitted]: label affix was omitted in the application of this function.
- File "src/fpath.ml", line 124, characters 21-37:
- 124 |   let has_volume p = String.is_prefix "//" p
-                            ^^^^^^^^^^^^^^^^
- Warning 6 [labels-omitted]: label affix was omitted in the application of this function.
- File "src/fpath.ml", line 427, characters 10-26:
- 427 |   if not (String.is_prefix prefix p) then false else
-                 ^^^^^^^^^^^^^^^^
- Warning 6 [labels-omitted]: label affix was omitted in the application of this function.
- File "src/fpath.ml", line 548, characters 42-58:
- 548 | | Some r -> not (String.equal dotdot r || String.is_prefix dotdot_dir r)
-                                                 ^^^^^^^^^^^^^^^^
- Warning 6 [labels-omitted]: label affix was omitted in the application of this function.
- File "src/fpath.ml", line 563, characters 32-48:
- 563 | | true -> String.equal dot p || String.is_prefix dot_dir p
-                                       ^^^^^^^^^^^^^^^^
- Warning 6 [labels-omitted]: label affix was omitted in the application of this function.
- File "src/fpath.ml", line 578, characters 35-51:
- 578 | | true -> String.equal dotdot p || String.is_prefix dotdot_dir p
-                                          ^^^^^^^^^^^^^^^^
- Warning 6 [labels-omitted]: label affix was omitted in the application of this function.
- File "src/fpath.ml", line 633, characters 18-31:
- 633 |   if not (String.(Sub.is_suffix (sub e) ext)) then false else
-                         ^^^^^^^^^^^^^
- Warning 6 [labels-omitted]: label affix was omitted in the application of this function.
- ocamlfind ocamlopt -a -package astring -I src src/fpath.cmx -o src/fpath.cmxa
- ocamlfind ocamlopt -shared -linkall -package astring -I src src/fpath.cmxa -o src/fpath.cmxs
- ocamlfind ocamlc -c -g -bin-annot -safe-string -package astring -I src -I test -o src/fpath.cmo src/fpath.ml
- + ocamlfind ocamlc -c -g -bin-annot -safe-string -package astring -I src -I test -o src/fpath.cmo src/fpath.ml
- File "src/fpath.ml", line 40, characters 22-38:
- 40 |   let is_unc_path p = String.is_prefix "\\\\" p
-                            ^^^^^^^^^^^^^^^^
- Warning 6 [labels-omitted]: label affix was omitted in the application of this function.
- File "src/fpath.ml", line 124, characters 21-37:
- 124 |   let has_volume p = String.is_prefix "//" p
-                            ^^^^^^^^^^^^^^^^
- Warning 6 [labels-omitted]: label affix was omitted in the application of this function.
- File "src/fpath.ml", line 427, characters 10-26:
- 427 |   if not (String.is_prefix prefix p) then false else
-                 ^^^^^^^^^^^^^^^^
- Warning 6 [labels-omitted]: label affix was omitted in the application of this function.
- File "src/fpath.ml", line 548, characters 42-58:
- 548 | | Some r -> not (String.equal dotdot r || String.is_prefix dotdot_dir r)
-                                                 ^^^^^^^^^^^^^^^^
- Warning 6 [labels-omitted]: label affix was omitted in the application of this function.
- File "src/fpath.ml", line 563, characters 32-48:
- 563 | | true -> String.equal dot p || String.is_prefix dot_dir p
-                                       ^^^^^^^^^^^^^^^^
- Warning 6 [labels-omitted]: label affix was omitted in the application of this function.
- File "src/fpath.ml", line 578, characters 35-51:
- 578 | | true -> String.equal dotdot p || String.is_prefix dotdot_dir p
-                                          ^^^^^^^^^^^^^^^^
- Warning 6 [labels-omitted]: label affix was omitted in the application of this function.
- File "src/fpath.ml", line 633, characters 18-31:
- 633 |   if not (String.(Sub.is_suffix (sub e) ext)) then false else
-                         ^^^^^^^^^^^^^
- Warning 6 [labels-omitted]: label affix was omitted in the application of this function.
- ocamlfind ocamlc -a -package astring -I src src/fpath.cmo -o src/fpath.cma
- ocamlfind ocamldep -package compiler-libs.toplevel -package astring -modules src/fpath_top.ml > src/fpath_top.ml.depends
- ocamlfind ocamlc -c -g -bin-annot -safe-string -package compiler-libs.toplevel -package astring -I src -I test -o src/fpath_top.cmo src/fpath_top.ml
- ocamlfind ocamlopt -c -g -bin-annot -safe-string -package compiler-libs.toplevel -package astring -I src -I test -o src/fpath_top.cmx src/fpath_top.ml
- ocamlfind ocamlopt -a -package compiler-libs.toplevel -package astring -I src src/fpath_top.cmx -o src/fpath_top.cmxa
- ocamlfind ocamlopt -shared -linkall -package compiler-libs.toplevel -package astring -I src src/fpath_top.cmxa -o src/fpath_top.cmxs
- ocamlfind ocamlc -a -package compiler-libs.toplevel -package astring -I src src/fpath_top.cmo -o src/fpath_top.cma
- # No parallelism done
-> compiled  fpath.0.7.3
Processing 114/225: [dune: ./dune.exe build] [jsonm: ocaml build]
-> installed fpath.0.7.3
Processing 115/225: [dune: ./dune.exe build] [jsonm: ocaml build]
+ /home/opam/.opam/opam-init/hooks/sandbox.sh "build" "./dune.exe" "build" "dune.install" "--release" "--profile" "dune-bootstrap" "-j" "31" (CWD=/home/opam/.opam/5.0/.opam-switch/build/dune.3.1.1)
-> compiled  dune.3.1.1
Processing 115/225: [jsonm: ocaml build]
-> installed dune.3.1.1
Processing 116/225: [jsonm: ocaml build]
Processing 117/225: [base64: dune build] [jsonm: ocaml build]
Processing 118/225: [base64: dune build] [bigarray-compat: dune build] [jsonm: ocaml build]
Processing 119/225: [base64: dune build] [bigarray-compat: dune build] [bigstringaf: dune build] [jsonm: ocaml build]
Processing 120/225: [base64: dune build] [bigarray-compat: dune build] [bigstringaf: dune build] [cppo: dune build] [jsonm: ocaml build]
Processing 121/225: [base64: dune build] [bigarray-compat: dune build] [bigstringaf: dune build] [cppo: dune build] [csexp: dune build] [jsonm: ocaml build]
Processing 122/225: [base64: dune build] [bigarray-compat: dune build] [bigstringaf: dune build] [cppo: dune build] [csexp: dune build] [cstruct: dune build] [jsonm: ocaml build]
Processing 123/225: [base64: dune build] [bigarray-compat: dune build] [bigstringaf: dune build] [cppo: dune build] [csexp: dune build] [cstruct: dune build] [domain-name: dune build] [jsonm: ocaml build]
Processing 124/225: [base64: dune build] [bigarray-compat: dune build] [bigstringaf: dune build] [cppo: dune build] [csexp: dune build] [cstruct: dune build] [domain-name: dune build] [duration: dune build] [jsonm: ocaml build]
Processing 125/225: [base64: dune build] [bigarray-compat: dune build] [bigstringaf: dune build] [cppo: dune build] [csexp: dune build] [cstruct: dune build] [domain-name: dune build] [duration: dune build] [ezxmlm: dune build] [jsonm: ocaml build]
Processing 126/225: [base64: dune build] [bigarray-compat: dune build] [bigstringaf: dune build] [cppo: dune build] [csexp: dune build] [cstruct: dune build] [domain-name: dune build] [duration: dune build] [ezxmlm: dune build] [gmap: dune build] [jsonm: ocaml build]
Processing 127/225: [base64: dune build] [bigarray-compat: dune build] [bigstringaf: dune build] [cppo: dune build] [csexp: dune build] [cstruct: dune build] [domain-name: dune build] [duration: dune build] [ezxmlm: dune build] [gmap: dune build] [jsonm: ocaml build] [macaddr: dune build]
Processing 128/225: [base64: dune build] [bigarray-compat: dune build] [bigstringaf: dune build] [cppo: dune build] [csexp: dune build] [cstruct: dune build] [domain-name: dune build] [duration: dune build] [ezxmlm: dune build] [gmap: dune build] [jsonm: ocaml build] [macaddr: dune build] [magic-mime: dune build]
Processing 129/225: [base64: dune build] [bigarray-compat: dune build] [bigstringaf: dune build] [cppo: dune build] [csexp: dune build] [cstruct: dune build] [domain-name: dune build] [duration: dune build] [ezxmlm: dune build] [gmap: dune build] [jsonm: ocaml build] [macaddr: dune build] [magic-mime: dune build] [ocaml-compiler-libs: dune build]
Processing 130/225: [base64: dune build] [bigarray-compat: dune build] [bigstringaf: dune build] [cppo: dune build] [csexp: dune build] [cstruct: dune build] [domain-name: dune build] [duration: dune build] [ezxmlm: dune build] [gmap: dune build] [jsonm: ocaml build] [macaddr: dune build] [magic-mime: dune build] [ocaml-compiler-libs: dune build] [ocaml-syntax-shims: dune build]
Processing 131/225: [base64: dune build] [bigarray-compat: dune build] [bigstringaf: dune build] [cppo: dune build] [csexp: dune build] [cstruct: dune build] [domain-name: dune build] [duration: dune build] [ezxmlm: dune build] [gmap: dune build] [jsonm: ocaml build] [macaddr: dune build] [magic-mime: dune build] [ocaml-compiler-libs: dune build] [ocaml-syntax-shims: dune build] [ppx_derivers: dune build]
Processing 132/225: [base64: dune build] [bigarray-compat: dune build] [bigstringaf: dune build] [cppo: dune build] [csexp: dune build] [cstruct: dune build] [domain-name: dune build] [duration: dune build] [ezxmlm: dune build] [gmap: dune build] [jsonm: ocaml build] [macaddr: dune build] [magic-mime: dune build] [ocaml-compiler-libs: dune build] [ocaml-syntax-shims: dune build] [ppx_derivers: dune build] [re: dune build]
Processing 133/225: [base64: dune build] [bigarray-compat: dune build] [bigstringaf: dune build] [cppo: dune build] [csexp: dune build] [cstruct: dune build] [domain-name: dune build] [duration: dune build] [ezxmlm: dune build] [gmap: dune build] [jsonm: ocaml build] [macaddr: dune build] [magic-mime: dune build] [ocaml-compiler-libs: dune build] [ocaml-syntax-shims: dune build] [ppx_derivers: dune build] [re: dune build] [result: dune build]
Processing 134/225: [base64: dune build] [bigarray-compat: dune build] [bigstringaf: dune build] [cppo: dune build] [csexp: dune build] [cstruct: dune build] [domain-name: dune build] [duration: dune build] [ezxmlm: dune build] [gmap: dune build] [jsonm: ocaml build] [macaddr: dune build] [magic-mime: dune build] [ocaml-compiler-libs: dune build] [ocaml-syntax-shims: dune build] [ppx_derivers: dune build] [re: dune build] [result: dune build] [sexplib0: dune build]
Processing 135/225: [base64: dune build] [bigarray-compat: dune build] [bigstringaf: dune build] [cppo: dune build] [csexp: dune build] [cstruct: dune build] [domain-name: dune build] [duration: dune build] [ezxmlm: dune build] [gmap: dune build] [jsonm: ocaml build] [macaddr: dune build] [magic-mime: dune build] [ocaml-compiler-libs: dune build] [ocaml-syntax-shims: dune build] [ppx_derivers: dune build] [re: dune build] [result: dune build] [sexplib0: dune build] [stdlib-shims: dune build]
Processing 136/225: [base64: dune build] [bigarray-compat: dune build] [bigstringaf: dune build] [cppo: dune build] [csexp: dune build] [cstruct: dune build] [domain-name: dune build] [duration: dune build] [ezxmlm: dune build] [gmap: dune build] [jsonm: ocaml build] [macaddr: dune build] [magic-mime: dune build] [ocaml-compiler-libs: dune build] [ocaml-syntax-shims: dune build] [ppx_derivers: dune build] [re: dune build] [result: dune build] [sexplib0: dune build] [stdlib-shims: dune build] [stringext: dune build]
+ /home/opam/.opam/opam-init/hooks/sandbox.sh "build" "ocaml" "pkg/pkg.ml" "build" "--pinned" "false" (CWD=/home/opam/.opam/5.0/.opam-switch/build/jsonm.1.0.1)
- ocamlfind ocamldep -package bytes -package uchar -package uutf -modules src/jsonm.ml > src/jsonm.ml.depends
- ocamlfind ocamldep -package bytes -package uchar -package uutf -modules src/jsonm.mli > src/jsonm.mli.depends
- ocamlfind ocamlc -c -g -bin-annot -safe-string -package bytes -package uchar -package uutf -I src -I test -o src/jsonm.cmi src/jsonm.mli
- ocamlfind ocamlopt -c -g -bin-annot -safe-string -package bytes -package uchar -package uutf -I src -I test -o src/jsonm.cmx src/jsonm.ml
- + ocamlfind ocamlopt -c -g -bin-annot -safe-string -package bytes -package uchar -package uutf -I src -I test -o src/jsonm.cmx src/jsonm.ml
- File "src/jsonm.ml", line 596, characters 4-11:
- 596 |     w_value false l encode_loop e
-           ^^^^^^^
- Warning 6 [labels-omitted]: label in_obj was omitted in the application of this function.
- ocamlfind ocamlopt -a -package bytes -package uchar -package uutf -I src src/jsonm.cmx -o src/jsonm.cmxa
- ocamlfind ocamlopt -shared -linkall -package bytes -package uchar -package uutf -I src src/jsonm.cmxa -o src/jsonm.cmxs
- ocamlfind ocamlc -c -g -bin-annot -safe-string -package bytes -package uchar -package uutf -I src -I test -o src/jsonm.cmo src/jsonm.ml
- + ocamlfind ocamlc -c -g -bin-annot -safe-string -package bytes -package uchar -package uutf -I src -I test -o src/jsonm.cmo src/jsonm.ml
- File "src/jsonm.ml", line 596, characters 4-11:
- 596 |     w_value false l encode_loop e
-           ^^^^^^^
- Warning 6 [labels-omitted]: label in_obj was omitted in the application of this function.
- ocamlfind ocamlc -a -package bytes -package uchar -package uutf -I src src/jsonm.cmo -o src/jsonm.cma
- ocamlfind ocamldep -package unix -package bytes -package uchar -package uutf -modules test/jsontrip.ml > test/jsontrip.ml.depends
- ocamlfind ocamlc -c -g -bin-annot -safe-string -package unix -package bytes -package uchar -package uutf -I test -I src -o test/jsontrip.cmo test/jsontrip.ml
- ocamlfind ocamlopt -c -g -bin-annot -safe-string -package unix -package bytes -package uchar -package uutf -I test -I src -o test/jsontrip.cmx test/jsontrip.ml
- ocamlfind ocamlopt -linkpkg -g -package unix -package bytes -package uchar -package uutf -I src -I test src/jsonm.cmx test/jsontrip.cmx -o test/jsontrip.native
- # No parallelism done
-> compiled  jsonm.1.0.1
Processing 136/225: [base64: dune build] [bigarray-compat: dune build] [bigstringaf: dune build] [cppo: dune build] [csexp: dune build] [cstruct: dune build] [domain-name: dune build] [duration: dune build] [ezxmlm: dune build] [gmap: dune build] [macaddr: dune build] [magic-mime: dune build] [ocaml-compiler-libs: dune build] [ocaml-syntax-shims: dune build] [ppx_derivers: dune build] [re: dune build] [result: dune build] [sexplib0: dune build] [stdlib-shims: dune build] [stringext: dune build]
-> installed jsonm.1.0.1
Processing 137/225: [base64: dune build] [bigarray-compat: dune build] [bigstringaf: dune build] [cppo: dune build] [csexp: dune build] [cstruct: dune build] [domain-name: dune build] [duration: dune build] [ezxmlm: dune build] [gmap: dune build] [macaddr: dune build] [magic-mime: dune build] [ocaml-compiler-libs: dune build] [ocaml-syntax-shims: dune build] [ppx_derivers: dune build] [re: dune build] [result: dune build] [sexplib0: dune build] [stdlib-shims: dune build] [stringext: dune build]
+ /home/opam/.opam/opam-init/hooks/sandbox.sh "build" "dune" "build" "-p" "csexp" "-j" "31" "@install" (CWD=/home/opam/.opam/5.0/.opam-switch/build/csexp.1.5.1)
-> compiled  csexp.1.5.1
Processing 137/225: [base64: dune build] [bigarray-compat: dune build] [bigstringaf: dune build] [cppo: dune build] [cstruct: dune build] [domain-name: dune build] [duration: dune build] [ezxmlm: dune build] [gmap: dune build] [macaddr: dune build] [magic-mime: dune build] [ocaml-compiler-libs: dune build] [ocaml-syntax-shims: dune build] [ppx_derivers: dune build] [re: dune build] [result: dune build] [sexplib0: dune build] [stdlib-shims: dune build] [stringext: dune build]
-> installed csexp.1.5.1
Processing 138/225: [base64: dune build] [bigarray-compat: dune build] [bigstringaf: dune build] [cppo: dune build] [cstruct: dune build] [domain-name: dune build] [duration: dune build] [ezxmlm: dune build] [gmap: dune build] [macaddr: dune build] [magic-mime: dune build] [ocaml-compiler-libs: dune build] [ocaml-syntax-shims: dune build] [ppx_derivers: dune build] [re: dune build] [result: dune build] [sexplib0: dune build] [stdlib-shims: dune build] [stringext: dune build]
Processing 139/225: [base64: dune build] [bigarray-compat: dune build] [bigstringaf: dune build] [cppo: dune build] [cstruct: dune build] [domain-name: dune build] [dune-configurator: rm] [duration: dune build] [ezxmlm: dune build] [gmap: dune build] [macaddr: dune build] [magic-mime: dune build] [ocaml-compiler-libs: dune build] [ocaml-syntax-shims: dune build] [ppx_derivers: dune build] [re: dune build] [result: dune build] [sexplib0: dune build] [stdlib-shims: dune build] [stringext: dune build]
+ /home/opam/.opam/opam-init/hooks/sandbox.sh "build" "dune" "build" "-p" "base64" "-j" "31" (CWD=/home/opam/.opam/5.0/.opam-switch/build/base64.3.5.0)
-> compiled  base64.3.5.0
Processing 139/225: [bigarray-compat: dune build] [bigstringaf: dune build] [cppo: dune build] [cstruct: dune build] [domain-name: dune build] [dune-configurator: rm] [duration: dune build] [ezxmlm: dune build] [gmap: dune build] [macaddr: dune build] [magic-mime: dune build] [ocaml-compiler-libs: dune build] [ocaml-syntax-shims: dune build] [ppx_derivers: dune build] [re: dune build] [result: dune build] [sexplib0: dune build] [stdlib-shims: dune build] [stringext: dune build]
-> installed base64.3.5.0
Processing 140/225: [bigarray-compat: dune build] [bigstringaf: dune build] [cppo: dune build] [cstruct: dune build] [domain-name: dune build] [dune-configurator: rm] [duration: dune build] [ezxmlm: dune build] [gmap: dune build] [macaddr: dune build] [magic-mime: dune build] [ocaml-compiler-libs: dune build] [ocaml-syntax-shims: dune build] [ppx_derivers: dune build] [re: dune build] [result: dune build] [sexplib0: dune build] [stdlib-shims: dune build] [stringext: dune build]
+ /home/opam/.opam/opam-init/hooks/sandbox.sh "build" "dune" "build" "-p" "bigarray-compat" "-j" "31" (CWD=/home/opam/.opam/5.0/.opam-switch/build/bigarray-compat.1.1.0)
-> compiled  bigarray-compat.1.1.0
Processing 140/225: [bigstringaf: dune build] [cppo: dune build] [cstruct: dune build] [domain-name: dune build] [dune-configurator: rm] [duration: dune build] [ezxmlm: dune build] [gmap: dune build] [macaddr: dune build] [magic-mime: dune build] [ocaml-compiler-libs: dune build] [ocaml-syntax-shims: dune build] [ppx_derivers: dune build] [re: dune build] [result: dune build] [sexplib0: dune build] [stdlib-shims: dune build] [stringext: dune build]
-> installed bigarray-compat.1.1.0
Processing 141/225: [bigstringaf: dune build] [cppo: dune build] [cstruct: dune build] [domain-name: dune build] [dune-configurator: rm] [duration: dune build] [ezxmlm: dune build] [gmap: dune build] [macaddr: dune build] [magic-mime: dune build] [ocaml-compiler-libs: dune build] [ocaml-syntax-shims: dune build] [ppx_derivers: dune build] [re: dune build] [result: dune build] [sexplib0: dune build] [stdlib-shims: dune build] [stringext: dune build]
Processing 142/225: [bigstringaf: dune build] [cppo: dune build] [cstruct: dune build] [domain-name: dune build] [dune-configurator: rm] [duration: dune build] [ezxmlm: dune build] [gmap: dune build] [macaddr: dune build] [magic-mime: dune build] [mmap: dune build] [ocaml-compiler-libs: dune build] [ocaml-syntax-shims: dune build] [ppx_derivers: dune build] [re: dune build] [result: dune build] [sexplib0: dune build] [stdlib-shims: dune build] [stringext: dune build]
+ /home/opam/.opam/opam-init/hooks/sandbox.sh "build" "dune" "build" "-p" "bigstringaf" "-j" "31" (CWD=/home/opam/.opam/5.0/.opam-switch/build/bigstringaf.0.9.0)
- (cd _build/default/lib/freestanding && /usr/bin/gmake)
- touch libbigstringaf_freestanding_stubs.a
-> compiled  bigstringaf.0.9.0
Processing 142/225: [cppo: dune build] [cstruct: dune build] [domain-name: dune build] [dune-configurator: rm] [duration: dune build] [ezxmlm: dune build] [gmap: dune build] [macaddr: dune build] [magic-mime: dune build] [mmap: dune build] [ocaml-compiler-libs: dune build] [ocaml-syntax-shims: dune build] [ppx_derivers: dune build] [re: dune build] [result: dune build] [sexplib0: dune build] [stdlib-shims: dune build] [stringext: dune build]
-> installed bigstringaf.0.9.0
Processing 143/225: [cppo: dune build] [cstruct: dune build] [domain-name: dune build] [dune-configurator: rm] [duration: dune build] [ezxmlm: dune build] [gmap: dune build] [macaddr: dune build] [magic-mime: dune build] [mmap: dune build] [ocaml-compiler-libs: dune build] [ocaml-syntax-shims: dune build] [ppx_derivers: dune build] [re: dune build] [result: dune build] [sexplib0: dune build] [stdlib-shims: dune build] [stringext: dune build]
+ /home/opam/.opam/opam-init/hooks/sandbox.sh "build" "dune" "build" "-p" "cstruct" "-j" "31" (CWD=/home/opam/.opam/5.0/.opam-switch/build/cstruct.6.1.0)
-> compiled  cstruct.6.1.0
Processing 143/225: [cppo: dune build] [domain-name: dune build] [dune-configurator: rm] [duration: dune build] [ezxmlm: dune build] [gmap: dune build] [macaddr: dune build] [magic-mime: dune build] [mmap: dune build] [ocaml-compiler-libs: dune build] [ocaml-syntax-shims: dune build] [ppx_derivers: dune build] [re: dune build] [result: dune build] [sexplib0: dune build] [stdlib-shims: dune build] [stringext: dune build]
-> installed cstruct.6.1.0
Processing 144/225: [cppo: dune build] [domain-name: dune build] [dune-configurator: rm] [duration: dune build] [ezxmlm: dune build] [gmap: dune build] [macaddr: dune build] [magic-mime: dune build] [mmap: dune build] [ocaml-compiler-libs: dune build] [ocaml-syntax-shims: dune build] [ppx_derivers: dune build] [re: dune build] [result: dune build] [sexplib0: dune build] [stdlib-shims: dune build] [stringext: dune build]
Processing 145/225: [asn1-combinators: dune build] [cppo: dune build] [domain-name: dune build] [dune-configurator: rm] [duration: dune build] [ezxmlm: dune build] [gmap: dune build] [macaddr: dune build] [magic-mime: dune build] [mmap: dune build] [ocaml-compiler-libs: dune build] [ocaml-syntax-shims: dune build] [ppx_derivers: dune build] [re: dune build] [result: dune build] [sexplib0: dune build] [stdlib-shims: dune build] [stringext: dune build]
Processing 146/225: [asn1-combinators: dune build] [cppo: dune build] [domain-name: dune build] [dune-configurator: rm] [duration: dune build] [eqaf: dune build] [ezxmlm: dune build] [gmap: dune build] [macaddr: dune build] [magic-mime: dune build] [mmap: dune build] [ocaml-compiler-libs: dune build] [ocaml-syntax-shims: dune build] [ppx_derivers: dune build] [re: dune build] [result: dune build] [sexplib0: dune build] [stdlib-shims: dune build] [stringext: dune build]
+ /home/opam/.opam/opam-init/hooks/sandbox.sh "build" "dune" "build" "-p" "domain-name" "-j" "31" (CWD=/home/opam/.opam/5.0/.opam-switch/build/domain-name.0.4.0)
-> compiled  domain-name.0.4.0
Processing 146/225: [asn1-combinators: dune build] [cppo: dune build] [dune-configurator: rm] [duration: dune build] [eqaf: dune build] [ezxmlm: dune build] [gmap: dune build] [macaddr: dune build] [magic-mime: dune build] [mmap: dune build] [ocaml-compiler-libs: dune build] [ocaml-syntax-shims: dune build] [ppx_derivers: dune build] [re: dune build] [result: dune build] [sexplib0: dune build] [stdlib-shims: dune build] [stringext: dune build]
-> installed domain-name.0.4.0
Processing 147/225: [asn1-combinators: dune build] [cppo: dune build] [dune-configurator: rm] [duration: dune build] [eqaf: dune build] [ezxmlm: dune build] [gmap: dune build] [macaddr: dune build] [magic-mime: dune build] [mmap: dune build] [ocaml-compiler-libs: dune build] [ocaml-syntax-shims: dune build] [ppx_derivers: dune build] [re: dune build] [result: dune build] [sexplib0: dune build] [stdlib-shims: dune build] [stringext: dune build]
+ /home/opam/.opam/opam-init/hooks/sandbox.sh "build" "dune" "build" "-p" "duration" "-j" "31" (CWD=/home/opam/.opam/5.0/.opam-switch/build/duration.0.2.0)
-> compiled  duration.0.2.0
Processing 147/225: [asn1-combinators: dune build] [cppo: dune build] [dune-configurator: rm] [eqaf: dune build] [ezxmlm: dune build] [gmap: dune build] [macaddr: dune build] [magic-mime: dune build] [mmap: dune build] [ocaml-compiler-libs: dune build] [ocaml-syntax-shims: dune build] [ppx_derivers: dune build] [re: dune build] [result: dune build] [sexplib0: dune build] [stdlib-shims: dune build] [stringext: dune build]
-> installed duration.0.2.0
Processing 148/225: [asn1-combinators: dune build] [cppo: dune build] [dune-configurator: rm] [eqaf: dune build] [ezxmlm: dune build] [gmap: dune build] [macaddr: dune build] [magic-mime: dune build] [mmap: dune build] [ocaml-compiler-libs: dune build] [ocaml-syntax-shims: dune build] [ppx_derivers: dune build] [re: dune build] [result: dune build] [sexplib0: dune build] [stdlib-shims: dune build] [stringext: dune build]
+ /home/opam/.opam/opam-init/hooks/sandbox.sh "build" "dune" "build" "-p" "ezxmlm" "-j" "31" (CWD=/home/opam/.opam/5.0/.opam-switch/build/ezxmlm.1.1.0)
-> compiled  ezxmlm.1.1.0
Processing 148/225: [asn1-combinators: dune build] [cppo: dune build] [dune-configurator: rm] [eqaf: dune build] [gmap: dune build] [macaddr: dune build] [magic-mime: dune build] [mmap: dune build] [ocaml-compiler-libs: dune build] [ocaml-syntax-shims: dune build] [ppx_derivers: dune build] [re: dune build] [result: dune build] [sexplib0: dune build] [stdlib-shims: dune build] [stringext: dune build]
-> installed ezxmlm.1.1.0
Processing 149/225: [asn1-combinators: dune build] [cppo: dune build] [dune-configurator: rm] [eqaf: dune build] [gmap: dune build] [macaddr: dune build] [magic-mime: dune build] [mmap: dune build] [ocaml-compiler-libs: dune build] [ocaml-syntax-shims: dune build] [ppx_derivers: dune build] [re: dune build] [result: dune build] [sexplib0: dune build] [stdlib-shims: dune build] [stringext: dune build]
+ /home/opam/.opam/opam-init/hooks/sandbox.sh "build" "dune" "build" "-p" "gmap" "-j" "31" (CWD=/home/opam/.opam/5.0/.opam-switch/build/gmap.0.3.0)
-> compiled  gmap.0.3.0
Processing 149/225: [asn1-combinators: dune build] [cppo: dune build] [dune-configurator: rm] [eqaf: dune build] [macaddr: dune build] [magic-mime: dune build] [mmap: dune build] [ocaml-compiler-libs: dune build] [ocaml-syntax-shims: dune build] [ppx_derivers: dune build] [re: dune build] [result: dune build] [sexplib0: dune build] [stdlib-shims: dune build] [stringext: dune build]
-> installed gmap.0.3.0
Processing 150/225: [asn1-combinators: dune build] [cppo: dune build] [dune-configurator: rm] [eqaf: dune build] [macaddr: dune build] [magic-mime: dune build] [mmap: dune build] [ocaml-compiler-libs: dune build] [ocaml-syntax-shims: dune build] [ppx_derivers: dune build] [re: dune build] [result: dune build] [sexplib0: dune build] [stdlib-shims: dune build] [stringext: dune build]
+ /home/opam/.opam/opam-init/hooks/sandbox.sh "build" "dune" "build" "-p" "macaddr" "-j" "31" (CWD=/home/opam/.opam/5.0/.opam-switch/build/macaddr.5.3.0)
-> compiled  macaddr.5.3.0
Processing 150/225: [asn1-combinators: dune build] [cppo: dune build] [dune-configurator: rm] [eqaf: dune build] [magic-mime: dune build] [mmap: dune build] [ocaml-compiler-libs: dune build] [ocaml-syntax-shims: dune build] [ppx_derivers: dune build] [re: dune build] [result: dune build] [sexplib0: dune build] [stdlib-shims: dune build] [stringext: dune build]
-> installed macaddr.5.3.0
Processing 151/225: [asn1-combinators: dune build] [cppo: dune build] [dune-configurator: rm] [eqaf: dune build] [magic-mime: dune build] [mmap: dune build] [ocaml-compiler-libs: dune build] [ocaml-syntax-shims: dune build] [ppx_derivers: dune build] [re: dune build] [result: dune build] [sexplib0: dune build] [stdlib-shims: dune build] [stringext: dune build]
+ /home/opam/.opam/opam-init/hooks/sandbox.sh "build" "dune" "build" "-p" "ocaml-syntax-shims" "-j" "31" "@install" (CWD=/home/opam/.opam/5.0/.opam-switch/build/ocaml-syntax-shims.1.0.0)
-> compiled  ocaml-syntax-shims.1.0.0
Processing 151/225: [asn1-combinators: dune build] [cppo: dune build] [dune-configurator: rm] [eqaf: dune build] [magic-mime: dune build] [mmap: dune build] [ocaml-compiler-libs: dune build] [ppx_derivers: dune build] [re: dune build] [result: dune build] [sexplib0: dune build] [stdlib-shims: dune build] [stringext: dune build]
-> installed ocaml-syntax-shims.1.0.0
Processing 152/225: [asn1-combinators: dune build] [cppo: dune build] [dune-configurator: rm] [eqaf: dune build] [magic-mime: dune build] [mmap: dune build] [ocaml-compiler-libs: dune build] [ppx_derivers: dune build] [re: dune build] [result: dune build] [sexplib0: dune build] [stdlib-shims: dune build] [stringext: dune build]
+ /home/opam/.opam/opam-init/hooks/sandbox.sh "build" "dune" "build" "-p" "ppx_derivers" "-j" "31" (CWD=/home/opam/.opam/5.0/.opam-switch/build/ppx_derivers.1.2.1)
-> compiled  ppx_derivers.1.2.1
Processing 152/225: [asn1-combinators: dune build] [cppo: dune build] [dune-configurator: rm] [eqaf: dune build] [magic-mime: dune build] [mmap: dune build] [ocaml-compiler-libs: dune build] [re: dune build] [result: dune build] [sexplib0: dune build] [stdlib-shims: dune build] [stringext: dune build]
-> installed ppx_derivers.1.2.1
Processing 153/225: [asn1-combinators: dune build] [cppo: dune build] [dune-configurator: rm] [eqaf: dune build] [magic-mime: dune build] [mmap: dune build] [ocaml-compiler-libs: dune build] [re: dune build] [result: dune build] [sexplib0: dune build] [stdlib-shims: dune build] [stringext: dune build]
+ /home/opam/.opam/opam-init/hooks/sandbox.sh "build" "dune" "build" "-p" "result" "-j" "31" (CWD=/home/opam/.opam/5.0/.opam-switch/build/result.1.5)
-> compiled  result.1.5
Processing 153/225: [asn1-combinators: dune build] [cppo: dune build] [dune-configurator: rm] [eqaf: dune build] [magic-mime: dune build] [mmap: dune build] [ocaml-compiler-libs: dune build] [re: dune build] [sexplib0: dune build] [stdlib-shims: dune build] [stringext: dune build]
-> installed result.1.5
Processing 154/225: [asn1-combinators: dune build] [cppo: dune build] [dune-configurator: rm] [eqaf: dune build] [magic-mime: dune build] [mmap: dune build] [ocaml-compiler-libs: dune build] [re: dune build] [sexplib0: dune build] [stdlib-shims: dune build] [stringext: dune build]
Processing 155/225: [angstrom: dune build] [asn1-combinators: dune build] [cppo: dune build] [dune-configurator: rm] [eqaf: dune build] [magic-mime: dune build] [mmap: dune build] [ocaml-compiler-libs: dune build] [re: dune build] [sexplib0: dune build] [stdlib-shims: dune build] [stringext: dune build]
+ /home/opam/.opam/opam-init/hooks/sandbox.sh "build" "dune" "build" "-p" "sexplib0" "-j" "31" (CWD=/home/opam/.opam/5.0/.opam-switch/build/sexplib0.v0.15.0)
- (cd _build/default && /home/opam/.opam/5.0/bin/ocamlopt.opt -w -40 -g -I src/.sexplib0.objs/byte -I src/.sexplib0.objs/native -intf-suffix .ml -no-alias-deps -open Sexplib0__ -o src/.sexplib0.objs/native/sexplib0__Sexp_conv.cmx -c -impl src/sexp_conv.ml)
- File "src/sexp_conv.ml", line 99, characters 15-31:
- 99 |       let id = Obj.extension_id
-                     ^^^^^^^^^^^^^^^^
- Error: Unbound value Obj.extension_id
- (cd _build/default && /home/opam/.opam/5.0/bin/ocamlc.opt -w -40 -g -bin-annot -I src/.sexplib0.objs/byte -intf-suffix .ml -no-alias-deps -open Sexplib0__ -o src/.sexplib0.objs/byte/sexplib0__Sexp_conv.cmo -c -impl src/sexp_conv.ml)
- File "src/sexp_conv.ml", line 99, characters 15-31:
- 99 |       let id = Obj.extension_id
-                     ^^^^^^^^^^^^^^^^
- Error: Unbound value Obj.extension_id
[ERROR] The compilation of sexplib0.v0.15.0 failed at "dune build -p sexplib0 -j 31".
Processing 155/225: [angstrom: dune build] [asn1-combinators: dune build] [cppo: dune build] [dune-configurator: rm] [eqaf: dune build] [magic-mime: dune build] [mmap: dune build] [ocaml-compiler-libs: dune build] [re: dune build] [stdlib-shims: dune build] [stringext: dune build]
Processing 156/225: [angstrom: dune build] [asn1-combinators: dune build] [cppo: dune build] [dune-configurator: rm] [eqaf: dune build] [magic-mime: dune build] [mmap: dune build] [ocaml-compiler-libs: dune build] [re: dune build] [stdlib-shims: dune build] [stringext: dune build]
+ /home/opam/.opam/opam-init/hooks/sandbox.sh "build" "dune" "build" "-p" "stdlib-shims" "-j" "31" (CWD=/home/opam/.opam/5.0/.opam-switch/build/stdlib-shims.0.3.0)
-> compiled  stdlib-shims.0.3.0
Processing 156/225: [angstrom: dune build] [asn1-combinators: dune build] [cppo: dune build] [dune-configurator: rm] [eqaf: dune build] [magic-mime: dune build] [mmap: dune build] [ocaml-compiler-libs: dune build] [re: dune build] [stringext: dune build]
-> installed stdlib-shims.0.3.0
Processing 157/225: [angstrom: dune build] [asn1-combinators: dune build] [cppo: dune build] [dune-configurator: rm] [eqaf: dune build] [magic-mime: dune build] [mmap: dune build] [ocaml-compiler-libs: dune build] [re: dune build] [stringext: dune build]
Processing 158/225: [angstrom: dune build] [asn1-combinators: dune build] [cppo: dune build] [dune-configurator: rm] [eqaf: dune build] [ipaddr: dune build] [magic-mime: dune build] [mmap: dune build] [ocaml-compiler-libs: dune build] [re: dune build] [stringext: dune build]
+ /home/opam/.opam/opam-init/hooks/sandbox.sh "build" "dune" "build" "-p" "cppo" "-j" "31" (CWD=/home/opam/.opam/5.0/.opam-switch/build/cppo.1.6.8)
-> compiled  cppo.1.6.8
Processing 158/225: [angstrom: dune build] [asn1-combinators: dune build] [dune-configurator: rm] [eqaf: dune build] [ipaddr: dune build] [magic-mime: dune build] [mmap: dune build] [ocaml-compiler-libs: dune build] [re: dune build] [stringext: dune build]
-> installed cppo.1.6.8
Processing 159/225: [angstrom: dune build] [asn1-combinators: dune build] [dune-configurator: rm] [eqaf: dune build] [ipaddr: dune build] [magic-mime: dune build] [mmap: dune build] [ocaml-compiler-libs: dune build] [re: dune build] [stringext: dune build]
Processing 160/225: [angstrom: dune build] [asn1-combinators: dune build] [dune-configurator: rm] [eqaf: dune build] [ipaddr: dune build] [magic-mime: dune build] [mmap: dune build] [ocaml-compiler-libs: dune build] [ocplib-endian: dune build] [re: dune build] [stringext: dune build]
+ /home/opam/.opam/opam-init/hooks/sandbox.sh "build" "dune" "build" "-p" "magic-mime" "-j" "31" (CWD=/home/opam/.opam/5.0/.opam-switch/build/magic-mime.1.2.0)
-> compiled  magic-mime.1.2.0
Processing 160/225: [angstrom: dune build] [asn1-combinators: dune build] [dune-configurator: rm] [eqaf: dune build] [ipaddr: dune build] [mmap: dune build] [ocaml-compiler-libs: dune build] [ocplib-endian: dune build] [re: dune build] [stringext: dune build]
-> installed magic-mime.1.2.0
Processing 161/225: [angstrom: dune build] [asn1-combinators: dune build] [dune-configurator: rm] [eqaf: dune build] [ipaddr: dune build] [mmap: dune build] [ocaml-compiler-libs: dune build] [ocplib-endian: dune build] [re: dune build] [stringext: dune build]
+ /home/opam/.opam/opam-init/hooks/sandbox.sh "build" "dune" "build" "-p" "ocaml-compiler-libs" "-j" "31" "@install" (CWD=/home/opam/.opam/5.0/.opam-switch/build/ocaml-compiler-libs.v0.12.4)
-> compiled  ocaml-compiler-libs.v0.12.4
Processing 161/225: [angstrom: dune build] [asn1-combinators: dune build] [dune-configurator: rm] [eqaf: dune build] [ipaddr: dune build] [mmap: dune build] [ocplib-endian: dune build] [re: dune build] [stringext: dune build]
-> installed ocaml-compiler-libs.v0.12.4
Processing 162/225: [angstrom: dune build] [asn1-combinators: dune build] [dune-configurator: rm] [eqaf: dune build] [ipaddr: dune build] [mmap: dune build] [ocplib-endian: dune build] [re: dune build] [stringext: dune build]
Processing 163/225: [angstrom: dune build] [asn1-combinators: dune build] [dune-configurator: rm] [eqaf: dune build] [ipaddr: dune build] [mmap: dune build] [ocplib-endian: dune build] [ppxlib: dune subst] [re: dune build] [stringext: dune build]
+ /home/opam/.opam/opam-init/hooks/sandbox.sh "build" "dune" "build" "-p" "re" "-j" "31" (CWD=/home/opam/.opam/5.0/.opam-switch/build/re.1.10.4)
-> compiled  re.1.10.4
Processing 163/225: [angstrom: dune build] [asn1-combinators: dune build] [dune-configurator: rm] [eqaf: dune build] [ipaddr: dune build] [mmap: dune build] [ocplib-endian: dune build] [ppxlib: dune subst] [stringext: dune build]
-> installed re.1.10.4
Processing 164/225: [angstrom: dune build] [asn1-combinators: dune build] [dune-configurator: rm] [eqaf: dune build] [ipaddr: dune build] [mmap: dune build] [ocplib-endian: dune build] [ppxlib: dune subst] [stringext: dune build]
+ /home/opam/.opam/opam-init/hooks/sandbox.sh "build" "dune" "build" "-p" "stringext" "-j" "31" (CWD=/home/opam/.opam/5.0/.opam-switch/build/stringext.1.6.0)
-> compiled  stringext.1.6.0
Processing 164/225: [angstrom: dune build] [asn1-combinators: dune build] [dune-configurator: rm] [eqaf: dune build] [ipaddr: dune build] [mmap: dune build] [ocplib-endian: dune build] [ppxlib: dune subst]
-> installed stringext.1.6.0
Processing 165/225: [angstrom: dune build] [asn1-combinators: dune build] [dune-configurator: rm] [eqaf: dune build] [ipaddr: dune build] [mmap: dune build] [ocplib-endian: dune build] [ppxlib: dune subst]
+ /home/opam/.opam/opam-init/hooks/sandbox.sh "build" "rm" "-rf" "vendor/csexp" (CWD=/home/opam/.opam/5.0/.opam-switch/build/dune-configurator.3.1.1)
+ /home/opam/.opam/opam-init/hooks/sandbox.sh "build" "dune" "build" "-p" "mmap" "-j" "31" (CWD=/home/opam/.opam/5.0/.opam-switch/build/mmap.1.2.0)
-> compiled  mmap.1.2.0
Processing 165/225: [angstrom: dune build] [asn1-combinators: dune build] [dune-configurator: rm] [eqaf: dune build] [ipaddr: dune build] [ocplib-endian: dune build] [ppxlib: dune subst]
-> installed mmap.1.2.0
Processing 166/225: [angstrom: dune build] [asn1-combinators: dune build] [dune-configurator: rm] [eqaf: dune build] [ipaddr: dune build] [ocplib-endian: dune build] [ppxlib: dune subst]
+ /home/opam/.opam/opam-init/hooks/sandbox.sh "build" "rm" "-rf" "vendor/pp" (CWD=/home/opam/.opam/5.0/.opam-switch/build/dune-configurator.3.1.1)
Processing 166/225: [angstrom: dune build] [asn1-combinators: dune build] [dune-configurator: dune build] [eqaf: dune build] [ipaddr: dune build] [ocplib-endian: dune build] [ppxlib: dune subst]
+ /home/opam/.opam/opam-init/hooks/sandbox.sh "build" "dune" "subst" (CWD=/home/opam/.opam/5.0/.opam-switch/build/ppxlib.0.25.0~5.00preview)
Processing 166/225: [angstrom: dune build] [asn1-combinators: dune build] [dune-configurator: dune build] [eqaf: dune build] [ipaddr: dune build] [ocplib-endian: dune build] [ppxlib: dune build]
[ERROR] The compilation of ocplib-endian.1.2 failed at "dune build -p ocplib-endian -j 31 @install".
+ /home/opam/.opam/opam-init/hooks/sandbox.sh "build" "dune" "build" "-p" "ocplib-endian" "-j" "31" "@install" (CWD=/home/opam/.opam/5.0/.opam-switch/build/ocplib-endian.1.2)
- File "src/dune", line 75, characters 26-34:
- 75 |  (libraries ocplib_endian bigarray bytes))
-                                ^^^^^^^^
- Error: Library "bigarray" not found.
- -> required by library "ocplib-endian.bigstring" in _build/default/src
- -> required by _build/default/META.ocplib-endian
- -> required by _build/install/default/lib/ocplib-endian/META
- -> required by _build/default/ocplib-endian.install
- -> required by alias install
Processing 166/225: [angstrom: dune build] [asn1-combinators: dune build] [dune-configurator: dune build] [eqaf: dune build] [ipaddr: dune build] [ppxlib: dune build]
Processing 167/225: [angstrom: dune build] [asn1-combinators: dune build] [dune-configurator: dune build] [eqaf: dune build] [ipaddr: dune build] [ppxlib: dune build]
+ /home/opam/.opam/opam-init/hooks/sandbox.sh "build" "dune" "build" "-p" "eqaf" "-j" "31" (CWD=/home/opam/.opam/5.0/.opam-switch/build/eqaf.0.8)
-> compiled  eqaf.0.8
Processing 167/225: [angstrom: dune build] [asn1-combinators: dune build] [dune-configurator: dune build] [ipaddr: dune build] [ppxlib: dune build]
-> installed eqaf.0.8
Processing 168/225: [angstrom: dune build] [asn1-combinators: dune build] [dune-configurator: dune build] [ipaddr: dune build] [ppxlib: dune build]
Processing 169/225: [angstrom: dune build] [asn1-combinators: dune build] [digestif: dune build] [dune-configurator: dune build] [ipaddr: dune build] [ppxlib: dune build]
+ /home/opam/.opam/opam-init/hooks/sandbox.sh "build" "dune" "build" "-p" "angstrom" "-j" "31" (CWD=/home/opam/.opam/5.0/.opam-switch/build/angstrom.0.15.0)
-> compiled  angstrom.0.15.0
Processing 169/225: [asn1-combinators: dune build] [digestif: dune build] [dune-configurator: dune build] [ipaddr: dune build] [ppxlib: dune build]
-> installed angstrom.0.15.0
Processing 170/225: [asn1-combinators: dune build] [digestif: dune build] [dune-configurator: dune build] [ipaddr: dune build] [ppxlib: dune build]
Processing 171/225: [asn1-combinators: dune build] [digestif: dune build] [dune-configurator: dune build] [ipaddr: dune build] [ppxlib: dune build] [uri: dune build]
+ /home/opam/.opam/opam-init/hooks/sandbox.sh "build" "dune" "build" "-p" "asn1-combinators" "-j" "31" (CWD=/home/opam/.opam/5.0/.opam-switch/build/asn1-combinators.0.2.6)
-> compiled  asn1-combinators.0.2.6
Processing 171/225: [digestif: dune build] [dune-configurator: dune build] [ipaddr: dune build] [ppxlib: dune build] [uri: dune build]
-> installed asn1-combinators.0.2.6
Processing 172/225: [digestif: dune build] [dune-configurator: dune build] [ipaddr: dune build] [ppxlib: dune build] [uri: dune build]
+ /home/opam/.opam/opam-init/hooks/sandbox.sh "build" "dune" "build" "-p" "ipaddr" "-j" "31" (CWD=/home/opam/.opam/5.0/.opam-switch/build/ipaddr.5.3.0)
-> compiled  ipaddr.5.3.0
Processing 172/225: [digestif: dune build] [dune-configurator: dune build] [ppxlib: dune build] [uri: dune build]
-> installed ipaddr.5.3.0
Processing 173/225: [digestif: dune build] [dune-configurator: dune build] [ppxlib: dune build] [uri: dune build]
+ /home/opam/.opam/opam-init/hooks/sandbox.sh "build" "dune" "build" "-p" "dune-configurator" "-j" "31" "@install" (CWD=/home/opam/.opam/5.0/.opam-switch/build/dune-configurator.3.1.1)
-> compiled  dune-configurator.3.1.1
Processing 173/225: [digestif: dune build] [ppxlib: dune build] [uri: dune build]
-> installed dune-configurator.3.1.1
Processing 174/225: [digestif: dune build] [ppxlib: dune build] [uri: dune build]
Processing 175/225: [digestif: dune build] [ppxlib: dune build] [uri: dune build]
Processing 176/225: [digestif: dune build] [ppxlib: dune build] [uri: dune build]
Processing 177/225: [digestif: dune build] [mirage-crypto: dune build] [ppxlib: dune build] [uri: dune build]
Processing 178/225: [digestif: dune build] [mirage-crypto: dune build] [ppxlib: dune build] [uri: dune build]
Processing 179/225: [digestif: dune build] [mirage-crypto: dune build] [ppxlib: dune build] [uri: dune build]
Processing 180/225: [digestif: dune build] [mirage-crypto: dune build] [ppxlib: dune build] [uri: dune build]
Processing 181/225: [digestif: dune build] [mirage-crypto: dune build] [ppxlib: dune build] [uri: dune build]
Processing 182/225: [digestif: dune build] [mirage-crypto: dune build] [ppxlib: dune build] [uri: dune build]
Processing 183/225: [digestif: dune build] [mirage-crypto: dune build] [ppxlib: dune build] [uri: dune build]
Processing 184/225: [digestif: dune build] [mirage-crypto: dune build] [ppxlib: dune build] [uri: dune build]
Processing 185/225: [digestif: dune build] [mirage-crypto: dune build] [ppxlib: dune build] [uri: dune build]
Processing 186/225: [digestif: dune build] [mirage-crypto: dune build] [ppxlib: dune build] [uri: dune build]
Processing 187/225: [digestif: dune build] [mirage-crypto: dune build] [ppxlib: dune build] [uri: dune build]
+ /home/opam/.opam/opam-init/hooks/sandbox.sh "build" "dune" "build" "-p" "digestif" "-j" "31" (CWD=/home/opam/.opam/5.0/.opam-switch/build/digestif.1.1.2)
- (cd _build/default/freestanding && /usr/bin/gmake)
- touch libdigestif_freestanding_stubs.a
Processing 187/225: [digestif: ocaml] [mirage-crypto: dune build] [ppxlib: dune build] [uri: dune build]
+ /home/opam/.opam/opam-init/hooks/sandbox.sh "build" "ocaml" "./install/install.ml" (CWD=/home/opam/.opam/5.0/.opam-switch/build/digestif.1.1.2)
-> compiled  digestif.1.1.2
Processing 187/225: [mirage-crypto: dune build] [ppxlib: dune build] [uri: dune build]
-> installed digestif.1.1.2
Processing 188/225: [mirage-crypto: dune build] [ppxlib: dune build] [uri: dune build]
+ /home/opam/.opam/opam-init/hooks/sandbox.sh "build" "dune" "build" "-p" "uri" "-j" "31" (CWD=/home/opam/.opam/5.0/.opam-switch/build/uri.4.2.0)
-> compiled  uri.4.2.0
Processing 188/225: [mirage-crypto: dune build] [ppxlib: dune build]
-> installed uri.4.2.0
Processing 189/225: [mirage-crypto: dune build] [ppxlib: dune build]
Processing 190/225: [mirage-crypto: dune build] [ppxlib: dune build]
Processing 191/225: [mirage-crypto: dune build] [ppxlib: dune build]
+ /home/opam/.opam/opam-init/hooks/sandbox.sh "build" "dune" "build" "-p" "mirage-crypto" "-j" "31" (CWD=/home/opam/.opam/5.0/.opam-switch/build/mirage-crypto.0.10.6)
- (cd _build/default/src-freestanding && /usr/bin/gmake)
- touch libmirage_crypto_freestanding_stubs.a
-> compiled  mirage-crypto.0.10.6
Processing 191/225: [ppxlib: dune build]
-> installed mirage-crypto.0.10.6
Processing 192/225: [ppxlib: dune build]
Processing 193/225: [ppxlib: dune build]
Processing 194/225: [pbkdf: dune build] [ppxlib: dune build]
Processing 195/225: [pbkdf: dune build] [ppxlib: dune build]
Processing 196/225: [pbkdf: dune build] [ppxlib: dune build]
Processing 197/225: [pbkdf: dune build] [ppxlib: dune build]
Processing 198/225: [pbkdf: dune build] [ppxlib: dune build]
Processing 199/225: [pbkdf: dune build] [ppxlib: dune build]
+ /home/opam/.opam/opam-init/hooks/sandbox.sh "build" "dune" "build" "-j" "31" "-p" "pbkdf" "@install" (CWD=/home/opam/.opam/5.0/.opam-switch/build/pbkdf.1.2.0)
-> compiled  pbkdf.1.2.0
Processing 199/225: [ppxlib: dune build]
-> installed pbkdf.1.2.0
Processing 200/225: [ppxlib: dune build]
Processing 201/225: [ppxlib: dune build]
Processing 202/225: [ppxlib: dune build]
Processing 203/225: [ppxlib: dune build]
Processing 204/225: [ppxlib: dune build]
+ /home/opam/.opam/opam-init/hooks/sandbox.sh "build" "dune" "build" "-p" "ppxlib" "-j" "31" "@install" (CWD=/home/opam/.opam/5.0/.opam-switch/build/ppxlib.0.25.0~5.00preview)
-> compiled  ppxlib.0.25.0~5.00preview
-> installed ppxlib.0.25.0~5.00preview

#=== ERROR while compiling sexplib0.v0.15.0 ===================================#
# context              2.2.0~alpha~dev | linux/x86_64 | ocaml-variants.5.0.0+trunk | file:///home/opam/opam-repository
# path                 ~/.opam/5.0/.opam-switch/build/sexplib0.v0.15.0
# command              ~/.opam/opam-init/hooks/sandbox.sh build dune build -p sexplib0 -j 31
# exit-code            1
# env-file             ~/.opam/log/sexplib0-10-6c5ed3.env
# output-file          ~/.opam/log/sexplib0-10-6c5ed3.out
### output ###
# (cd _build/default && /home/opam/.opam/5.0/bin/ocamlopt.opt -w -40 -g -I src/.sexplib0.objs/byte -I src/.sexplib0.objs/native -intf-suffix .ml -no-alias-deps -open Sexplib0__ -o src/.sexplib0.objs/native/sexplib0__Sexp_conv.cmx -c -impl src/sexp_conv.ml)
# File "src/sexp_conv.ml", line 99, characters 15-31:
# 99 |       let id = Obj.extension_id
#                     ^^^^^^^^^^^^^^^^
# Error: Unbound value Obj.extension_id
# (cd _build/default && /home/opam/.opam/5.0/bin/ocamlc.opt -w -40 -g -bin-annot -I src/.sexplib0.objs/byte -intf-suffix .ml -no-alias-deps -open Sexplib0__ -o src/.sexplib0.objs/byte/sexplib0__Sexp_conv.cmo -c -impl src/sexp_conv.ml)
# File "src/sexp_conv.ml", line 99, characters 15-31:
# 99 |       let id = Obj.extension_id
#                     ^^^^^^^^^^^^^^^^
# Error: Unbound value Obj.extension_id


#=== ERROR while compiling ocplib-endian.1.2 ==================================#
# context              2.2.0~alpha~dev | linux/x86_64 | ocaml-variants.5.0.0+trunk | file:///home/opam/opam-repository
# path                 ~/.opam/5.0/.opam-switch/build/ocplib-endian.1.2
# command              ~/.opam/opam-init/hooks/sandbox.sh build dune build -p ocplib-endian -j 31 @install
# exit-code            1
# env-file             ~/.opam/log/ocplib-endian-10-b71292.env
# output-file          ~/.opam/log/ocplib-endian-10-b71292.out
### output ###
# File "src/dune", line 75, characters 26-34:
# 75 |  (libraries ocplib_endian bigarray bytes))
#                                ^^^^^^^^
# Error: Library "bigarray" not found.
# -> required by library "ocplib-endian.bigstring" in _build/default/src
# -> required by _build/default/META.ocplib-endian
# -> required by _build/install/default/lib/ocplib-endian/META
# -> required by _build/default/ocplib-endian.install
# -> required by alias install


#=== ERROR while compiling calendar.2.04 ======================================#
# context              2.2.0~alpha~dev | linux/x86_64 | ocaml-variants.5.0.0+trunk | file:///home/opam/opam-repository
# path                 ~/.opam/5.0/.opam-switch/build/calendar.2.04
# command              ~/.opam/opam-init/hooks/sandbox.sh build ./configure
# exit-code            2
# env-file             ~/.opam/log/calendar-10-e7b70b.env
# output-file          ~/.opam/log/calendar-10-e7b70b.out
### output ###
# checking for ocamlc... ocamlc
# ocaml version is 5.0.0+dev0-2021-11-05: Unsupported version!



<><> Error report <><><><><><><><><><><><><><><><><><><><><><><><><><><><><><><>
+- The following actions were aborted
| - install aws               1.2
| - install aws-lwt           1.2
| - install base              v0.15.0
| - install bos               0.2.1
| - install ca-certs          0.2.2
| - install cohttp            5.0.0
| - install cohttp-lwt        5.0.0
| - install cohttp-lwt-unix   5.0.0
| - install conduit           5.1.0
| - install conduit-lwt       5.1.0
| - install conduit-lwt-unix  5.1.0
| - install ipaddr-sexp       5.3.0
| - install logs              0.7.0
| - install lwt               5.5.0
| - install mirage-crypto-ec  0.10.6
| - install mirage-crypto-pk  0.10.6
| - install mirage-crypto-rng 0.10.6
| - install parsexp           v0.15.0
| - install ppx_sexp_conv     v0.15.0
| - install sexplib           v0.15.0
| - install uri-sexp          4.2.0
| - install x509              0.16.0
+- 
+- The following actions failed
| - build calendar      2.04
| - build ocplib-endian 1.2
| - build sexplib0      v0.15.0
+- 
+- The following changes have been performed (the rest was aborted)
| - install angstrom            0.15.0
| - install asn1-combinators    0.2.6
| - install astring             0.8.5
| - install base-bytes          base
| - install base64              3.5.0
| - install bigarray-compat     1.1.0
| - install bigstringaf         0.9.0
| - install cmdliner            1.1.1
| - install conf-gmp            4
| - install conf-gmp-powm-sec   3
| - install conf-pkg-config     2
| - install cppo                1.6.8
| - install csexp               1.5.1
| - install cstruct             6.1.0
| - install digestif            1.1.2
| - install domain-name         0.4.0
| - install dune                3.1.1
| - install dune-configurator   3.1.1
| - install duration            0.2.0
| - install eqaf                0.8
| - install ezxmlm              1.1.0
| - install fmt                 0.9.0
| - install fpath               0.7.3
| - install gmap                0.3.0
| - install ipaddr              5.3.0
| - install jsonm               1.0.1
| - install macaddr             5.3.0
| - install magic-mime          1.2.0
| - install mirage-crypto       0.10.6
| - install mirage-no-solo5     1
| - install mirage-no-xen       1
| - install mmap                1.2.0
| - install mtime               1.4.0
| - install num                 1.4
| - install ocaml-compiler-libs v0.12.4
| - install ocaml-syntax-shims  1.0.0
| - install ocamlbuild          0.14.1
| - install ocamlfind           1.9.3
| - install pbkdf               1.2.0
| - install ppx_derivers        1.2.1
| - install ppxlib              0.25.0~5.00preview
| - install ptime               1.0.0
| - install re                  1.10.4
| - install result              1.5
| - install rresult             0.7.0
| - install seq                 base
| - install stdlib-shims        0.3.0
| - install stringext           1.6.0
| - install topkg               1.0.5
| - install uchar               0.0.2
| - install uri                 4.2.0
| - install uutf                1.0.3
| - install xmlm                1.4.0
| - install zarith              1.12
+- 
# Run eval $(opam env) to update the current shell environment

The former state can be restored with:
    /usr/bin/opam switch import "/home/opam/.opam/5.0/.opam-switch/backup/state-20220511231731.export"
'opam install -vy aws-lwt.1.2' failed.
"/bin/bash" "-c"
"
opam remove -y "aws-lwt.1.2"
opam install -vy "aws-lwt.1.2"
res=$?
if [ $res = 31 ]; then
    if opam show -f x-ci-accept-failures: "aws-lwt.1.2" | grep -q '"debian-unstable"'; then
        echo "This package failed and has been disabled for CI using the 'x-ci-accept-failures' field."
        exit 69
    fi
fi


exit $res
" failed with exit status 31
Failed: Build failed